FailedOk

th/SRPMS[OK]
th/x32[OK]
th/i686[OK]
th/x86_64[OK]

ac/SRPMS[OK]
ac/i386[OK]
ac/i586[OK]
ac/i686[OK]
ac/alpha[OK]
ac/amd64[OK]
ac/athlon[OK]
ac/ppc[OK]
ac/sparc[OK]
ac/sparc64[OK]

Advanced Search
main()
Powered by PLD Linux
(c) 2002-2018 PLD Team
$Revision: 1.37 $
Powered by The Bad Thing.
Your IP: 54.145.17.37

pwdutils 089111a3-eddb-445f-8438-8ab05c0e9ec5

Status:Failed
Source URL:ftp://buildlogs.pld-linux.org/th/i686/FAIL/pwdutils,089111a3-eddb-445f-8438-8ab05c0e9ec5.bz2
text/plain URL:View!
rpm -qa of builder:View!
Date:2018/09/14 21:47:02
Runtime:0:00:14.131706

Toc:

  • error 1
  • rpm: error: Failed build dependencies:
  • error 2
  • rpm: error: Failed build dependencies:
  • prep
  • Executing(%prep): /bin/sh -e /tmp/B.KuDNzz/BUILD/tmp/rpm-tmp.57512
  • build
  • Executing(%build): /bin/sh -e /tmp/B.KuDNzz/BUILD/tmp/rpm-tmp.57512
  • error 3
  • passwd_nisplus.c:28:10: fatal error: rpc/des_crypt.h: No such file or directory
  • error 4
  • compilation terminated.
  • error 5
  • make[2]: *** [Makefile:500: passwd_nisplus.o] Error 1
  • error 6
  • make[1]: *** [Makefile:446: all-recursive] Error 1
  • error 7
  • error: Bad exit status from /tmp/B.KuDNzz/BUILD/tmp/rpm-tmp.57512 (%build)
  • error 8
  • RPM build errors:
  • error 9
  • error: No files produced.

Content:

request from: arekm
checking if we should skip the build
started at: Fri Sep 14 21:46:26 2018
killing old processes on a builder
sending signal 9 to pid -1
Killed
cleaning up /tmp
fetching https://srcbuilder.pld-linux.org/th//srpms/089111a3-eddb-445f-8438-8ab05c0e9ec5/pwdutils-3.2.19-5.src.rpm
fetched 665530 bytes, 863.0 K/s
installing srpm: pwdutils-3.2.19-5.src.rpm
+ install -d /tmp/B.KuDNzz/BUILD /tmp/B.KuDNzz/RPMS
+ LC_ALL=en_US.UTF-8
+ rpm -qp --changelog pwdutils-3.2.19-5.src.rpm
* Fri Sep 14 2018 PLD Linux Team <feedback@pld-linux.org>
- For complete changelog see: http://git.pld-linux.org/?p=packages/pwdutils.git;a=log;h=master
* Fri Sep 14 2018 Arkadiusz Miƛkiewicz <arekm@maven.pl> ca1186f
- release 5 (by relup.sh) + rpm -Uhv --nodeps --define '_topdir /tmp/B.KuDNzz' --define '_specdir %{_topdir}' --define '_sourcedir %{_specdir}' --define '_rpmdir %{_topdir}/RPMS' --define '_builddir %{_topdir}/BUILD' pwdutils-3.2.19-5.src.rpm Preparing... ################################################## pwdutils ################################################## + rm -f pwdutils-3.2.19-5.src.rpm + install -m 700 -d /tmp/B.KuDNzz/BUILD/tmp + TMPDIR=/tmp/B.KuDNzz/BUILD/tmp + exec nice -n 0 rpmbuild -bp --short-circuit --nodeps --define '_topdir /tmp/B.KuDNzz' --define '_specdir %{_topdir}' --define '_sourcedir %{_specdir}' --define '_rpmdir %{_topdir}/RPMS' --define '_builddir %{_topdir}/BUILD' --target i686-pld-linux --define 'prep exit 0' /tmp/B.KuDNzz/pwdutils.spec Building target platforms: i686-pld-linux checking BuildConflict-ing packages no BuildConflicts found checking BR rpm: error: Failed build dependencies: rpm: libxcrypt-devel is needed by pwdutils-3.2.19-5.src rpm: Building target platforms: i686-pld-linux updating poldek cache... ready is up to date Retrieving th::packages.ndir.md... th is up to date Retrieving th::packages.ndir.md... th is up to date Retrieving th-ready::packages.ndir.md... th-ready is up to date Retrieving th-ready::packages.ndir.md... th-ready is up to date Retrieving th-test::packages.ndir.md... Retrieving th-test::packages.ndir.diff.toc.gz... ..............................done Retrieving diff::packages.ndir.2018.09.14-19.20.02.gz... ..............................done Retrieving diff::packages.ndir.dscr.2018.09.14-19.20.02.gz... Loading [pndir]th-test... Applying packages.ndir.2018.09.14-19.20.02.gz... Retrieving diff::packages.ndir.2018.09.14-19.36.01.gz... ..............................done Retrieving diff::packages.ndir.dscr.2018.09.14-19.36.01.gz... ..............................done Applying packages.ndir.2018.09.14-19.36.01.gz... Retrieving diff::packages.ndir.2018.09.14-19.41.01.gz... ..............................done Retrieving diff::packages.ndir.dscr.2018.09.14-19.41.01.gz... ..............................done Applying packages.ndir.2018.09.14-19.41.01.gz... Writing /root/tmp/poldek-cache-root/[...]/packages.ndir.gz... Retrieving th-test::packages.ndir.md... th-test is up to date checking conflicting packages in BRed packages poldek: Loading [pndir]ready... poldek: Loading [pndir]th-test... poldek: Loading [pndir]th-test... poldek: Loading [pndir]th-ready... poldek: Loading [pndir]th-ready... poldek: Loading [pndir]th... poldek: Loading [pndir]th... poldek: 31264 packages read poldek: Removed 4154 duplicate packages from available set poldek: Processing dependencies... poldek: There are 1 package to install: poldek: I libxcrypt-devel-3.1.1-1.i686 poldek: This operation will use 3.7KB of disk space. poldek: Need to get 5.3KB of archives (5.3KB to download). poldek: poldek: Retrieving th::libxcrypt-devel-3.1.1-1.i686.rpm... poldek: ..............................done poldek: Executing pm-command.sh --upgrade -vh --test --root / --define _check_dirname_deps 1... poldek: Preparing... ################################################## no conflicts found checking BR rpm: error: Failed build dependencies: rpm: libxcrypt-devel is needed by pwdutils-3.2.19-5.src rpm: Building target platforms: i686-pld-linux installing BR: libxcrypt\-devel + poldek --noask --caplookup -Q -v '--ignore=hhvm-*' '--ignore=php4-*' '--ignore=php52-*' '--ignore=php54-*' '--ignore=php55-*' '--ignore=php56-*' '--ignore=php70-*' '--ignore=php71-*' '--ignore=php72-*' --upgrade libxcrypt-devel Loading [pndir]ready... Loading [pndir]th-test... Loading [pndir]th-test... Loading [pndir]th-ready... Loading [pndir]th-ready... Loading [pndir]th... Loading [pndir]th... 31264 packages read Removed 4154 duplicate packages from available set Processing dependencies... There are 1 package to install: I libxcrypt-devel-3.1.1-1.i686 This operation will use 3.7KB of disk space. Need to get 5.3KB of archives. Executing pm-command.sh --upgrade -vh --root / --define _check_dirname_deps 1... Preparing... ################################################## libxcrypt-devel ################################################## building RPM using: set -ex; : build-id: 089111a3-eddb-445f-8438-8ab05c0e9ec5; TMPDIR=/tmp/B.KuDNzz/BUILD/tmp exec nice -n 0 rpmbuild -bb --define '_smp_mflags -j9' --define '_make_opts -Otarget' --define '_pld_builder 1' --define '_topdir /tmp/B.KuDNzz' --define '_specdir %{_topdir}' --define '_sourcedir %{_specdir}' --define '_rpmdir %{_topdir}/RPMS' --define '_builddir %{_topdir}/BUILD' --target i686-pld-linux /tmp/B.KuDNzz/pwdutils.spec + : build-id: 089111a3-eddb-445f-8438-8ab05c0e9ec5 + TMPDIR=/tmp/B.KuDNzz/BUILD/tmp + exec nice -n 0 rpmbuild -bb --define '_smp_mflags -j9' --define '_make_opts -Otarget' --define '_pld_builder 1' --define '_topdir /tmp/B.KuDNzz' --define '_specdir %{_topdir}' --define '_sourcedir %{_specdir}' --define '_rpmdir %{_topdir}/RPMS' --define '_builddir %{_topdir}/BUILD' --target i686-pld-linux /tmp/B.KuDNzz/pwdutils.spec Building target platforms: i686-pld-linux Executing(%prep): /bin/sh -e /tmp/B.KuDNzz/BUILD/tmp/rpm-tmp.57512 + umask 022 + cd /tmp/B.KuDNzz/BUILD + cd /tmp/B.KuDNzz/BUILD + rm -rf pwdutils-3.2.19 + /usr/bin/bzip2 -dc /tmp/B.KuDNzz/pwdutils-3.2.19.tar.bz2 + /bin/tar -xf - + STATUS=0 + '[' 0 -ne 0 ']' + cd pwdutils-3.2.19 + /bin/id -u + '[' 1001 '=' 0 ']' + /bin/id -u + '[' 1001 '=' 0 ']' + /bin/chmod -Rf a+rX,u+w,g-w,o-w . + echo 'Patch #0 (pwdutils-f-option.patch):' Patch #0 (pwdutils-f-option.patch): + '[' -f /tmp/B.KuDNzz/pwdutils-f-option.patch ']' + /bin/cat /tmp/B.KuDNzz/pwdutils-f-option.patch + /usr/bin/patch -s -p1 + echo 'Patch #1 (pwdutils-no_bash.patch):' Patch #1 (pwdutils-no_bash.patch): + '[' -f /tmp/B.KuDNzz/pwdutils-no_bash.patch ']' + /bin/cat /tmp/B.KuDNzz/pwdutils-no_bash.patch + /usr/bin/patch -s -p1 + echo 'Patch #2 (pwdutils-silent_crontab.patch):' Patch #2 (pwdutils-silent_crontab.patch): + '[' -f /tmp/B.KuDNzz/pwdutils-silent_crontab.patch ']' + /bin/cat /tmp/B.KuDNzz/pwdutils-silent_crontab.patch + /usr/bin/patch -s -p1 + echo 'Patch #3 (pwdutils-pl.po-update.patch):' Patch #3 (pwdutils-pl.po-update.patch): + '[' -f /tmp/B.KuDNzz/pwdutils-pl.po-update.patch ']' + /bin/cat /tmp/B.KuDNzz/pwdutils-pl.po-update.patch + /usr/bin/patch -s -p1 + echo 'Patch #4 (pwdutils-selinux.patch):' Patch #4 (pwdutils-selinux.patch): + '[' -f /tmp/B.KuDNzz/pwdutils-selinux.patch ']' + /bin/cat /tmp/B.KuDNzz/pwdutils-selinux.patch + /usr/bin/patch -s -p1 + echo 'Patch #5 (pwdutils-am.patch):' Patch #5 (pwdutils-am.patch): + '[' -f /tmp/B.KuDNzz/pwdutils-am.patch ']' + /bin/cat /tmp/B.KuDNzz/pwdutils-am.patch + /usr/bin/patch -s -p1 + echo 'Patch #6 (pwdutils-libc-lock.patch):' Patch #6 (pwdutils-libc-lock.patch): + '[' -f /tmp/B.KuDNzz/pwdutils-libc-lock.patch ']' + /bin/cat /tmp/B.KuDNzz/pwdutils-libc-lock.patch + /usr/bin/patch -s -p1 + echo 'Patch #7 (pwdutils-format-security.patch):' Patch #7 (pwdutils-format-security.patch): + '[' -f /tmp/B.KuDNzz/pwdutils-format-security.patch ']' + /bin/cat /tmp/B.KuDNzz/pwdutils-format-security.patch + /usr/bin/patch -s -p1 + echo 'Patch #8 (dlsym.patch):' Patch #8 (dlsym.patch): + '[' -f /tmp/B.KuDNzz/dlsym.patch ']' + /bin/cat /tmp/B.KuDNzz/dlsym.patch + /usr/bin/patch -s -p1 + /bin/rm '--interactive=never' po/stamp-po + exit 0 Executing(%build): /bin/sh -e /tmp/B.KuDNzz/BUILD/tmp/rpm-tmp.57512 TMP=/home/users/builder/tmp HOME=/home/users/builder PATH=/usr/local/bin:/usr/bin:/bin:/home/users/builder/bin TMPDIR=/tmp/B.KuDNzz/BUILD/tmp + umask 022 + cd /tmp/B.KuDNzz/BUILD + cd pwdutils-3.2.19 + grep -qs 'AM_GNU_GETTEXT.*external' configure.ac configure.in + gettextize --copy --force --no-changelog Copying file ABOUT-NLS Copying file config.rpath Not copying intl/ directory. Copying file po/Makefile.in.in Copying file po/Makevars.template Copying file po/Rules-quot Copying file po/boldquot.sed Copying file po/en@boldquot.header Copying file po/en@quot.header Copying file po/insert-header.sin Copying file po/quot.sed Copying file po/remove-potcdate.sin Copying file m4/gettext.m4 Copying file m4/iconv.m4 Copying file m4/lib-ld.m4 Copying file m4/lib-link.m4 Copying file m4/lib-prefix.m4 Copying file m4/nls.m4 Copying file m4/po.m4 Copying file m4/progtest.m4 Please update po/Makevars so that it defines all the variables mentioned in po/Makevars.template. You can then remove po/Makevars.template. Please run 'aclocal -I m4' to regenerate the aclocal.m4 file. You need aclocal from GNU automake 1.9 (or newer) to do this. Then run 'autoconf' to regenerate the configure file. You might also want to copy the convenience header file gettext.h from the /usr/share/gettext directory into your package. It is a wrapper around <libintl.h> that implements the configure --disable-nls option. + '[' ! -f po/Makevars ']' + libtoolize --copy --force --install libtoolize: putting auxiliary files in '.'. libtoolize: copying file './config.guess' libtoolize: copying file './config.sub' libtoolize: copying file './install-sh' libtoolize: copying file './ltmain.sh' libtoolize: putting macros in 'm4'. libtoolize: copying file 'm4/libtool.m4' libtoolize: copying file 'm4/ltoptions.m4' libtoolize: copying file 'm4/ltsugar.m4' libtoolize: copying file 'm4/ltversion.m4' libtoolize: copying file 'm4/lt~obsolete.m4' libtoolize: Consider adding 'AC_CONFIG_MACRO_DIRS([m4])' to configure.in, libtoolize: and rerunning libtoolize and aclocal. + aclocal -I m4 aclocal: warning: autoconf input should be named 'configure.ac', not 'configure.in' + autoconf + autoheader + automake -a -c -f --foreign automake: warning: autoconf input should be named 'configure.ac', not 'configure.in' configure.in:7: warning: AM_INIT_AUTOMAKE: two- and three-arguments forms are deprecated. For more info, see: configure.in:7: https://www.gnu.org/software/automake/manual/automake.html#Modernize-AM_005fINIT_005fAUTOMAKE-invocation configure.in:48: installing './compile' configure.in:7: installing './missing' automake: warning: autoconf input should be named 'configure.ac', not 'configure.in' lib/Makefile.am:32: warning: 'INCLUDES' is the old name for 'AM_CPPFLAGS' (or '*_CPPFLAGS') lib/Makefile.am: installing './depcomp' plugins/Makefile.am:30: warning: 'INCLUDES' is the old name for 'AM_CPPFLAGS' (or '*_CPPFLAGS') src/Makefile.am:19: warning: 'INCLUDES' is the old name for 'AM_CPPFLAGS' (or '*_CPPFLAGS') parallel-tests: installing './test-driver' + ./configure 'LDFLAGS=-Wl,--as-needed -Wl,--no-copy-dt-needed-entries -Wl,-z,relro -Wl,-z,combreloc ' 'CFLAGS=-O2 -fwrapv -pipe -Wformat -Werror=format-security -gdwarf-4 -fno-debug-types-section -fvar-tracking-assignments -g2 -Wp,-D_FORTIFY_SOURCE=2 -fstack-protector-strong --param=ssp-buffer-size=4 -fomit-frame-pointer -march=i686 -fasynchronous-unwind-tables -mtune=pentium4 -gdwarf-4 -fno-debug-types-section -fvar-tracking-assignments -g2 ' 'CXXFLAGS=-O2 -fwrapv -pipe -Wformat -Werror=format-security -gdwarf-4 -fno-debug-types-section -fvar-tracking-assignments -g2 -Wp,-D_FORTIFY_SOURCE=2 -fstack-protector-strong --param=ssp-buffer-size=4 -fomit-frame-pointer -march=i686 -fasynchronous-unwind-tables -mtune=pentium4 -gdwarf-4 -fno-debug-types-section -fvar-tracking-assignments -g2 ' 'FFLAGS=-O2 -fwrapv -pipe -Wformat -Werror=format-security -gdwarf-4 -fno-debug-types-section -fvar-tracking-assignments -g2 -Wp,-D_FORTIFY_SOURCE=2 -fstack-protector-strong --param=ssp-buffer-size=4 -fomit-frame-pointer -march=i686 -fasynchronous-unwind-tables -mtune=pentium4 -gdwarf-4 -fno-debug-types-section -fvar-tracking-assignments -g2 ' 'FCFLAGS=-O2 -fwrapv -pipe -Wformat -Werror=format-security -gdwarf-4 -fno-debug-types-section -fvar-tracking-assignments -g2 -Wp,-D_FORTIFY_SOURCE=2 -fstack-protector-strong --param=ssp-buffer-size=4 -fomit-frame-pointer -march=i686 -fasynchronous-unwind-tables -mtune=pentium4 -gdwarf-4 -fno-debug-types-section -fvar-tracking-assignments -g2 ' 'CPPFLAGS=' 'CC=i686-pld-linux-gcc' 'CXX=i686-pld-linux-g++' '--host=i686-pld-linux' '--build=i686-pld-linux' '--prefix=/usr' '--exec-prefix=/usr' '--bindir=/usr/bin' '--sbindir=/usr/sbin' '--sysconfdir=/etc' '--datadir=/usr/share' '--includedir=/usr/include' '--libdir=/lib' '--libexecdir=/usr/libexec' '--localstatedir=/var' '--sharedstatedir=/var/lib' '--mandir=/usr/share/man' '--infodir=/usr/share/info' '--x-libraries=/lib' 'ac_cv_header_bioapi_h=no' 'ac_cv_lib_bioapi100_BioAPI_Init=no' --enable-audit-plugin --disable-gnutls --enable-ldap --enable-nls --enable-pam_rpasswd --enable-selinux --enable-slp --disable-rpath configure: WARNING: unrecognized options: --disable-gnutls checking for a BSD-compatible install... /usr/bin/install -c checking whether build environment is sane... yes checking for a thread-safe mkdir -p... /bin/mkdir -p checking for mawk... mawk checking whether make sets $(MAKE)... yes checking whether make supports nested variables... yes checking build system type... i686-pld-linux-gnu checking host system type... i686-pld-linux-gnu checking for i686-pld-linux-gcc... i686-pld-linux-gcc checking whether the C compiler works... yes checking for C compiler default output file name... a.out checking for suffix of executables... checking whether we are cross compiling... no checking for suffix of object files... o checking whether we are using the GNU C compiler... yes checking whether i686-pld-linux-gcc accepts -g... yes checking for i686-pld-linux-gcc option to accept ISO C89... none needed checking whether i686-pld-linux-gcc understands -c and -o together... yes checking whether make supports the include directive... yes (GNU style) checking dependency style of i686-pld-linux-gcc... gcc3 checking how to run the C preprocessor... i686-pld-linux-gcc -E checking for grep that handles long lines and -e... /bin/grep checking for egrep... /bin/grep -E checking for ANSI C header files... yes checking for sys/types.h... yes checking for sys/stat.h... yes checking for stdlib.h... yes checking for string.h... yes checking for memory.h... yes checking for strings.h... yes checking for inttypes.h... yes checking for stdint.h... yes checking for unistd.h... yes checking minix/config.h usability... no checking minix/config.h presence... no checking for minix/config.h... no checking whether it is safe to define __EXTENSIONS__... yes checking for strerror in -lcposix... no checking whether make sets $(MAKE)... (cached) yes checking how to print strings... print -r checking for a sed that does not truncate output... /bin/sed checking for fgrep... /bin/grep -F checking for ld used by i686-pld-linux-gcc... /usr/bin/ld checking if the linker (/usr/bin/ld) is GNU ld... yes checking for BSD- or MS-compatible name lister (nm)... /usr/bin/nm -B checking the name lister (/usr/bin/nm -B) interface... BSD nm checking whether ln -s works... yes checking the maximum length of command line arguments... 1572864 checking how to convert i686-pld-linux-gnu file names to i686-pld-linux-gnu format... func_convert_file_noop checking how to convert i686-pld-linux-gnu file names to toolchain format... func_convert_file_noop checking for /usr/bin/ld option to reload object files... -r checking for i686-pld-linux-objdump... no checking for objdump... objdump checking how to recognize dependent libraries... pass_all checking for i686-pld-linux-dlltool... no checking for dlltool... no checking how to associate runtime and link libraries... print -r -- checking for i686-pld-linux-ar... no checking for ar... ar checking for archiver @FILE support... @ checking for i686-pld-linux-strip... no checking for strip... strip checking for i686-pld-linux-ranlib... no checking for ranlib... ranlib checking command to parse /usr/bin/nm -B output from i686-pld-linux-gcc object... ok checking for sysroot... no checking for a working dd... /bin/dd checking how to truncate binary pipes... /bin/dd bs=4096 count=1 checking for i686-pld-linux-mt... no checking for mt... no checking if : is a manifest tool... no checking for dlfcn.h... yes checking for objdir... .libs checking if i686-pld-linux-gcc supports -fno-rtti -fno-exceptions... no checking for i686-pld-linux-gcc option to produce PIC... -fPIC -DPIC checking if i686-pld-linux-gcc PIC flag -fPIC -DPIC works... yes checking if i686-pld-linux-gcc static flag -static works... yes checking if i686-pld-linux-gcc supports -c -o file.o... yes checking if i686-pld-linux-gcc supports -c -o file.o... (cached) yes checking whether the i686-pld-linux-gcc linker (/usr/bin/ld) supports shared libraries... yes checking whether -lc should be explicitly linked in... no checking dynamic linker characteristics... GNU/Linux ld.so checking how to hardcode library paths into programs... immediate checking whether stripping libraries is possible... yes checking if libtool supports shared libraries... yes checking whether to build shared libraries... yes checking whether to build static libraries... yes checking for special C compiler options needed for large files... no checking for _FILE_OFFSET_BITS value needed for large files... 64 checking for -fpie... yes checking if malloc debugging is wanted... no checking for is_selinux_enabled in -lselinux... yes checking slp.h usability... yes checking slp.h presence... yes checking for slp.h... yes checking for SLPReg in -lslp... yes checking laus.h usability... no checking laus.h presence... no checking for laus.h... no checking libaudit.h usability... yes checking libaudit.h presence... yes checking for libaudit.h... yes checking for audit_open in -laudit... yes checking for dlopen in -ldl... yes checking for pam_start in -lpam... yes checking for main in -lpam_misc... yes checking for yp_get_default_domain in -lnsl... yes checking for library containing crypt... -lxcrypt checking xcrypt.h usability... yes checking xcrypt.h presence... yes checking for xcrypt.h... yes checking for crypt... yes checking for crypt_r... yes checking for xcrypt_gensalt_r... yes checking sys/xattr.h usability... yes checking sys/xattr.h presence... yes checking for sys/xattr.h... yes checking for llistxattr... yes checking for lgetxattr... yes checking for lsetxattr... yes checking for getline... yes checking for string.h... (cached) yes checking for working getline function... yes checking for getline... (cached) yes checking for SSL_connect in -lssl... yes checking lber.h usability... yes checking lber.h presence... yes checking for lber.h... yes checking ldap.h usability... yes checking ldap.h presence... yes checking for ldap.h... yes checking ldap_ssl.h usability... no checking ldap_ssl.h presence... no checking for ldap_ssl.h... no checking for main in -llber... yes checking for main in -lldap... yes checking for ldap_init... yes checking for ldap_get_lderrno... no checking for ldap_parse_result... yes checking for ldap_memfree... yes checking for ldap_controls_free... yes checking for ldap_set_option... yes checking for ldap_get_option... yes checking for ldapssl_init... no checking for ldap_start_tls_s... yes checking for ldap_pvt_tls_set_option... yes checking for ldap_initialize... yes checking for ldap_set_rebind_proc... yes checking whether ldap_set_rebind_proc takes 3 arguments... 3 checking libnscd.h usability... yes checking libnscd.h presence... yes checking for libnscd.h... yes checking for nscd_flush_cache in -lnscd... yes checking for nscd_flush_cache... yes checking whether NLS is requested... yes checking for msgfmt... /usr/bin/msgfmt checking for gmsgfmt... /usr/bin/msgfmt checking for xgettext... /usr/bin/xgettext checking for msgmerge... /usr/bin/msgmerge checking for ld used by i686-pld-linux-gcc... /usr/bin/ld checking if the linker (/usr/bin/ld) is GNU ld... yes checking for shared library run path origin... done checking for CFPreferencesCopyAppValue... no checking for CFLocaleCopyCurrent... no checking for GNU gettext in libc... yes checking whether to use NLS... yes checking where the gettext function comes from... libc checking dirent.h usability... yes checking dirent.h presence... yes checking for dirent.h... yes checking for getusershell... yes checking for strftime... yes checking for bioapi.h... (cached) no checking bioapi_util.h usability... no checking bioapi_util.h presence... no checking for bioapi_util.h... no checking for BioAPI_Init in -lbioapi100... (cached) no checking that generated files are newer than configure... done configure: creating ./config.status config.status: creating Makefile config.status: creating etc/Makefile config.status: creating lib/Makefile config.status: creating src/Makefile config.status: creating plugins/Makefile config.status: creating po/Makefile.in config.status: creating m4/Makefile config.status: creating config.h config.status: executing depfiles commands config.status: executing libtool commands config.status: executing po-directories commands config.status: creating po/POTFILES config.status: creating po/Makefile configure: WARNING: unrecognized options: --disable-gnutls + /usr/bin/make -Otarget -j9 /usr/bin/make all-recursive Making all in m4 make[2]: Nothing to be done for 'all'. Making all in etc make[2]: Nothing to be done for 'all'. Making all in lib make[2]: Entering directory '/tmp/B.KuDNzz/BUILD/pwdutils-3.2.19/lib' i686-pld-linux-gcc -DHAVE_CONFIG_H -I. -I.. -DLOCALEDIR=\"/usr/share/locale\" -DPLUGINDIR=\"/lib/pwdutils\" -fPIC -W -Wall -Wbad-function-cast -Wcast-align -Wcast-qual -Winline -Wmissing-declarations -Wmissing-prototypes -Wnested-externs -Wshadow -Wstrict-prototypes -Wundef -Wpointer-arith -O2 -fwrapv -pipe -Wformat -Werror=format-security -gdwarf-4 -fno-debug-types-section -fvar-tracking-assignments -g2 -Wp,-D_FORTIFY_SOURCE=2 -fstack-protector-strong --param=ssp-buffer-size=4 -fomit-frame-pointer -march=i686 -fasynchronous-unwind-tables -mtune=pentium4 -gdwarf-4 -fno-debug-types-section -fvar-tracking-assignments -g2 -MT passwd_nisplus.o -MD -MP -MF .deps/passwd_nisplus.Tpo -c -o passwd_nisplus.o passwd_nisplus.c passwd_nisplus.c:28:10: fatal error: rpc/des_crypt.h: No such file or directory #include <rpc/des_crypt.h> ^~~~~~~~~~~~~~~~~ compilation terminated. make[2]: *** [Makefile:500: passwd_nisplus.o] Error 1 make[2]: Leaving directory '/tmp/B.KuDNzz/BUILD/pwdutils-3.2.19/lib' make[2]: *** Waiting for unfinished jobs.... make[2]: Entering directory '/tmp/B.KuDNzz/BUILD/pwdutils-3.2.19/lib' i686-pld-linux-gcc -DHAVE_CONFIG_H -I. -I.. -DLOCALEDIR=\"/usr/share/locale\" -DPLUGINDIR=\"/lib/pwdutils\" -fPIC -W -Wall -Wbad-function-cast -Wcast-align -Wcast-qual -Winline -Wmissing-declarations -Wmissing-prototypes -Wnested-externs -Wshadow -Wstrict-prototypes -Wundef -Wpointer-arith -O2 -fwrapv -pipe -Wformat -Werror=format-security -gdwarf-4 -fno-debug-types-section -fvar-tracking-assignments -g2 -Wp,-D_FORTIFY_SOURCE=2 -fstack-protector-strong --param=ssp-buffer-size=4 -fomit-frame-pointer -march=i686 -fasynchronous-unwind-tables -mtune=pentium4 -gdwarf-4 -fno-debug-types-section -fvar-tracking-assignments -g2 -MT yppasswd_xdr.o -MD -MP -MF .deps/yppasswd_xdr.Tpo -c -o yppasswd_xdr.o yppasswd_xdr.c mv -f .deps/yppasswd_xdr.Tpo .deps/yppasswd_xdr.Po make[2]: Leaving directory '/tmp/B.KuDNzz/BUILD/pwdutils-3.2.19/lib' make[2]: Entering directory '/tmp/B.KuDNzz/BUILD/pwdutils-3.2.19/lib' i686-pld-linux-gcc -DHAVE_CONFIG_H -I. -I.. -DLOCALEDIR=\"/usr/share/locale\" -DPLUGINDIR=\"/lib/pwdutils\" -fPIC -W -Wall -Wbad-function-cast -Wcast-align -Wcast-qual -Winline -Wmissing-declarations -Wmissing-prototypes -Wnested-externs -Wshadow -Wstrict-prototypes -Wundef -Wpointer-arith -O2 -fwrapv -pipe -Wformat -Werror=format-security -gdwarf-4 -fno-debug-types-section -fvar-tracking-assignments -g2 -Wp,-D_FORTIFY_SOURCE=2 -fstack-protector-strong --param=ssp-buffer-size=4 -fomit-frame-pointer -march=i686 -fasynchronous-unwind-tables -mtune=pentium4 -gdwarf-4 -fno-debug-types-section -fvar-tracking-assignments -g2 -MT get_value.o -MD -MP -MF .deps/get_value.Tpo -c -o get_value.o get_value.c mv -f .deps/get_value.Tpo .deps/get_value.Po make[2]: Leaving directory '/tmp/B.KuDNzz/BUILD/pwdutils-3.2.19/lib' make[2]: Entering directory '/tmp/B.KuDNzz/BUILD/pwdutils-3.2.19/lib' i686-pld-linux-gcc -DHAVE_CONFIG_H -I. -I.. -DLOCALEDIR=\"/usr/share/locale\" -DPLUGINDIR=\"/lib/pwdutils\" -fPIC -W -Wall -Wbad-function-cast -Wcast-align -Wcast-qual -Winline -Wmissing-declarations -Wmissing-prototypes -Wnested-externs -Wshadow -Wstrict-prototypes -Wundef -Wpointer-arith -O2 -fwrapv -pipe -Wformat -Werror=format-security -gdwarf-4 -fno-debug-types-section -fvar-tracking-assignments -g2 -Wp,-D_FORTIFY_SOURCE=2 -fstack-protector-strong --param=ssp-buffer-size=4 -fomit-frame-pointer -march=i686 -fasynchronous-unwind-tables -mtune=pentium4 -gdwarf-4 -fno-debug-types-section -fvar-tracking-assignments -g2 -MT authentication.o -MD -MP -MF .deps/authentication.Tpo -c -o authentication.o authentication.c mv -f .deps/authentication.Tpo .deps/authentication.Po make[2]: Leaving directory '/tmp/B.KuDNzz/BUILD/pwdutils-3.2.19/lib' make[2]: Entering directory '/tmp/B.KuDNzz/BUILD/pwdutils-3.2.19/lib' i686-pld-linux-gcc -DHAVE_CONFIG_H -I. -I.. -DLOCALEDIR=\"/usr/share/locale\" -DPLUGINDIR=\"/lib/pwdutils\" -fPIC -W -Wall -Wbad-function-cast -Wcast-align -Wcast-qual -Winline -Wmissing-declarations -Wmissing-prototypes -Wnested-externs -Wshadow -Wstrict-prototypes -Wundef -Wpointer-arith -O2 -fwrapv -pipe -Wformat -Werror=format-security -gdwarf-4 -fno-debug-types-section -fvar-tracking-assignments -g2 -Wp,-D_FORTIFY_SOURCE=2 -fstack-protector-strong --param=ssp-buffer-size=4 -fomit-frame-pointer -march=i686 -fasynchronous-unwind-tables -mtune=pentium4 -gdwarf-4 -fno-debug-types-section -fvar-tracking-assignments -g2 -MT nsw.o -MD -MP -MF .deps/nsw.Tpo -c -o nsw.o nsw.c mv -f .deps/nsw.Tpo .deps/nsw.Po make[2]: Leaving directory '/tmp/B.KuDNzz/BUILD/pwdutils-3.2.19/lib' make[2]: Entering directory '/tmp/B.KuDNzz/BUILD/pwdutils-3.2.19/lib' i686-pld-linux-gcc -DHAVE_CONFIG_H -I. -I.. -DLOCALEDIR=\"/usr/share/locale\" -DPLUGINDIR=\"/lib/pwdutils\" -fPIC -W -Wall -Wbad-function-cast -Wcast-align -Wcast-qual -Winline -Wmissing-declarations -Wmissing-prototypes -Wnested-externs -Wshadow -Wstrict-prototypes -Wundef -Wpointer-arith -O2 -fwrapv -pipe -Wformat -Werror=format-security -gdwarf-4 -fno-debug-types-section -fvar-tracking-assignments -g2 -Wp,-D_FORTIFY_SOURCE=2 -fstack-protector-strong --param=ssp-buffer-size=4 -fomit-frame-pointer -march=i686 -fasynchronous-unwind-tables -mtune=pentium4 -gdwarf-4 -fno-debug-types-section -fvar-tracking-assignments -g2 -MT logindefs.o -MD -MP -MF .deps/logindefs.Tpo -c -o logindefs.o logindefs.c mv -f .deps/logindefs.Tpo .deps/logindefs.Po make[2]: Leaving directory '/tmp/B.KuDNzz/BUILD/pwdutils-3.2.19/lib' make[2]: Entering directory '/tmp/B.KuDNzz/BUILD/pwdutils-3.2.19/lib' i686-pld-linux-gcc -DHAVE_CONFIG_H -I. -I.. -DLOCALEDIR=\"/usr/share/locale\" -DPLUGINDIR=\"/lib/pwdutils\" -fPIC -W -Wall -Wbad-function-cast -Wcast-align -Wcast-qual -Winline -Wmissing-declarations -Wmissing-prototypes -Wnested-externs -Wshadow -Wstrict-prototypes -Wundef -Wpointer-arith -O2 -fwrapv -pipe -Wformat -Werror=format-security -gdwarf-4 -fno-debug-types-section -fvar-tracking-assignments -g2 -Wp,-D_FORTIFY_SOURCE=2 -fstack-protector-strong --param=ssp-buffer-size=4 -fomit-frame-pointer -march=i686 -fasynchronous-unwind-tables -mtune=pentium4 -gdwarf-4 -fno-debug-types-section -fvar-tracking-assignments -g2 -MT read-files.o -MD -MP -MF .deps/read-files.Tpo -c -o read-files.o read-files.c mv -f .deps/read-files.Tpo .deps/read-files.Po make[2]: Leaving directory '/tmp/B.KuDNzz/BUILD/pwdutils-3.2.19/lib' make[2]: Entering directory '/tmp/B.KuDNzz/BUILD/pwdutils-3.2.19/lib' i686-pld-linux-gcc -DHAVE_CONFIG_H -I. -I.. -DLOCALEDIR=\"/usr/share/locale\" -DPLUGINDIR=\"/lib/pwdutils\" -fPIC -W -Wall -Wbad-function-cast -Wcast-align -Wcast-qual -Winline -Wmissing-declarations -Wmissing-prototypes -Wnested-externs -Wshadow -Wstrict-prototypes -Wundef -Wpointer-arith -O2 -fwrapv -pipe -Wformat -Werror=format-security -gdwarf-4 -fno-debug-types-section -fvar-tracking-assignments -g2 -Wp,-D_FORTIFY_SOURCE=2 -fstack-protector-strong --param=ssp-buffer-size=4 -fomit-frame-pointer -march=i686 -fasynchronous-unwind-tables -mtune=pentium4 -gdwarf-4 -fno-debug-types-section -fvar-tracking-assignments -g2 -MT user.o -MD -MP -MF .deps/user.Tpo -c -o user.o user.c mv -f .deps/user.Tpo .deps/user.Po make[2]: Leaving directory '/tmp/B.KuDNzz/BUILD/pwdutils-3.2.19/lib' make[2]: Entering directory '/tmp/B.KuDNzz/BUILD/pwdutils-3.2.19/lib' i686-pld-linux-gcc -DHAVE_CONFIG_H -I. -I.. -DLOCALEDIR=\"/usr/share/locale\" -DPLUGINDIR=\"/lib/pwdutils\" -fPIC -W -Wall -Wbad-function-cast -Wcast-align -Wcast-qual -Winline -Wmissing-declarations -Wmissing-prototypes -Wnested-externs -Wshadow -Wstrict-prototypes -Wundef -Wpointer-arith -O2 -fwrapv -pipe -Wformat -Werror=format-security -gdwarf-4 -fno-debug-types-section -fvar-tracking-assignments -g2 -Wp,-D_FORTIFY_SOURCE=2 -fstack-protector-strong --param=ssp-buffer-size=4 -fomit-frame-pointer -march=i686 -fasynchronous-unwind-tables -mtune=pentium4 -gdwarf-4 -fno-debug-types-section -fvar-tracking-assignments -g2 -MT libldap.o -MD -MP -MF .deps/libldap.Tpo -c -o libldap.o libldap.c mv -f .deps/libldap.Tpo .deps/libldap.Po make[2]: Leaving directory '/tmp/B.KuDNzz/BUILD/pwdutils-3.2.19/lib' make[1]: *** [Makefile:446: all-recursive] Error 1 make: *** [Makefile:378: all] Error 2 error: Bad exit status from /tmp/B.KuDNzz/BUILD/tmp/rpm-tmp.57512 (%build) RPM build errors: Bad exit status from /tmp/B.KuDNzz/BUILD/tmp/rpm-tmp.57512 (%build) ended at: Fri Sep 14 21:47:01 2018, done in 0:00:14.131706 error: No files produced. + chmod -R u+rwX /tmp/B.KuDNzz/BUILD + rm -rf /tmp/B.KuDNzz/tmp /tmp/B.KuDNzz/BUILD + rm -rf /tmp/B.KuDNzz Begin-PLD-Builder-Info Build-Time: user:20.71s sys:3.32s real:35.59s (faults io:0 non-io:968692) End-PLD-Builder-Info
[Back to list of logs] [View rpm -qa of builder]