FailedOk

th/SRPMS[OK]
th/x32[OK]
th/i686[OK]
th/x86_64[OK]

ac/SRPMS[OK]
ac/i386[OK]
ac/i586[OK]
ac/i686[OK]
ac/alpha[OK]
ac/amd64[OK]
ac/athlon[OK]
ac/ppc[OK]
ac/sparc[OK]
ac/sparc64[OK]

Advanced Search
main()
Powered by PLD Linux
(c) 2002-2018 PLD Team
$Revision: 1.37 $
Powered by nasi tu byli.
Your IP: 54.163.20.57

python 4206e6ed-c4d8-42ed-bfc8-67270861b0c8

Status:Failed
Source URL:ftp://buildlogs.pld-linux.org/th/i686/FAIL/python,4206e6ed-c4d8-42ed-bfc8-67270861b0c8.bz2
text/plain URL:View!
full text:View!
rpm -qa of builder:View!
Date:2018/09/14 07:31:35
Runtime:0:19:55.272551

Toc:

  • error 1
  • error: [Errno 104] Connection reset by peer
  • error 2
  • SSLError: [SSL: TLSV1_ALERT_UNKNOWN_CA] tlsv1 alert unknown ca (_ssl.c:726)
  • error 3
  • error: [Errno 104] Connection reset by peer
  • error 4
  • ERROR: test_tls1_3 (test.test_ssl.ThreadedTests)
  • error 5
  • AttributeError: __exit__
  • error 6
  • FAIL: test_options (test.test_ssl.ContextTests)
  • error 7
  • AssertionError: -2113798060 != -2112749484L
  • error 8
  • FAIL: test_default_ciphers (test.test_ssl.ThreadedTests)
  • error 9
  • AssertionError: SSLError not raised
  • error 10
  • FAIL: test_default_ecdh_curve (test.test_ssl.ThreadedTests)
  • error 11
  • AssertionError: 'ECDH' not found in 'TLS_AES_256_GCM_SHA384'
  • error 12
  • SSLError: [SSL: TLSV1_ALERT_UNKNOWN_CA] tlsv1 alert unknown ca (_ssl.c:726)
  • error 13
  • error: [Errno 104] Connection reset by peer
  • error 14
  • ERROR: test_tls1_3 (test.test_ssl.ThreadedTests)
  • error 15
  • AttributeError: __exit__
  • error 16
  • FAIL: test_options (test.test_ssl.ContextTests)
  • error 17
  • AssertionError: -2113798060 != -2112749484L
  • error 18
  • FAIL: test_default_ciphers (test.test_ssl.ThreadedTests)
  • error 19
  • AssertionError: SSLError not raised
  • error 20
  • FAIL: test_default_ecdh_curve (test.test_ssl.ThreadedTests)
  • error 21
  • AssertionError: 'ECDH' not found in 'TLS_AES_256_GCM_SHA384'
  • error 22
  • error: Bad exit status from /tmp/B.nglcTi/BUILD/tmp/rpm-tmp.50282 (%build)
  • error 23
  • RPM build errors:
  • error 24
  • error: No files produced.

Content:

0:00:27 load avg: 1.34 [ 92/391] test_cpickle
0:00:30 load avg: 1.34 [ 93/391] test_cprofile
0:00:30 load avg: 1.34 [ 94/391] test_crypt
0:00:30 load avg: 1.34 [ 95/391] test_csv
0:00:30 load avg: 1.34 [ 96/391] test_ctypes
0:00:31 load avg: 1.31 [ 97/391] test_curses
test_curses skipped -- Use of the `curses' resource not enabled
0:00:31 load avg: 1.31 [ 98/391] test_datetime -- test_curses skipped (resource denied)
0:00:32 load avg: 1.31 [ 99/391] test_dbm
0:00:32 load avg: 1.31 [100/391] test_decimal
0:00:34 load avg: 1.31 [101/391] test_decorators
0:00:34 load avg: 1.31 [102/391] test_defaultdict
0:00:34 load avg: 1.31 [103/391] test_deque
0:00:37 load avg: 1.29 [104/391] test_descr
0:00:39 load avg: 1.29 [105/391] test_descrtut
0:00:39 load avg: 1.29 [106/391] test_dictcomps
0:00:39 load avg: 1.29 [107/391] test_dictviews
0:00:39 load avg: 1.29 [108/391] test_difflib
0:00:40 load avg: 1.29 [109/391] test_dircache
0:00:41 load avg: 1.18 [110/391] test_dis
0:00:41 load avg: 1.18 [111/391] test_dl
0:00:41 load avg: 1.18 [112/391] test_docxmlrpc
0:00:45 load avg: 1.18 [113/391] test_dumbdbm
0:00:45 load avg: 1.18 [114/391] test_dummy_thread
0:00:45 load avg: 1.18 [115/391] test_dummy_threading
0:00:45 load avg: 1.18 [116/391] test_email
0:00:49 load avg: 1.17 [117/391] test_email_codecs
0:00:49 load avg: 1.17 [118/391] test_email_renamed
0:00:49 load avg: 1.17 [119/391] test_ensurepip
0:00:49 load avg: 1.17 [120/391] test_enumerate
0:00:49 load avg: 1.17 [121/391] test_eof
0:00:49 load avg: 1.17 [122/391] test_epoll
0:00:52 load avg: 1.08 [123/391] test_errno
0:00:52 load avg: 1.08 [124/391] test_exception_variations
0:00:52 load avg: 1.08 [125/391] test_extcall
0:00:52 load avg: 1.08 [126/391] test_fcntl
0:00:52 load avg: 1.08 [127/391] test_file
0:00:52 load avg: 1.08 [128/391] test_file2k
0:00:59 load avg: 1.07 [129/391] test_file_eintr
0:01:00 load avg: 1.07 [130/391] test_filecmp
0:01:00 load avg: 1.06 [131/391] test_fileinput
0:01:01 load avg: 1.06 [132/391] test_fileio
0:01:01 load avg: 1.06 [133/391] test_float
0:01:01 load avg: 1.06 [134/391] test_fnmatch
0:01:01 load avg: 1.06 [135/391] test_fork1
0:01:08 load avg: 1.14 [136/391] test_format
0:01:08 load avg: 1.14 [137/391] test_fpformat
0:01:08 load avg: 1.14 [138/391] test_fractions
0:01:09 load avg: 1.14 [139/391] test_frozen
0:01:09 load avg: 1.14 [140/391] test_ftplib
0:01:12 load avg: 1.05 [141/391] test_funcattrs
0:01:12 load avg: 1.05 [142/391] test_functools
0:01:12 load avg: 1.05 [143/391] test_future
0:01:12 load avg: 1.05 [144/391] test_future3
0:01:12 load avg: 1.05 [145/391] test_future4
0:01:13 load avg: 1.05 [146/391] test_future5
0:01:13 load avg: 1.05 [147/391] test_future_builtins
0:01:13 load avg: 1.05 [148/391] test_gc
0:01:17 load avg: 1.04 [149/391] test_gdbm
0:01:17 load avg: 1.04 [150/391] test_generators
0:01:17 load avg: 1.04 [151/391] test_genericpath
0:01:17 load avg: 1.04 [152/391] test_genexps
0:01:17 load avg: 1.04 [153/391] test_getargs
0:01:17 load avg: 1.04 [154/391] test_getargs2
0:01:17 load avg: 1.04 [155/391] test_getopt
0:01:17 load avg: 1.04 [156/391] test_gettext
0:01:18 load avg: 1.04 [157/391] test_gl
test_gl skipped -- No module named gl
0:01:18 load avg: 1.04 [158/391] test_glob -- test_gl skipped
0:01:18 load avg: 1.04 [159/391] test_global
0:01:18 load avg: 1.04 [160/391] test_grp
0:01:18 load avg: 1.04 [161/391] test_gzip
0:01:18 load avg: 1.04 [162/391] test_hash
0:01:19 load avg: 1.04 [163/391] test_hashlib
0:01:19 load avg: 1.04 [164/391] test_heapq
0:01:20 load avg: 1.04 [165/391] test_hmac
0:01:20 load avg: 1.04 [166/391] test_hotshot
0:01:20 load avg: 1.04 [167/391] test_htmllib
0:01:20 load avg: 1.04 [168/391] test_htmlparser
0:01:20 load avg: 1.04 [169/391] test_httplib
Traceback (most recent call last):
  File "/tmp/B.nglcTi/BUILD/Python-2.7.15/Lib/SocketServer.py", line 290, in _handle_request_noblock
    self.process_request(request, client_address)
  File "/tmp/B.nglcTi/BUILD/Python-2.7.15/Lib/SocketServer.py", line 318, in process_request
    self.finish_request(request, client_address)
  File "/tmp/B.nglcTi/BUILD/Python-2.7.15/Lib/SocketServer.py", line 331, in finish_request
    self.RequestHandlerClass(request, client_address, self)
  File "/tmp/B.nglcTi/BUILD/Python-2.7.15/Lib/SocketServer.py", line 652, in __init__
    self.handle()
  File "/tmp/B.nglcTi/BUILD/Python-2.7.15/Lib/BaseHTTPServer.py", line 340, in handle
    self.handle_one_request()
  File "/tmp/B.nglcTi/BUILD/Python-2.7.15/Lib/BaseHTTPServer.py", line 310, in handle_one_request
    self.raw_requestline = self.rfile.readline(65537)
  File "/tmp/B.nglcTi/BUILD/Python-2.7.15/Lib/socket.py", line 480, in readline
    data = self._sock.recv(self._rbufsize)
  File "/tmp/B.nglcTi/BUILD/Python-2.7.15/Lib/ssl.py", line 772, in recv
    return self.read(buflen)
  File "/tmp/B.nglcTi/BUILD/Python-2.7.15/Lib/ssl.py", line 659, in read
    v = self._sslobj.read(len)
error: [Errno 104] Connection reset by peer
test test_httplib produced unexpected output:
**********************************************************************
----------------------------------------
Exception happened during processing of request from ('127.0.0.1', 46844)
----------------------------------------

**********************************************************************
0:01:21 load avg: 1.04 [170/391/1] test_httpservers -- test_httplib failed
0:01:24 load avg: 1.04 [171/391/1] test_idle
0:01:25 load avg: 1.04 [172/391/1] test_imageop
0:01:25 load avg: 1.04 [173/391/1] test_imaplib
0:01:25 load avg: 1.04 [174/391/1] test_imgfile
test_imgfile skipped -- No module named imgfile
0:01:25 load avg: 1.04 [175/391/1] test_imghdr -- test_imgfile skipped
0:01:25 load avg: 1.04 [176/391/1] test_imp
0:01:25 load avg: 1.04 [177/391/1] test_import
0:01:26 load avg: 1.04 [178/391/1] test_import_magic
0:01:26 load avg: 1.04 [179/391/1] test_importhooks
0:01:26 load avg: 1.04 [180/391/1] test_importlib
0:01:26 load avg: 1.04 [181/391/1] test_index
0:01:26 load avg: 1.04 [182/391/1] test_inspect
0:01:26 load avg: 1.04 [183/391/1] test_int
0:01:27 load avg: 1.04 [184/391/1] test_int_literal
0:01:27 load avg: 1.04 [185/391/1] test_io
0:02:06 load avg: 0.88 [186/391/1] test_ioctl -- test_io passed in 38 sec
test_ioctl skipped -- Unable to open /dev/tty
0:02:06 load avg: 0.88 [187/391/1] test_isinstance -- test_ioctl skipped
0:02:06 load avg: 0.88 [188/391/1] test_iter
0:02:06 load avg: 0.88 [189/391/1] test_iterlen
0:02:06 load avg: 0.88 [190/391/1] test_itertools
0:02:11 load avg: 0.89 [191/391/1] test_json
0:02:13 load avg: 0.89 [192/391/1] test_kqueue
test_kqueue skipped -- test works only on BSD
0:02:13 load avg: 0.89 [193/391/1] test_largefile -- test_kqueue skipped
0:02:14 load avg: 0.89 [194/391/1] test_lib2to3
0:02:35 load avg: 0.99 [195/391/1] test_linecache
0:02:35 load avg: 0.99 [196/391/1] test_linuxaudiodev
test_linuxaudiodev skipped -- Use of the `audio' resource not enabled
0:02:35 load avg: 0.99 [197/391/1] test_list -- test_linuxaudiodev skipped (resource denied)
0:02:35 load avg: 0.99 [198/391/1] test_logging
0:02:46 load avg: 0.90 [199/391/1] test_long
0:02:48 load avg: 0.90 [200/391/1] test_long_future
0:02:51 load avg: 0.91 [201/391/1] test_longexp
0:02:51 load avg: 0.91 [202/391/1] test_macos
test_macos skipped -- No module named MacOS
0:02:51 load avg: 0.91 [203/391/1] test_macostools -- test_macos skipped
test_macostools skipped -- No module named MacOS
0:02:51 load avg: 0.91 [204/391/1] test_macpath -- test_macostools skipped
0:02:52 load avg: 0.91 [205/391/1] test_macurl2path
0:02:52 load avg: 0.91 [206/391/1] test_mailbox
0:02:54 load avg: 0.91 [207/391/1] test_marshal
0:02:55 load avg: 0.91 [208/391/1] test_math
0:02:55 load avg: 0.91 [209/391/1] test_md5
0:02:55 load avg: 0.91 [210/391/1] test_memoryio
0:02:55 load avg: 0.91 [211/391/1] test_memoryview
0:02:55 load avg: 0.91 [212/391/1] test_mhlib
0:02:56 load avg: 0.92 [213/391/1] test_mimetools
0:02:56 load avg: 0.92 [214/391/1] test_mimetypes
0:02:56 load avg: 0.92 [215/391/1] test_minidom
0:02:56 load avg: 0.92 [216/391/1] test_mmap
0:02:56 load avg: 0.92 [217/391/1] test_module
0:02:57 load avg: 0.92 [218/391/1] test_modulefinder
0:02:57 load avg: 0.92 [219/391/1] test_msilib
test_msilib skipped -- No module named _msi
0:02:57 load avg: 0.92 [220/391/1] test_multibytecodec -- test_msilib skipped
0:02:58 load avg: 0.92 [221/391/1] test_multifile
0:02:59 load avg: 0.92 [222/391/1] test_multiprocessing
0:03:27 load avg: 0.85 [223/391/1] test_mutants
0:03:27 load avg: 0.85 [224/391/1] test_mutex
0:03:27 load avg: 0.85 [225/391/1] test_netrc
0:03:27 load avg: 0.85 [226/391/1] test_new
0:03:27 load avg: 0.85 [227/391/1] test_nntplib
0:03:28 load avg: 0.85 [228/391/1] test_normalization
0:03:28 load avg: 0.85 [229/391/1] test_ntpath
0:03:28 load avg: 0.85 [230/391/1] test_old_mailbox
0:03:28 load avg: 0.85 [231/391/1] test_operator
0:03:28 load avg: 0.85 [232/391/1] test_optparse
0:03:28 load avg: 0.85 [233/391/1] test_ordered_dict
0:03:29 load avg: 0.85 [234/391/1] test_os
0:03:30 load avg: 0.85 [235/391/1] test_ossaudiodev
test_ossaudiodev skipped -- Use of the `audio' resource not enabled
0:03:30 load avg: 0.85 [236/391/1] test_parser -- test_ossaudiodev skipped (resource denied)
0:03:30 load avg: 0.85 [237/391/1] test_pdb
0:03:31 load avg: 0.87 [238/391/1] test_peepholer
0:03:31 load avg: 0.87 [239/391/1] test_pep247
0:03:31 load avg: 0.87 [240/391/1] test_pep277
0:03:31 load avg: 0.87 [241/391/1] test_pep352
0:03:31 load avg: 0.87 [242/391/1] test_pickle
0:03:33 load avg: 0.87 [243/391/1] test_pickletools
0:03:34 load avg: 0.87 [244/391/1] test_pipes
0:03:34 load avg: 0.87 [245/391/1] test_pkg
0:03:34 load avg: 0.87 [246/391/1] test_pkgimport
0:03:34 load avg: 0.87 [247/391/1] test_pkgutil
0:03:35 load avg: 0.87 [248/391/1] test_platform
0:03:35 load avg: 0.87 [249/391/1] test_plistlib
0:03:35 load avg: 0.87 [250/391/1] test_poll
0:03:46 load avg: 0.67 [251/391/1] test_popen
0:03:46 load avg: 0.67 [252/391/1] test_popen2
0:03:47 load avg: 0.67 [253/391/1] test_poplib
0:03:49 load avg: 0.67 [254/391/1] test_posixpath
0:03:49 load avg: 0.67 [255/391/1] test_pow
0:03:50 load avg: 0.67 [256/391/1] test_pprint
0:03:50 load avg: 0.67 [257/391/1] test_print
0:03:50 load avg: 0.67 [258/391/1] test_profile
0:03:50 load avg: 0.67 [259/391/1] test_property
0:03:50 load avg: 0.67 [260/391/1] test_pstats
0:03:50 load avg: 0.67 [261/391/1] test_pwd
0:03:50 load avg: 0.67 [262/391/1] test_py3kwarn
test_py3kwarn skipped -- test.test_py3kwarn must be run with the -3 flag
0:03:51 load avg: 0.70 [263/391/1] test_py_compile -- test_py3kwarn skipped
0:03:51 load avg: 0.70 [264/391/1] test_pyclbr
0:03:52 load avg: 0.70 [265/391/1] test_pyexpat
0:03:52 load avg: 0.70 [266/391/1] test_queue
0:03:56 load avg: 0.64 [267/391/1] test_quopri
0:03:56 load avg: 0.64 [268/391/1] test_random
0:03:56 load avg: 0.64 [269/391/1] test_re
0:03:57 load avg: 0.64 [270/391/1] test_readline
0:03:58 load avg: 0.64 [271/391/1] test_regrtest
0:04:00 load avg: 0.64 [272/391/1] test_repr
0:04:01 load avg: 0.67 [273/391/1] test_rfc822
0:04:01 load avg: 0.67 [274/391/1] test_richcmp
0:04:01 load avg: 0.67 [275/391/1] test_rlcompleter
0:04:01 load avg: 0.67 [276/391/1] test_robotparser
0:04:01 load avg: 0.67 [277/391/1] test_runpy
0:04:05 load avg: 0.67 [278/391/1] test_sax
0:04:05 load avg: 0.67 [279/391/1] test_scope
0:04:05 load avg: 0.67 [280/391/1] test_scriptpackages
test_scriptpackages skipped -- No module named aetools
0:04:06 load avg: 0.70 [281/391/1] test_select -- test_scriptpackages skipped
0:04:17 load avg: 0.59 [282/391/1] test_set
0:04:18 load avg: 0.59 [283/391/1] test_setcomps
0:04:18 load avg: 0.59 [284/391/1] test_sets
0:04:18 load avg: 0.59 [285/391/1] test_sgmllib
0:04:19 load avg: 0.59 [286/391/1] test_sha
0:04:19 load avg: 0.59 [287/391/1] test_shelve
0:04:19 load avg: 0.59 [288/391/1] test_shlex
0:04:20 load avg: 0.59 [289/391/1] test_shutil
0:04:20 load avg: 0.59 [290/391/1] test_signal
0:04:28 load avg: 0.50 [291/391/1] test_site
0:04:29 load avg: 0.50 [292/391/1] test_slice
0:04:29 load avg: 0.50 [293/391/1] test_smtplib
0:04:29 load avg: 0.50 [294/391/1] test_smtpnet
test_smtpnet skipped -- Use of the `network' resource not enabled
0:04:30 load avg: 0.50 [295/391/1] test_socketserver -- test_smtpnet skipped (resource denied)
test_socketserver skipped -- Use of the `network' resource not enabled
0:04:30 load avg: 0.50 [296/391/1] test_softspace -- test_socketserver skipped (resource denied)
0:04:30 load avg: 0.50 [297/391/1] test_sort
0:04:30 load avg: 0.50 [298/391/1] test_source_encoding
0:04:31 load avg: 0.70 [299/391/1] test_spwd
0:04:31 load avg: 0.70 [300/391/1] test_sqlite
0:04:31 load avg: 0.70 [301/391/1] test_ssl
test test_ssl failed -- multiple errors occurred; run in verbose mode for details
0:04:34 load avg: 0.70 [302/391/2] test_startfile -- test_ssl failed
test_startfile skipped -- module 'os' has no attribute 'startfile'
0:04:34 load avg: 0.70 [303/391/2] test_stat -- test_startfile skipped
0:04:34 load avg: 0.70 [304/391/2] test_str
0:04:35 load avg: 0.70 [305/391/2] test_strftime
0:04:35 load avg: 0.70 [306/391/2] test_string
0:04:36 load avg: 0.72 [307/391/2] test_stringprep
0:04:37 load avg: 0.72 [308/391/2] test_strop
0:04:37 load avg: 0.72 [309/391/2] test_strptime
0:04:37 load avg: 0.72 [310/391/2] test_strtod
0:04:38 load avg: 0.72 [311/391/2] test_struct
0:04:39 load avg: 0.72 [312/391/2] test_structmembers
0:04:40 load avg: 0.72 [313/391/2] test_structseq
0:04:40 load avg: 0.72 [314/391/2] test_subprocess
0:06:01 load avg: 0.95 [315/391/2] test_sunau -- test_subprocess passed in 1 min 21 sec
0:06:01 load avg: 0.95 [316/391/2] test_sunaudiodev
test_sunaudiodev skipped -- No module named sunaudiodev
0:06:01 load avg: 0.95 [317/391/2] test_sundry -- test_sunaudiodev skipped
0:06:01 load avg: 0.95 [318/391/2] test_symtable
0:06:01 load avg: 0.95 [319/391/2] test_syntax
0:06:02 load avg: 0.95 [320/391/2] test_sys
0:06:02 load avg: 0.95 [321/391/2] test_sys_setprofile
0:06:02 load avg: 0.95 [322/391/2] test_sys_settrace
0:06:03 load avg: 0.95 [323/391/2] test_sysconfig
0:06:03 load avg: 0.95 [324/391/2] test_tarfile
0:06:05 load avg: 0.95 [325/391/2] test_tcl
0:06:06 load avg: 0.95 [326/391/2] test_telnetlib
0:06:11 load avg: 0.96 [327/391/2] test_tempfile
0:06:11 load avg: 0.96 [328/391/2] test_test_support
0:06:11 load avg: 0.96 [329/391/2] test_textwrap
0:06:11 load avg: 0.96 [330/391/2] test_thread
0:06:12 load avg: 0.96 [331/391/2] test_threaded_import
0:06:12 load avg: 0.96 [332/391/2] test_threadedtempfile
0:06:12 load avg: 0.96 [333/391/2] test_threading
0:06:16 load avg: 0.96 [334/391/2] test_threading_local
0:06:17 load avg: 0.96 [335/391/2] test_threadsignals
0:06:18 load avg: 0.96 [336/391/2] test_time
0:06:19 load avg: 0.96 [337/391/2] test_timeit
0:06:19 load avg: 0.96 [338/391/2] test_timeout
test_timeout skipped -- Use of the `network' resource not enabled
0:06:19 load avg: 0.96 [339/391/2] test_tk -- test_timeout skipped (resource denied)
test_tk skipped -- Use of the `gui' resource not enabled
0:06:19 load avg: 0.96 [340/391/2] test_tokenize -- test_tk skipped (resource denied)
0:06:20 load avg: 0.96 [341/391/2] test_tools
recursedown('@test_31972_tmp')
0:06:21 load avg: 0.97 [342/391/2] test_trace
0:06:23 load avg: 0.97 [343/391/2] test_traceback
0:06:28 load avg: 0.89 [344/391/2] test_transformer
0:06:28 load avg: 0.89 [345/391/2] test_ttk_guionly
test_ttk_guionly skipped -- Use of the `gui' resource not enabled
0:06:28 load avg: 0.89 [346/391/2] test_ttk_textonly -- test_ttk_guionly skipped (resource denied)
0:06:28 load avg: 0.89 [347/391/2] test_tuple
0:06:38 load avg: 0.99 [348/391/2] test_turtle
0:06:38 load avg: 0.99 [349/391/2] test_typechecks
0:06:38 load avg: 0.99 [350/391/2] test_ucn
0:06:38 load avg: 0.99 [351/391/2] test_unary
0:06:39 load avg: 0.99 [352/391/2] test_undocumented_details
0:06:39 load avg: 0.99 [353/391/2] test_unicode
0:06:52 load avg: 1.36 [354/391/2] test_unicode_file
0:06:52 load avg: 1.36 [355/391/2] test_unicodedata
0:06:55 load avg: 1.36 [356/391/2] test_univnewlines
0:06:55 load avg: 1.36 [357/391/2] test_univnewlines2k
0:06:55 load avg: 1.36 [358/391/2] test_unpack
0:06:55 load avg: 1.36 [359/391/2] test_urllib
0:06:56 load avg: 1.36 [360/391/2] test_urllib2_localnet
0:06:57 load avg: 1.33 [361/391/2] test_urllib2net
test_urllib2net skipped -- Use of the `network' resource not enabled
0:06:57 load avg: 1.33 [362/391/2] test_urllibnet -- test_urllib2net skipped (resource denied)
test_urllibnet skipped -- Use of the `network' resource not enabled
0:06:57 load avg: 1.33 [363/391/2] test_urlparse -- test_urllibnet skipped (resource denied)
0:06:57 load avg: 1.33 [364/391/2] test_userdict
0:06:58 load avg: 1.33 [365/391/2] test_userlist
0:06:58 load avg: 1.33 [366/391/2] test_userstring
0:07:02 load avg: 1.30 [367/391/2] test_uu
0:07:02 load avg: 1.30 [368/391/2] test_uuid
0:07:02 load avg: 1.30 [369/391/2] test_wait3
0:07:08 load avg: 1.20 [370/391/2] test_wait4
0:07:14 load avg: 1.10 [371/391/2] test_warnings
0:07:14 load avg: 1.10 [372/391/2] test_wave
0:07:14 load avg: 1.10 [373/391/2] test_weakref
0:08:57 load avg: 1.27 [374/391/2] test_weakset -- test_weakref passed in 1 min 42 sec
0:08:57 load avg: 1.27 [375/391/2] test_whichdb
0:08:58 load avg: 1.27 [376/391/2] test_winreg
test_winreg skipped -- No module named _winreg
0:08:58 load avg: 1.27 [377/391/2] test_winsound -- test_winreg skipped
test_winsound skipped -- Use of the `audio' resource not enabled
0:08:58 load avg: 1.27 [378/391/2] test_with -- test_winsound skipped (resource denied)
0:08:58 load avg: 1.27 [379/391/2] test_wsgiref
0:08:58 load avg: 1.27 [380/391/2] test_xdrlib
0:08:58 load avg: 1.27 [381/391/2] test_xml_etree
0:08:59 load avg: 1.27 [382/391/2] test_xml_etree_c
0:08:59 load avg: 1.27 [383/391/2] test_xmllib
0:09:00 load avg: 1.27 [384/391/2] test_xmlrpc
0:09:03 load avg: 1.17 [385/391/2] test_xpickle
0:09:03 load avg: 1.17 [386/391/2] test_xrange
0:09:04 load avg: 1.17 [387/391/2] test_zipfile
0:09:07 load avg: 1.16 [388/391/2] test_zipfile64
test_zipfile64 skipped -- test requires loads of disk-space bytes and a long time to run
0:09:07 load avg: 1.16 [389/391/2] test_zipimport -- test_zipfile64 skipped (resource denied)
0:09:08 load avg: 1.16 [390/391/2] test_zipimport_support
0:09:08 load avg: 1.16 [391/391/2] test_zlib
353 tests OK.
2 tests failed:
    test_httplib test_ssl
36 tests skipped:
    test_aepack test_al test_applesingle test_bsddb185 test_bsddb3
    test_cd test_cl test_codecmaps_cn test_codecmaps_hk
    test_codecmaps_jp test_codecmaps_kr test_codecmaps_tw test_curses
    test_gl test_imgfile test_ioctl test_kqueue test_linuxaudiodev
    test_macos test_macostools test_msilib test_ossaudiodev
    test_py3kwarn test_scriptpackages test_smtpnet test_socketserver
    test_startfile test_sunaudiodev test_timeout test_tk
    test_ttk_guionly test_urllib2net test_urllibnet test_winreg
    test_winsound test_zipfile64
1 skip unexpected on linux2:
    test_ioctl
Re-running failed tests in verbose mode
Re-running test 'test_httplib' in verbose mode
test_auto_headers (test.test_httplib.HeaderTests) ... ok
test_blank_line_forms (test.test_httplib.HeaderTests) ... ok
test_content_length_0 (test.test_httplib.HeaderTests) ... ok
test_from_line (test.test_httplib.HeaderTests) ... ok
test_invalid_headers (test.test_httplib.HeaderTests) ... ok
test_ipv6host_header (test.test_httplib.HeaderTests) ... ok
test_malformed_headers_coped_with (test.test_httplib.HeaderTests) ... ok
test_malformed_truncation (test.test_httplib.HeaderTests) ... ok
test_parse_all_octets (test.test_httplib.HeaderTests) ... ok
test_putheader (test.test_httplib.HeaderTests) ... ok
test_responses (test.test_httplib.OfflineTest) ... ok
test_bad_status_repr (test.test_httplib.BasicTest) ... ok
test_chunked (test.test_httplib.BasicTest) ... ok
test_chunked_head (test.test_httplib.BasicTest) ... ok
test_early_eof (test.test_httplib.BasicTest) ... ok
test_epipe (test.test_httplib.BasicTest) ... ok
test_error_leak (test.test_httplib.BasicTest) ... ok
test_filenoattr (test.test_httplib.BasicTest) ... ok
test_host_port (test.test_httplib.BasicTest) ... ok
test_incomplete_read (test.test_httplib.BasicTest) ... ok
test_negative_content_length (test.test_httplib.BasicTest) ... ok
test_overflowing_chunked_line (test.test_httplib.BasicTest) ... ok
test_overflowing_header_line (test.test_httplib.BasicTest) ... ok
test_overflowing_status_line (test.test_httplib.BasicTest) ... skipped 'disabled for HTTP 0.9 support'
test_partial_reads (test.test_httplib.BasicTest) ... ok
test_partial_reads_incomplete_body (test.test_httplib.BasicTest) ... ok
test_partial_reads_no_content_length (test.test_httplib.BasicTest) ... ok
test_proxy_tunnel_without_status_line (test.test_httplib.BasicTest) ... ok
test_read_head (test.test_httplib.BasicTest) ... ok
test_response_headers (test.test_httplib.BasicTest) ... ok
test_send (test.test_httplib.BasicTest) ... ok
test_send_file (test.test_httplib.BasicTest) ... ok
test_send_tempfile (test.test_httplib.BasicTest) ... ok
test_status_lines (test.test_httplib.BasicTest) ... ok
test_too_many_headers (test.test_httplib.BasicTest) ... ok
testTimeoutAttribute (test.test_httplib.TimeoutTest)
This will prove that the timeout gets through ... ok
testHTTPConnection (test.test_httplib.HTTPTest) ... ok
testHTTPWithConnectHostPort (test.test_httplib.HTTPTest) ... ok
test_attributes (test.test_httplib.HTTPSTest) ... ok
test_host_port (test.test_httplib.HTTPSTest) ... ok
test_local_bad_hostname (test.test_httplib.HTTPSTest) ...  server (('127.0.0.1', 38873):38873 ('TLS_AES_256_GCM_SHA384', 'TLSv1.3', 256)):
   [14/Sep/2018 07:22:26] code 404, message File not found
 server (('127.0.0.1', 38873):38873 ('TLS_AES_256_GCM_SHA384', 'TLSv1.3', 256)):
   [14/Sep/2018 07:22:26] "GET /nonexistent HTTP/1.1" 404 -
stopping HTTPS server
joining HTTPS thread
ok
test_local_good_hostname (test.test_httplib.HTTPSTest) ...  server (('127.0.0.1', 45577):45577 ('TLS_AES_256_GCM_SHA384', 'TLSv1.3', 256)):
   [14/Sep/2018 07:22:26] code 404, message File not found
 server (('127.0.0.1', 45577):45577 ('TLS_AES_256_GCM_SHA384', 'TLSv1.3', 256)):
   [14/Sep/2018 07:22:26] "GET /nonexistent HTTP/1.1" 404 -
stopping HTTPS server
joining HTTPS thread
ok
test_local_unknown_cert (test.test_httplib.HTTPSTest) ... stopping HTTPS server
joining HTTPS thread
ok
test_networked (test.test_httplib.HTTPSTest) ... skipped "Use of the `network' resource not enabled"
test_networked_bad_cert (test.test_httplib.HTTPSTest) ... skipped "Use of the `network' resource not enabled"
test_networked_good_cert (test.test_httplib.HTTPSTest) ... skipped "Use of the `network' resource not enabled"
test_networked_noverification (test.test_httplib.HTTPSTest) ... skipped "Use of the `network' resource not enabled"
test_networked_trusted_by_default_cert (test.test_httplib.HTTPSTest) ... skipped "Use of the `network' resource not enabled"
testHTTPConnectionSourceAddress (test.test_httplib.SourceAddressTest) ... ok
testHTTPSConnectionSourceAddress (test.test_httplib.SourceAddressTest) ... ok
test_connect (test.test_httplib.TunnelTests) ... ok

----------------------------------------------------------------------
Ran 51 tests in 0.252s

OK (skipped=6)
Re-running test 'test_ssl' in verbose mode
test_ssl: testing with 'OpenSSL 1.1.1  11 Sep 2018' (1, 1, 1, 0, 15)
          under Linux ('PLD Linux (Th)', '3.0', '')
          HAS_SNI = True
          OP_ALL = 0x-7fffffac
          OP_NO_TLSv1_1 = 0x10000000
test__create_stdlib_context (test.test_ssl.ContextTests) ... ok
test__https_verify_certificates (test.test_ssl.ContextTests) ... ok
test__https_verify_envvar (test.test_ssl.ContextTests) ... ok
test_cert_store_stats (test.test_ssl.ContextTests) ... ok
test_check_hostname (test.test_ssl.ContextTests) ... ok
test_ciphers (test.test_ssl.ContextTests) ... ok
test_constructor (test.test_ssl.ContextTests) ... ok
test_create_default_context (test.test_ssl.ContextTests) ... ok
test_get_ca_certs (test.test_ssl.ContextTests) ... ok
test_load_cert_chain (test.test_ssl.ContextTests) ... ok
test_load_default_certs (test.test_ssl.ContextTests) ... ok
test_load_default_certs_env (test.test_ssl.ContextTests) ... ok
test_load_default_certs_env_windows (test.test_ssl.ContextTests) ... skipped 'Windows specific'
test_load_dh_params (test.test_ssl.ContextTests) ... ok
test_load_verify_cadata (test.test_ssl.ContextTests) ... ok
test_load_verify_locations (test.test_ssl.ContextTests) ... ok
test_options (test.test_ssl.ContextTests) ... FAIL
test_protocol (test.test_ssl.ContextTests) ... ok
test_session_stats (test.test_ssl.ContextTests) ... ok
test_set_default_verify_paths (test.test_ssl.ContextTests) ... ok
test_set_ecdh_curve (test.test_ssl.ContextTests) ... ok
test_sni_callback (test.test_ssl.ContextTests) ... ok
test_sni_callback_refcycle (test.test_ssl.ContextTests) ... ok
test_verify_flags (test.test_ssl.ContextTests) ... ok
test_verify_mode (test.test_ssl.ContextTests) ... ok
test_sslwrap_simple (test.test_ssl.BasicTests) ... ok
test_DER_to_PEM (test.test_ssl.BasicSocketTests) ... ok
test_asn1object (test.test_ssl.BasicSocketTests) ... ok
test_cert_time_to_seconds (test.test_ssl.BasicSocketTests) ... ok
test_cert_time_to_seconds_locale (test.test_ssl.BasicSocketTests) ... skipped 'locale-specific month name needs to be different from C locale'
test_cert_time_to_seconds_timezone (test.test_ssl.BasicSocketTests) ... ok
test_constants (test.test_ssl.BasicSocketTests) ... ok
test_empty_cert (test.test_ssl.BasicSocketTests)
Wrapping with an empty cert file ... ok
test_enum_certificates (test.test_ssl.BasicSocketTests) ... skipped 'Windows specific'
test_enum_crls (test.test_ssl.BasicSocketTests) ... skipped 'Windows specific'
test_errors (test.test_ssl.BasicSocketTests) ... ok
test_get_default_verify_paths (test.test_ssl.BasicSocketTests) ... ok
test_malformed_cert (test.test_ssl.BasicSocketTests)
Wrapping with a badly formatted certificate (syntax error) ... ok
test_malformed_key (test.test_ssl.BasicSocketTests)
Wrapping with a badly formatted key (syntax error) ... ok
test_match_hostname (test.test_ssl.BasicSocketTests) ... ok
test_openssl_version (test.test_ssl.BasicSocketTests) ... ok
test_parse_all_sans (test.test_ssl.BasicSocketTests) ... ok
test_parse_cert (test.test_ssl.BasicSocketTests) ... 
{'issuer': ((('countryName', u'XY'),),
            (('localityName', u'Castle Anthrax'),),
            (('organizationName', u'Python Software Foundation'),),
            (('commonName', u'localhost'),)),
 'notAfter': 'Oct  5 23:01:56 2020 GMT',
 'notBefore': u'Oct  8 23:01:56 2010 GMT',
 'serialNumber': u'D7C7381919AFC24E',
 'subject': ((('countryName', u'XY'),),
             (('localityName', u'Castle Anthrax'),),
             (('organizationName', u'Python Software Foundation'),),
             (('commonName', u'localhost'),)),
 'subjectAltName': (('DNS', 'localhost'),),
 'version': 3L}

{'OCSP': (u'http://ocsp.verisign.com',),
 'caIssuers': (u'http://SVRIntl-G3-aia.verisign.com/SVRIntlG3.cer',),
 'crlDistributionPoints': (u'http://SVRIntl-G3-crl.verisign.com/SVRIntlG3.crl',),
 'issuer': ((('countryName', u'US'),),
            (('organizationName', u'VeriSign, Inc.'),),
            (('organizationalUnitName', u'VeriSign Trust Network'),),
            (('organizationalUnitName',
              u'Terms of use at https://www.verisign.com/rpa (c)10'),),
            (('commonName',
              u'VeriSign Class 3 International Server CA - G3'),)),
 'notAfter': 'Sep 20 23:59:59 2012 GMT',
 'notBefore': u'Sep 21 00:00:00 2011 GMT',
 'serialNumber': u'2EE6EA7640A075CEE5005F4D7C79549A',
 'subject': ((('countryName', u'FI'),),
             (('stateOrProvinceName', u'Espoo'),),
             (('localityName', u'Espoo'),),
             (('organizationName', u'Nokia'),),
             (('organizationalUnitName', u'BI'),),
             (('commonName', u'projects.developer.nokia.com'),)),
 'subjectAltName': (('DNS', 'projects.developer.nokia.com'),
                    ('DNS', 'projects.forum.nokia.com')),
 'version': 3L}
ok
test_parse_cert_CVE_2013_4238 (test.test_ssl.BasicSocketTests) ... 
{'issuer': ((('countryName', u'US'),),
            (('stateOrProvinceName', u'Oregon'),),
            (('localityName', u'Beaverton'),),
            (('organizationName', u'Python Software Foundation'),),
            (('organizationalUnitName', u'Python Core Development'),),
            (('commonName', u'null.python.org\x00example.org'),),
            (('emailAddress', u'python-dev@python.org'),)),
 'notAfter': 'Aug  7 13:12:52 2013 GMT',
 'notBefore': u'Aug  7 13:11:52 2013 GMT',
 'serialNumber': u'00',
 'subject': ((('countryName', u'US'),),
             (('stateOrProvinceName', u'Oregon'),),
             (('localityName', u'Beaverton'),),
             (('organizationName', u'Python Software Foundation'),),
             (('organizationalUnitName', u'Python Core Development'),),
             (('commonName', u'null.python.org\x00example.org'),),
             (('emailAddress', u'python-dev@python.org'),)),
 'subjectAltName': (('DNS', 'altnull.python.org\x00example.com'),
                    ('email', 'null@python.org\x00user@example.org'),
                    ('URI', 'http://null.python.org\x00http://example.org'),
                    ('IP Address', '192.0.2.1'),
                    ('IP Address', '2001:DB8:0:0:0:0:0:1\n')),
 'version': 3L}
ok
test_purpose_enum (test.test_ssl.BasicSocketTests) ... ok
test_random (test.test_ssl.BasicSocketTests) ... 
 RAND_status is 1 (sufficient randomness)
ok
test_refcycle (test.test_ssl.BasicSocketTests) ... ok
test_server_side (test.test_ssl.BasicSocketTests) ... ok
test_timeout (test.test_ssl.BasicSocketTests) ... ok
test_tls_unique_channel_binding (test.test_ssl.BasicSocketTests) ... ok
test_unknown_channel_binding (test.test_ssl.BasicSocketTests) ... ok
test_unsupported_dtls (test.test_ssl.BasicSocketTests) ... ok
test_wrapped_unconnected (test.test_ssl.BasicSocketTests) ... ok
test_lib_reason (test.test_ssl.SSLErrorTests) ... ok
test_str (test.test_ssl.SSLErrorTests) ... ok
test_subclass (test.test_ssl.SSLErrorTests) ... ok
test_alpn_protocols (test.test_ssl.ThreadedTests) ...  server:  new connection from ('127.0.0.1', 40068)
 server: connection cipher is now ('ECDHE-RSA-AES256-GCM-SHA384', 'TLSv1.2', 256)
 server: selected protocol is now None
 client:  sending 'FOO\n'...
 client:  read 'foo\n'
 client:  sending 'FOO\n'...
 client:  read 'foo\n'
 client:  sending 'FOO\n'...
 client:  read 'foo\n'
 client:  closing connection.
 server:  new connection from ('127.0.0.1', 50954)
 server: connection cipher is now ('ECDHE-RSA-AES256-GCM-SHA384', 'TLSv1.2', 256)
 server: selected protocol is now None
 client:  sending 'FOO\n'...
 client:  read 'foo\n'
 client:  sending 'FOO\n'...
 client:  read 'foo\n'
 client:  sending 'FOO\n'...
 client:  read 'foo\n'
 client:  closing connection.
 server:  new connection from ('127.0.0.1', 56246)
 server: connection cipher is now ('ECDHE-RSA-AES256-GCM-SHA384', 'TLSv1.2', 256)
 server: selected protocol is now None
 client:  sending 'FOO\n'...
 client:  read 'foo\n'
 client:  sending 'FOO\n'...
 client:  read 'foo\n'
 client:  sending 'FOO\n'...
 client:  read 'foo\n'
 client:  closing connection.
 server:  new connection from ('127.0.0.1', 46592)
 server: connection cipher is now ('ECDHE-RSA-AES256-GCM-SHA384', 'TLSv1.2', 256)
 server: selected protocol is now None
 client:  sending 'FOO\n'...
 client:  read 'foo\n'
 client:  sending 'FOO\n'...
 client:  read 'foo\n'
 client:  sending 'FOO\n'...
 client:  read 'foo\n'
 client:  closing connection.
ok
test_asyncore_server (test.test_ssl.ThreadedTests)
Check the example asyncore integration. ... 
 server:  new connection from 127.0.0.1:41258
 client:  sending 'FOO\n'...
 server:  read 'FOO\n' from client
 client:  read 'foo\n'
 client:  closing connection.
 client:  connection closed.
 cleanup: stopping server.
 cleanup: joining server thread.
 server:  read 'over\n' from client
 server:  closed connection <ssl.SSLSocket object at 0xf2e1ad4c>
 server:  read '' from client
 cleanup: successfully joined.
ok
test_check_hostname (test.test_ssl.ThreadedTests) ... 
 server:  new connection from ('127.0.0.1', 38800)
 server: connection cipher is now ('ECDHE-RSA-AES256-SHA', 'TLSv1.0', 256)
 server: selected protocol is now None
 server:  new connection from ('127.0.0.1', 37846)
 server: connection cipher is now ('ECDHE-RSA-AES256-SHA', 'TLSv1.0', 256)
 server: selected protocol is now None
ok
test_compression (test.test_ssl.ThreadedTests) ...  server:  new connection from ('127.0.0.1', 43348)
 server: connection cipher is now ('ECDHE-RSA-AES256-SHA', 'TLSv1.0', 256)
 server: selected protocol is now None
 client:  sending 'FOO\n'...
 client:  read 'foo\n'
 client:  sending 'FOO\n'...
 client:  read 'foo\n'
 client:  sending 'FOO\n'...
 client:  read 'foo\n'
 client:  closing connection.
 got compression: None
ok
test_compression_disabled (test.test_ssl.ThreadedTests) ...  server:  new connection from ('127.0.0.1', 42946)
 server: connection cipher is now ('ECDHE-RSA-AES256-SHA', 'TLSv1.0', 256)
 server: selected protocol is now None
 client:  sending 'FOO\n'...
 client:  read 'foo\n'
 client:  sending 'FOO\n'...
 client:  read 'foo\n'
 client:  sending 'FOO\n'...
 client:  read 'foo\n'
 client:  closing connection.
ok
test_crl_check (test.test_ssl.ThreadedTests) ... 
 server:  new connection from ('127.0.0.1', 48330)
 server: connection cipher is now ('ECDHE-RSA-AES256-SHA', 'TLSv1.0', 256)
 server: selected protocol is now None
 server:  new connection from ('127.0.0.1', 58292)

 server:  bad connection attempt from ('127.0.0.1', 58292):
Traceback (most recent call last):
   File "/tmp/B.nglcTi/BUILD/Python-2.7.15/Lib/test/test_ssl.py", line 1663, in wrap_conn
    self.sock, server_side=True)
   File "/tmp/B.nglcTi/BUILD/Python-2.7.15/Lib/ssl.py", line 369, in wrap_socket
    _context=self)
   File "/tmp/B.nglcTi/BUILD/Python-2.7.15/Lib/ssl.py", line 617, in __init__
    self.do_handshake()
   File "/tmp/B.nglcTi/BUILD/Python-2.7.15/Lib/ssl.py", line 846, in do_handshake
    self._sslobj.do_handshake()
 SSLError: [SSL: TLSV1_ALERT_UNKNOWN_CA] tlsv1 alert unknown ca (_ssl.c:726)
 server:  new connection from ('127.0.0.1', 40330)
 server: connection cipher is now ('ECDHE-RSA-AES256-SHA', 'TLSv1.0', 256)
 server: selected protocol is now None
ok
test_default_ciphers (test.test_ssl.ThreadedTests) ... FAIL
test_default_ecdh_curve (test.test_ssl.ThreadedTests) ...  server:  new connection from ('127.0.0.1', 38794)
 server: connection cipher is now ('TLS_AES_256_GCM_SHA384', 'TLSv1.3', 256)
 server: selected protocol is now None
FAIL
test_dh_params (test.test_ssl.ThreadedTests) ...  server:  new connection from ('127.0.0.1', 33736)
 server: connection cipher is now ('DHE-RSA-AES256-SHA', 'SSLv3', 256)
 server: selected protocol is now None
 client:  sending 'FOO\n'...
 client:  read 'foo\n'
 client:  sending 'FOO\n'...
 client:  read 'foo\n'
 client:  sending 'FOO\n'...
 client:  read 'foo\n'
 client:  closing connection.
ok
test_do_handshake_enotconn (test.test_ssl.ThreadedTests) ... ok
test_echo (test.test_ssl.ThreadedTests)
Basic test of an SSL client connecting to a server ... 
 server:  new connection from ('127.0.0.1', 56430)
 client:  sending 'FOO\n'...
 server: connection cipher is now ('TLS_AES_256_GCM_SHA384', 'TLSv1.3', 256)
 server: selected protocol is now None
 client:  read 'foo\n'
 client:  sending 'FOO\n'...
 client:  read 'foo\n'
 client:  sending 'FOO\n'...
 client:  read 'foo\n'
 client:  closing connection.
 server:  new connection from ('127.0.0.1', 60544)
 server: connection cipher is now ('ECDHE-RSA-AES256-SHA', 'TLSv1.0', 256)
 server: selected protocol is now None
 client:  sending 'FOO\n'...
 client:  read 'foo\n'
 client:  sending 'FOO\n'...
 client:  read 'foo\n'
 client:  sending 'FOO\n'...
 client:  read 'foo\n'
 client:  closing connection.
 server:  new connection from ('127.0.0.1', 33022)
 server: connection cipher is now ('ECDHE-RSA-AES256-SHA', 'TLSv1.0', 256)
 server: selected protocol is now None
 client:  sending 'FOO\n'...
 client:  read 'foo\n'
 client:  sending 'FOO\n'...
 client:  read 'foo\n'
 client:  sending 'FOO\n'...
 client:  read 'foo\n'
 client:  closing connection.
 server:  new connection from ('127.0.0.1', 34100)
 server: connection cipher is now ('ECDHE-RSA-AES256-GCM-SHA384', 'TLSv1.2', 256)
 server: selected protocol is now None
 client:  sending 'FOO\n'...
 client:  read 'foo\n'
 client:  sending 'FOO\n'...
 client:  read 'foo\n'
 client:  sending 'FOO\n'...
 client:  read 'foo\n'
 client:  closing connection.
ok
test_getpeercert (test.test_ssl.ThreadedTests) ... Exception in thread Thread-1476:
Traceback (most recent call last):
  File "/tmp/B.nglcTi/BUILD/Python-2.7.15/Lib/threading.py", line 801, in __bootstrap_inner
    self.run()
  File "/tmp/B.nglcTi/BUILD/Python-2.7.15/Lib/test/test_ssl.py", line 1723, in run
    msg = self.read()
  File "/tmp/B.nglcTi/BUILD/Python-2.7.15/Lib/test/test_ssl.py", line 1700, in read
    return self.sslconn.read()
  File "/tmp/B.nglcTi/BUILD/Python-2.7.15/Lib/ssl.py", line 659, in read
    v = self._sslobj.read(len)
error: [Errno 104] Connection reset by peer


{'issuer': ((('countryName', u'XY'),),
            (('localityName', u'Castle Anthrax'),),
            (('organizationName', u'Python Software Foundation'),),
            (('commonName', u'localhost'),)),
 'notAfter': 'Oct  5 23:01:56 2020 GMT',
 'notBefore': u'Oct  8 23:01:56 2010 GMT',
 'serialNumber': u'D7C7381919AFC24E',
 'subject': ((('countryName', u'XY'),),
             (('localityName', u'Castle Anthrax'),),
             (('organizationName', u'Python Software Foundation'),),
             (('commonName', u'localhost'),)),
 'subjectAltName': (('DNS', 'localhost'),),
 'version': 3L}
Connection cipher is ('TLS_AES_256_GCM_SHA384', 'TLSv1.3', 256).
ok
test_getpeercert_enotconn (test.test_ssl.ThreadedTests) ... ok
test_handshake_timeout (test.test_ssl.ThreadedTests) ... ok
test_npn_protocols (test.test_ssl.ThreadedTests) ... skipped 'NPN support needed for this test'
test_protocol_sslv2 (test.test_ssl.ThreadedTests)
Connecting to an SSLv2 server with various client options ... skipped 'OpenSSL is compiled without SSLv2 support'
test_protocol_sslv23 (test.test_ssl.ThreadedTests)
Connecting to an SSLv23 server with various client options ... 
 PROTOCOL_TLS->PROTOCOL_TLS CERT_NONE
 PROTOCOL_TLSv1->PROTOCOL_TLS CERT_NONE
 PROTOCOL_TLS->PROTOCOL_TLS CERT_OPTIONAL
 PROTOCOL_TLSv1->PROTOCOL_TLS CERT_OPTIONAL
 PROTOCOL_TLS->PROTOCOL_TLS CERT_REQUIRED
 PROTOCOL_TLSv1->PROTOCOL_TLS CERT_REQUIRED
 PROTOCOL_TLS->PROTOCOL_TLS CERT_NONE
 {PROTOCOL_TLSv1->PROTOCOL_TLS} CERT_NONE
ok
test_protocol_sslv3 (test.test_ssl.ThreadedTests)
Connecting to an SSLv3 server with various client options ... skipped 'OpenSSL is compiled without SSLv3 support'
test_protocol_tlsv1 (test.test_ssl.ThreadedTests)
Connecting to a TLSv1 server with various client options ... 
 PROTOCOL_TLSv1->PROTOCOL_TLSv1 CERT_NONE
 PROTOCOL_TLSv1->PROTOCOL_TLSv1 CERT_OPTIONAL
 PROTOCOL_TLSv1->PROTOCOL_TLSv1 CERT_REQUIRED
 {PROTOCOL_TLS->PROTOCOL_TLSv1} CERT_NONE
ok
test_protocol_tlsv1_1 (test.test_ssl.ThreadedTests)
Connecting to a TLSv1.1 server with various client options. ... 
 PROTOCOL_TLSv1_1->PROTOCOL_TLSv1_1 CERT_NONE
 {PROTOCOL_TLS->PROTOCOL_TLSv1_1} CERT_NONE
 PROTOCOL_TLSv1_1->PROTOCOL_TLS CERT_NONE
 {PROTOCOL_TLSv1->PROTOCOL_TLSv1_1} CERT_NONE
 {PROTOCOL_TLSv1_1->PROTOCOL_TLSv1} CERT_NONE
ok
test_protocol_tlsv1_2 (test.test_ssl.ThreadedTests)
Connecting to a TLSv1.2 server with various client options. ... 
 PROTOCOL_TLSv1_2->PROTOCOL_TLSv1_2 CERT_NONE
 {PROTOCOL_TLS->PROTOCOL_TLSv1_2} CERT_NONE
 PROTOCOL_TLSv1_2->PROTOCOL_TLS CERT_NONE
 {PROTOCOL_TLSv1->PROTOCOL_TLSv1_2} CERT_NONE
 {PROTOCOL_TLSv1_2->PROTOCOL_TLSv1} CERT_NONE
 {PROTOCOL_TLSv1_1->PROTOCOL_TLSv1_2} CERT_NONE
 {PROTOCOL_TLSv1_2->PROTOCOL_TLSv1_1} CERT_NONE
ok
test_read_write_after_close_raises_valuerror (test.test_ssl.ThreadedTests) ... ok
test_recv_send (test.test_ssl.ThreadedTests)
Test recv(), send() and friends. ... 
 server:  new connection from ('127.0.0.1', 51706)
 server: connection cipher is now ('ECDHE-RSA-AES256-SHA', 'TLSv1.0', 256)
 server: selected protocol is now None
ok
test_recv_zero (test.test_ssl.ThreadedTests) ...  server:  new connection from ('127.0.0.1', 34910)
 server: connection cipher is now ('TLS_AES_256_GCM_SHA384', 'TLSv1.3', 256)
 server: selected protocol is now None
ok
test_rude_shutdown (test.test_ssl.ThreadedTests)
A brutal shutdown of an SSL server should raise an OSError ... ok
test_selected_alpn_protocol (test.test_ssl.ThreadedTests) ...  server:  new connection from ('127.0.0.1', 55036)
 server: connection cipher is now ('ECDHE-RSA-AES256-SHA', 'TLSv1.0', 256)
 server: selected protocol is now None
 client:  sending 'FOO\n'...
 client:  read 'foo\n'
 client:  sending 'FOO\n'...
 client:  read 'foo\n'
 client:  sending 'FOO\n'...
 client:  read 'foo\n'
 client:  closing connection.
ok
test_selected_alpn_protocol_if_server_uses_alpn (test.test_ssl.ThreadedTests) ...  server:  new connection from ('127.0.0.1', 60190)
 server: connection cipher is now ('ECDHE-RSA-AES256-SHA', 'TLSv1.0', 256)
 server: selected protocol is now None
 client:  sending 'FOO\n'...
 client:  read 'foo\n'
 client:  sending 'FOO\n'...
 client:  read 'foo\n'
 client:  sending 'FOO\n'...
 client:  read 'foo\n'
 client:  closing connection.
ok
test_selected_npn_protocol (test.test_ssl.ThreadedTests) ...  server:  new connection from ('127.0.0.1', 40746)
 server: connection cipher is now ('ECDHE-RSA-AES256-SHA', 'TLSv1.0', 256)
 server: selected protocol is now None
 client:  sending 'FOO\n'...
 client:  read 'foo\n'
 client:  sending 'FOO\n'...
 client:  read 'foo\n'
 client:  sending 'FOO\n'...
 client:  read 'foo\n'
 client:  closing connection.
ok
test_server_accept (test.test_ssl.ThreadedTests) ... ok
test_sni_callback (test.test_ssl.ThreadedTests) ...  server:  new connection from ('127.0.0.1', 42978)
 server: connection cipher is now ('ECDHE-RSA-AES256-SHA', 'TLSv1.0', 256)
 server: selected protocol is now None
 server:  new connection from ('127.0.0.1', 58594)
 server: connection cipher is now ('ECDHE-RSA-AES256-SHA', 'TLSv1.0', 256)
 server: selected protocol is now None
 server:  new connection from ('127.0.0.1', 34410)
 server: connection cipher is now ('ECDHE-RSA-AES256-SHA', 'TLSv1.0', 256)
 server: selected protocol is now None
ok
test_sni_callback_alert (test.test_ssl.ThreadedTests) ... ok
test_sni_callback_raising (test.test_ssl.ThreadedTests) ... ok
test_sni_callback_wrong_return_type (test.test_ssl.ThreadedTests) ... ok
test_socketserver (test.test_ssl.ThreadedTests)
Using a SocketServer to create and manage SSL connections. ... 
 server (('127.0.0.1', 42323):42323 ('TLS_AES_256_GCM_SHA384', 'TLSv1.3', 256)):
   [14/Sep/2018 07:22:28] "GET /keycert.pem HTTP/1.1" 200 -
 client: read 1783 bytes from remote server '<HTTPSServerThread <HTTPSServer localhost:42323>>'
stopping HTTPS server
joining HTTPS thread
ok
test_starttls (test.test_ssl.ThreadedTests)
Switching from clear text to encrypted and back again. ... 
 client:  sending 'msg 1'...
 server:  new connection from ('127.0.0.1', 49150)
 server: read 'msg 1' (unencrypted), sending back 'msg 1' (unencrypted)...
 client:  read 'msg 1' from server
 client:  sending 'MSG 2'...
 server: read 'MSG 2' (unencrypted), sending back 'msg 2' (unencrypted)...
 client:  read 'msg 2' from server
 client:  sending 'STARTTLS'...
 server: read STARTTLS from client, sending OK...
 client:  read 'ok' from server, starting TLS...
 server: connection cipher is now ('ECDHE-RSA-AES256-SHA', 'TLSv1.0', 256)
 server: selected protocol is now None
 client:  sending 'MSG 3'...
 server: read 'MSG 3' (encrypted), sending back 'msg 3' (encrypted)...
 client:  read 'msg 3' from server
 client:  sending 'msg 4'...
 server: read 'msg 4' (encrypted), sending back 'msg 4' (encrypted)...
 client:  read 'msg 4' from server
 client:  sending 'ENDTLS'...
 server: read ENDTLS from client, sending OK...
 client:  read 'ok' from server, ending TLS...
 server: connection is now unencrypted...
 client:  sending 'msg 5'...
 server: read 'msg 5' (unencrypted), sending back 'msg 5' (unencrypted)...
 client:  read 'msg 5' from server
 client:  sending 'msg 6'...
 server: read 'msg 6' (unencrypted), sending back 'msg 6' (unencrypted)...
 client:  read 'msg 6' from server
 client:  closing connection.
 server: client closed connection
ok
test_tls1_3 (test.test_ssl.ThreadedTests) ... ERROR
test_tls_unique_channel_binding (test.test_ssl.ThreadedTests)
Test tls-unique channel binding. ... 
 server:  new connection from ('127.0.0.1', 44476)
 server: connection cipher is now ('ECDHE-RSA-AES256-SHA', 'TLSv1.0', 256)
 server: selected protocol is now None
 got channel binding data: 'HP\xf5.c\xaen??\xa0\xcf\xb6'
 server:  new connection from ('127.0.0.1', 44478)
 server: connection cipher is now ('ECDHE-RSA-AES256-SHA', 'TLSv1.0', 256)
 server: selected protocol is now None
 got another channel binding data: 'E)\x8e\xe8N<x\xba\x06nB\xca'
ok
test_version_basic (test.test_ssl.ThreadedTests) ... ok
test_wrong_cert (test.test_ssl.ThreadedTests)
Connecting when the server rejects the client's certificate ... test test_ssl failed -- multiple errors occurred

SSLError is SSLError(1, u'[SSL: TLSV1_ALERT_UNKNOWN_CA] tlsv1 alert unknown ca (_ssl.c:726)')
ok

======================================================================
ERROR: test_tls1_3 (test.test_ssl.ThreadedTests)
----------------------------------------------------------------------
Traceback (most recent call last):
  File "/tmp/B.nglcTi/BUILD/Python-2.7.15/Lib/test/test_ssl.py", line 2808, in test_tls1_3
    with context.wrap_socket(socket.socket()) as s:
AttributeError: __exit__

======================================================================
FAIL: test_options (test.test_ssl.ContextTests)
----------------------------------------------------------------------
Traceback (most recent call last):
  File "/tmp/B.nglcTi/BUILD/Python-2.7.15/Lib/test/test_ssl.py", line 780, in test_options
    self.assertEqual(default, ctx.options)
AssertionError: -2113798060 != -2112749484L

======================================================================
FAIL: test_default_ciphers (test.test_ssl.ThreadedTests)
----------------------------------------------------------------------
Traceback (most recent call last):
  File "/tmp/B.nglcTi/BUILD/Python-2.7.15/Lib/test/test_ssl.py", line 2780, in test_default_ciphers
    s.connect((HOST, server.port))
AssertionError: SSLError not raised

======================================================================
FAIL: test_default_ecdh_curve (test.test_ssl.ThreadedTests)
----------------------------------------------------------------------
Traceback (most recent call last):
  File "/tmp/B.nglcTi/BUILD/Python-2.7.15/Lib/test/test_ssl.py", line 2831, in test_default_ecdh_curve
    self.assertIn("ECDH", s.cipher()[0])
AssertionError: 'ECDH' not found in 'TLS_AES_256_GCM_SHA384'

----------------------------------------------------------------------
Ran 95 tests in 1.881s

FAILED (failures=3, errors=1, skipped=7)
1 test failed again:
    test_ssl

Total duration: 9 min 13 sec
Tests result: FAILURE
make: [Makefile:879: test] Error 2 (ignored)
LD_LIBRARY_PATH=/tmp/B.nglcTi/BUILD/Python-2.7.15 PYTHONHOME=/tmp/B.nglcTi/BUILD/Python-2.7.15 PYTHONPATH=/tmp/B.nglcTi/BUILD/Python-2.7.15/Lib:/tmp/B.nglcTi/BUILD/Python-2.7.15/Lib/lib-tk:/tmp/B.nglcTi/BUILD/Python-2.7.15/build/lib.linux-i686-2.7 ./python -tt ./Lib/test/regrtest.py -w -l -x test_resource test_openpty test_socket test_nis test_posix test_locale test_pty test_urllib2 test_doctest test_pydoc test_distutils test_gdb
== CPython 2.7.15 (default, Sep 14 2018, 07:12:21) [GCC 8.2.0 20180726 (release)]
==   Linux-4.9.126-1-i686-Intel-R-_Xeon-R-_CPU___________X5470__@_3.33GHz-with-pld-3.0 little-endian
==   /tmp/B.nglcTi/BUILD/Python-2.7.15/build/test_python_5877
== CPU count: 8
Run tests sequentially
0:00:00 load avg: 1.14 [  1/391] test_grammar
0:00:00 load avg: 1.14 [  2/391] test_opcodes
0:00:00 load avg: 1.14 [  3/391] test_dict
0:00:00 load avg: 1.14 [  4/391] test_builtin
0:00:00 load avg: 1.14 [  5/391] test_exceptions
0:00:00 load avg: 1.14 [  6/391] test_types
0:00:00 load avg: 1.14 [  7/391] test_unittest
0:00:00 load avg: 1.14 [  8/391] test_doctest2
0:00:00 load avg: 1.14 [  9/391] test_MimeWriter
0:00:00 load avg: 1.14 [ 10/391] test_SimpleHTTPServer
0:00:00 load avg: 1.14 [ 11/391] test_StringIO
0:00:00 load avg: 1.14 [ 12/391] test___all__
0:00:01 load avg: 1.14 [ 13/391] test___future__
0:00:01 load avg: 1.14 [ 14/391] test__locale
0:00:01 load avg: 1.14 [ 15/391] test__osx_support
0:00:01 load avg: 1.14 [ 16/391] test_abc
0:00:01 load avg: 1.14 [ 17/391] test_abstract_numbers
0:00:01 load avg: 1.14 [ 18/391] test_aepack
test_aepack skipped -- No module named aetypes
0:00:01 load avg: 1.14 [ 19/391] test_aifc -- test_aepack skipped
0:00:01 load avg: 1.14 [ 20/391] test_al
test_al skipped -- No module named al
0:00:01 load avg: 1.14 [ 21/391] test_anydbm -- test_al skipped
0:00:01 load avg: 1.14 [ 22/391] test_applesingle
test_applesingle skipped -- No module named MacOS
0:00:01 load avg: 1.14 [ 23/391] test_argparse -- test_applesingle skipped
0:00:04 load avg: 1.13 [ 24/391] test_array
0:00:05 load avg: 1.13 [ 25/391] test_ascii_formatd
0:00:05 load avg: 1.13 [ 26/391] test_ast
0:00:05 load avg: 1.13 [ 27/391] test_asynchat
0:00:06 load avg: 1.13 [ 28/391] test_asyncore
0:00:07 load avg: 1.04 [ 29/391] test_atexit
0:00:07 load avg: 1.04 [ 30/391] test_audioop
0:00:08 load avg: 1.04 [ 31/391] test_augassign
0:00:08 load avg: 1.04 [ 32/391] test_base64
0:00:08 load avg: 1.04 [ 33/391] test_bastion
0:00:08 load avg: 1.04 [ 34/391] test_bigaddrspace
0:00:08 load avg: 1.04 [ 35/391] test_bigmem
0:00:08 load avg: 1.04 [ 36/391] test_binascii
0:00:08 load avg: 1.04 [ 37/391] test_binhex
0:00:08 load avg: 1.04 [ 38/391] test_binop
0:00:08 load avg: 1.04 [ 39/391] test_bisect
0:00:08 load avg: 1.04 [ 40/391] test_bool
0:00:08 load avg: 1.04 [ 41/391] test_bsddb
0:00:09 load avg: 1.04 [ 42/391] test_bsddb185
test_bsddb185 skipped -- No module named bsddb185
0:00:09 load avg: 1.04 [ 43/391] test_bsddb3 -- test_bsddb185 skipped
test_bsddb3 skipped -- Use of the `bsddb' resource not enabled
0:00:09 load avg: 1.04 [ 44/391] test_buffer -- test_bsddb3 skipped (resource denied)
0:00:09 load avg: 1.04 [ 45/391] test_bufio
0:00:10 load avg: 1.04 [ 46/391] test_bytes
0:00:11 load avg: 1.04 [ 47/391] test_bz2
0:00:12 load avg: 1.04 [ 48/391] test_calendar
0:00:14 load avg: 0.96 [ 49/391] test_call
0:00:14 load avg: 0.96 [ 50/391] test_capi
0:00:16 load avg: 0.96 [ 51/391] test_cd
test_cd skipped -- No module named cd
0:00:16 load avg: 0.96 [ 52/391] test_cfgparser -- test_cd skipped
0:00:17 load avg: 0.96 [ 53/391] test_cgi
0:00:17 load avg: 0.96 [ 54/391] test_charmapcodec
0:00:17 load avg: 0.96 [ 55/391] test_cl
test_cl skipped -- No module named cl
0:00:17 load avg: 0.96 [ 56/391] test_class -- test_cl skipped
0:00:17 load avg: 0.96 [ 57/391] test_cmath
0:00:17 load avg: 0.96 [ 58/391] test_cmd
0:00:17 load avg: 0.96 [ 59/391] test_cmd_line
0:00:18 load avg: 0.88 [ 60/391] test_cmd_line_script
0:00:18 load avg: 0.88 [ 61/391] test_code
0:00:18 load avg: 0.88 [ 62/391] test_codeccallbacks
0:00:18 load avg: 0.88 [ 63/391] test_codecencodings_cn
0:00:19 load avg: 0.88 [ 64/391] test_codecencodings_hk
0:00:19 load avg: 0.88 [ 65/391] test_codecencodings_iso2022
0:00:20 load avg: 0.88 [ 66/391] test_codecencodings_jp
0:00:21 load avg: 0.88 [ 67/391] test_codecencodings_kr
0:00:21 load avg: 0.88 [ 68/391] test_codecencodings_tw
0:00:21 load avg: 0.88 [ 69/391] test_codecmaps_cn
test_codecmaps_cn skipped -- Use of the `urlfetch' resource not enabled
0:00:21 load avg: 0.88 [ 70/391] test_codecmaps_hk -- test_codecmaps_cn skipped (resource denied)
test_codecmaps_hk skipped -- Use of the `urlfetch' resource not enabled
0:00:21 load avg: 0.88 [ 71/391] test_codecmaps_jp -- test_codecmaps_hk skipped (resource denied)
test_codecmaps_jp skipped -- Use of the `urlfetch' resource not enabled
0:00:21 load avg: 0.88 [ 72/391] test_codecmaps_kr -- test_codecmaps_jp skipped (resource denied)
test_codecmaps_kr skipped -- Use of the `urlfetch' resource not enabled
0:00:21 load avg: 0.88 [ 73/391] test_codecmaps_tw -- test_codecmaps_kr skipped (resource denied)
test_codecmaps_tw skipped -- Use of the `urlfetch' resource not enabled
0:00:21 load avg: 0.88 [ 74/391] test_codecs -- test_codecmaps_tw skipped (resource denied)
0:00:23 load avg: 0.89 [ 75/391] test_codeop
0:00:23 load avg: 0.89 [ 76/391] test_coercion
0:00:23 load avg: 0.89 [ 77/391] test_collections
0:00:23 load avg: 0.89 [ 78/391] test_colorsys
0:00:24 load avg: 0.89 [ 79/391] test_commands
0:00:24 load avg: 0.89 [ 80/391] test_compare
0:00:24 load avg: 0.89 [ 81/391] test_compile
0:00:24 load avg: 0.89 [ 82/391] test_compileall
0:00:24 load avg: 0.89 [ 83/391] test_compiler
0:00:24 load avg: 0.89 [ 84/391] test_complex
0:00:24 load avg: 0.89 [ 85/391] test_complex_args
0:00:25 load avg: 0.89 [ 86/391] test_contains
0:00:25 load avg: 0.89 [ 87/391] test_contextlib
0:00:25 load avg: 0.89 [ 88/391] test_cookie
0:00:25 load avg: 0.89 [ 89/391] test_cookielib
0:00:25 load avg: 0.89 [ 90/391] test_copy
0:00:25 load avg: 0.89 [ 91/391] test_copy_reg
0:00:25 load avg: 0.89 [ 92/391] test_cpickle
0:00:27 load avg: 0.89 [ 93/391] test_cprofile
0:00:27 load avg: 0.89 [ 94/391] test_crypt
0:00:27 load avg: 0.89 [ 95/391] test_csv
0:00:27 load avg: 0.89 [ 96/391] test_ctypes
0:00:28 load avg: 0.90 [ 97/391] test_curses
test_curses skipped -- Use of the `curses' resource not enabled
0:00:28 load avg: 0.90 [ 98/391] test_datetime -- test_curses skipped (resource denied)
0:00:29 load avg: 0.90 [ 99/391] test_dbm
0:00:29 load avg: 0.90 [100/391] test_decimal
0:00:31 load avg: 0.90 [101/391] test_decorators
0:00:31 load avg: 0.90 [102/391] test_defaultdict
0:00:31 load avg: 0.90 [103/391] test_deque
0:00:34 load avg: 0.91 [104/391] test_descr
0:00:36 load avg: 0.91 [105/391] test_descrtut
0:00:36 load avg: 0.91 [106/391] test_dictcomps
0:00:36 load avg: 0.91 [107/391] test_dictviews
0:00:36 load avg: 0.91 [108/391] test_difflib
0:00:37 load avg: 0.91 [109/391] test_dircache
0:00:38 load avg: 0.83 [110/391] test_dis
0:00:38 load avg: 0.83 [111/391] test_dl
0:00:38 load avg: 0.83 [112/391] test_docxmlrpc
0:00:41 load avg: 0.83 [113/391] test_dumbdbm
0:00:42 load avg: 0.83 [114/391] test_dummy_thread
0:00:42 load avg: 0.83 [115/391] test_dummy_threading
0:00:42 load avg: 0.83 [116/391] test_email
0:00:46 load avg: 1.09 [117/391] test_email_codecs
0:00:46 load avg: 1.09 [118/391] test_email_renamed
0:00:46 load avg: 1.09 [119/391] test_ensurepip
0:00:46 load avg: 1.09 [120/391] test_enumerate
0:00:46 load avg: 1.09 [121/391] test_eof
0:00:46 load avg: 1.09 [122/391] test_epoll
0:00:48 load avg: 1.00 [123/391] test_errno
0:00:48 load avg: 1.00 [124/391] test_exception_variations
0:00:49 load avg: 1.00 [125/391] test_extcall
0:00:49 load avg: 1.00 [126/391] test_fcntl
0:00:49 load avg: 1.00 [127/391] test_file
0:00:49 load avg: 1.00 [128/391] test_file2k
0:00:56 load avg: 1.08 [129/391] test_file_eintr
0:00:57 load avg: 1.08 [130/391] test_filecmp
0:00:57 load avg: 1.08 [131/391] test_fileinput
0:00:57 load avg: 1.08 [132/391] test_fileio
0:00:57 load avg: 1.08 [133/391] test_float
0:00:58 load avg: 1.07 [134/391] test_fnmatch
0:00:58 load avg: 1.07 [135/391] test_fork1
0:01:04 load avg: 0.99 [136/391] test_format
0:01:04 load avg: 0.99 [137/391] test_fpformat
0:01:05 load avg: 0.99 [138/391] test_fractions
0:01:05 load avg: 0.99 [139/391] test_frozen
0:01:05 load avg: 0.99 [140/391] test_ftplib
0:01:09 load avg: 0.91 [141/391] test_funcattrs
0:01:09 load avg: 0.91 [142/391] test_functools
0:01:09 load avg: 0.91 [143/391] test_future
0:01:09 load avg: 0.91 [144/391] test_future3
0:01:09 load avg: 0.91 [145/391] test_future4
0:01:09 load avg: 0.91 [146/391] test_future5
0:01:09 load avg: 0.91 [147/391] test_future_builtins
0:01:09 load avg: 0.91 [148/391] test_gc
0:01:13 load avg: 1.00 [149/391] test_gdbm
0:01:13 load avg: 1.00 [150/391] test_generators
0:01:13 load avg: 1.00 [151/391] test_genericpath
0:01:13 load avg: 1.00 [152/391] test_genexps
0:01:13 load avg: 1.00 [153/391] test_getargs
0:01:14 load avg: 1.00 [154/391] test_getargs2
0:01:14 load avg: 1.00 [155/391] test_getopt
0:01:14 load avg: 1.00 [156/391] test_gettext
0:01:14 load avg: 1.00 [157/391] test_gl
test_gl skipped -- No module named gl
0:01:14 load avg: 1.00 [158/391] test_glob -- test_gl skipped
0:01:14 load avg: 1.00 [159/391] test_global
0:01:14 load avg: 1.00 [160/391] test_grp
0:01:14 load avg: 1.00 [161/391] test_gzip
0:01:14 load avg: 1.00 [162/391] test_hash
0:01:15 load avg: 1.00 [163/391] test_hashlib
0:01:15 load avg: 1.00 [164/391] test_heapq
0:01:16 load avg: 1.00 [165/391] test_hmac
0:01:16 load avg: 1.00 [166/391] test_hotshot
0:01:16 load avg: 1.00 [167/391] test_htmllib
0:01:16 load avg: 1.00 [168/391] test_htmlparser
0:01:17 load avg: 1.00 [169/391] test_httplib
0:01:17 load avg: 1.00 [170/391] test_httpservers
0:01:20 load avg: 0.92 [171/391] test_idle
0:01:20 load avg: 0.92 [172/391] test_imageop
0:01:20 load avg: 0.92 [173/391] test_imaplib
0:01:20 load avg: 0.92 [174/391] test_imgfile
test_imgfile skipped -- No module named imgfile
0:01:20 load avg: 0.92 [175/391] test_imghdr -- test_imgfile skipped
0:01:20 load avg: 0.92 [176/391] test_imp
0:01:21 load avg: 0.92 [177/391] test_import
0:01:21 load avg: 0.92 [178/391] test_import_magic
0:01:21 load avg: 0.92 [179/391] test_importhooks
0:01:21 load avg: 0.92 [180/391] test_importlib
0:01:21 load avg: 0.92 [181/391] test_index
0:01:21 load avg: 0.92 [182/391] test_inspect
0:01:22 load avg: 0.92 [183/391] test_int
0:01:22 load avg: 0.92 [184/391] test_int_literal
0:01:23 load avg: 0.92 [185/391] test_io
0:02:00 load avg: 0.68 [186/391] test_ioctl -- test_io passed in 38 sec
test_ioctl skipped -- Unable to open /dev/tty
0:02:01 load avg: 0.68 [187/391] test_isinstance -- test_ioctl skipped
0:02:01 load avg: 0.68 [188/391] test_iter
0:02:01 load avg: 0.68 [189/391] test_iterlen
0:02:01 load avg: 0.68 [190/391] test_itertools
0:02:06 load avg: 0.71 [191/391] test_json
0:02:08 load avg: 0.73 [192/391] test_kqueue
test_kqueue skipped -- test works only on BSD
0:02:08 load avg: 0.73 [193/391] test_largefile -- test_kqueue skipped
0:02:08 load avg: 0.73 [194/391] test_lib2to3
0:02:30 load avg: 0.81 [195/391] test_linecache
0:02:30 load avg: 0.81 [196/391] test_linuxaudiodev
test_linuxaudiodev skipped -- Use of the `audio' resource not enabled
0:02:30 load avg: 0.81 [197/391] test_list -- test_linuxaudiodev skipped (resource denied)
0:02:30 load avg: 0.81 [198/391] test_logging
0:02:41 load avg: 0.68 [199/391] test_long
0:02:43 load avg: 0.71 [200/391] test_long_future
0:02:46 load avg: 0.71 [201/391] test_longexp
0:02:46 load avg: 0.71 [202/391] test_macos
test_macos skipped -- No module named MacOS
0:02:46 load avg: 0.71 [203/391] test_macostools -- test_macos skipped
test_macostools skipped -- No module named MacOS
0:02:46 load avg: 0.71 [204/391] test_macpath -- test_macostools skipped
0:02:47 load avg: 0.71 [205/391] test_macurl2path
0:02:47 load avg: 0.71 [206/391] test_mailbox
0:02:49 load avg: 0.73 [207/391] test_marshal
0:02:49 load avg: 0.73 [208/391] test_math
0:02:50 load avg: 0.73 [209/391] test_md5
0:02:50 load avg: 0.73 [210/391] test_memoryio
0:02:50 load avg: 0.73 [211/391] test_memoryview
0:02:50 load avg: 0.73 [212/391] test_mhlib
0:02:50 load avg: 0.73 [213/391] test_mimetools
0:02:51 load avg: 0.73 [214/391] test_mimetypes
0:02:51 load avg: 0.73 [215/391] test_minidom
0:02:51 load avg: 0.73 [216/391] test_mmap
0:02:51 load avg: 0.73 [217/391] test_module
0:02:51 load avg: 0.73 [218/391] test_modulefinder
0:02:52 load avg: 0.73 [219/391] test_msilib
test_msilib skipped -- No module named _msi
0:02:52 load avg: 0.73 [220/391] test_multibytecodec -- test_msilib skipped
0:02:53 load avg: 0.75 [221/391] test_multifile
0:02:53 load avg: 0.75 [222/391] test_multiprocessing
0:03:21 load avg: 0.55 [223/391] test_mutants
0:03:21 load avg: 0.55 [224/391] test_mutex
0:03:21 load avg: 0.55 [225/391] test_netrc
0:03:21 load avg: 0.55 [226/391] test_new
0:03:22 load avg: 0.55 [227/391] test_nntplib
0:03:22 load avg: 0.55 [228/391] test_normalization
0:03:22 load avg: 0.55 [229/391] test_ntpath
0:03:22 load avg: 0.55 [230/391] test_old_mailbox
0:03:22 load avg: 0.55 [231/391] test_operator
0:03:22 load avg: 0.55 [232/391] test_optparse
0:03:23 load avg: 0.59 [233/391] test_ordered_dict
0:03:24 load avg: 0.59 [234/391] test_os
0:03:24 load avg: 0.59 [235/391] test_ossaudiodev
test_ossaudiodev skipped -- Use of the `audio' resource not enabled
0:03:24 load avg: 0.59 [236/391] test_parser -- test_ossaudiodev skipped (resource denied)
0:03:25 load avg: 0.59 [237/391] test_pdb
0:03:25 load avg: 0.59 [238/391] test_peepholer
0:03:25 load avg: 0.59 [239/391] test_pep247
0:03:25 load avg: 0.59 [240/391] test_pep277
0:03:25 load avg: 0.59 [241/391] test_pep352
0:03:26 load avg: 0.59 [242/391] test_pickle
0:03:28 load avg: 0.62 [243/391] test_pickletools
0:03:28 load avg: 0.62 [244/391] test_pipes
0:03:28 load avg: 0.62 [245/391] test_pkg
0:03:29 load avg: 0.62 [246/391] test_pkgimport
0:03:29 load avg: 0.62 [247/391] test_pkgutil
0:03:29 load avg: 0.62 [248/391] test_platform
0:03:29 load avg: 0.62 [249/391] test_plistlib
0:03:29 load avg: 0.62 [250/391] test_poll
0:03:40 load avg: 0.53 [251/391] test_popen
0:03:41 load avg: 0.53 [252/391] test_popen2
0:03:41 load avg: 0.53 [253/391] test_poplib
0:03:43 load avg: 0.48 [254/391] test_posixpath
0:03:44 load avg: 0.48 [255/391] test_pow
0:03:44 load avg: 0.48 [256/391] test_pprint
0:03:44 load avg: 0.48 [257/391] test_print
0:03:44 load avg: 0.48 [258/391] test_profile
0:03:44 load avg: 0.48 [259/391] test_property
0:03:44 load avg: 0.48 [260/391] test_pstats
0:03:45 load avg: 0.48 [261/391] test_pwd
0:03:45 load avg: 0.48 [262/391] test_py3kwarn
test_py3kwarn skipped -- test.test_py3kwarn must be run with the -3 flag
0:03:45 load avg: 0.48 [263/391] test_py_compile -- test_py3kwarn skipped
0:03:45 load avg: 0.48 [264/391] test_pyclbr
0:03:46 load avg: 0.48 [265/391] test_pyexpat
0:03:46 load avg: 0.48 [266/391] test_queue
0:03:50 load avg: 0.45 [267/391] test_quopri
0:03:50 load avg: 0.45 [268/391] test_random
0:03:51 load avg: 0.45 [269/391] test_re
0:03:51 load avg: 0.45 [270/391] test_readline
0:03:52 load avg: 0.45 [271/391] test_regrtest
0:03:55 load avg: 0.49 [272/391] test_repr
0:03:55 load avg: 0.49 [273/391] test_rfc822
0:03:55 load avg: 0.49 [274/391] test_richcmp
0:03:55 load avg: 0.49 [275/391] test_rlcompleter
0:03:55 load avg: 0.49 [276/391] test_robotparser
0:03:55 load avg: 0.49 [277/391] test_runpy
0:03:59 load avg: 0.53 [278/391] test_sax
0:03:59 load avg: 0.53 [279/391] test_scope
0:04:00 load avg: 0.53 [280/391] test_scriptpackages
test_scriptpackages skipped -- No module named aetools
0:04:00 load avg: 0.53 [281/391] test_select -- test_scriptpackages skipped
0:04:11 load avg: 0.45 [282/391] test_set
0:04:12 load avg: 0.45 [283/391] test_setcomps
0:04:12 load avg: 0.45 [284/391] test_sets
0:04:13 load avg: 0.49 [285/391] test_sgmllib
0:04:13 load avg: 0.49 [286/391] test_sha
0:04:13 load avg: 0.49 [287/391] test_shelve
0:04:14 load avg: 0.49 [288/391] test_shlex
0:04:14 load avg: 0.49 [289/391] test_shutil
0:04:14 load avg: 0.49 [290/391] test_signal
0:04:23 load avg: 0.42 [291/391] test_site
0:04:23 load avg: 0.42 [292/391] test_slice
0:04:23 load avg: 0.42 [293/391] test_smtplib
0:04:24 load avg: 0.42 [294/391] test_smtpnet
test_smtpnet skipped -- Use of the `network' resource not enabled
0:04:24 load avg: 0.42 [295/391] test_socketserver -- test_smtpnet skipped (resource denied)
test_socketserver skipped -- Use of the `network' resource not enabled
0:04:24 load avg: 0.42 [296/391] test_softspace -- test_socketserver skipped (resource denied)
0:04:24 load avg: 0.42 [297/391] test_sort
0:04:24 load avg: 0.42 [298/391] test_source_encoding
0:04:25 load avg: 0.42 [299/391] test_spwd
0:04:25 load avg: 0.42 [300/391] test_sqlite
0:04:26 load avg: 0.42 [301/391] test_ssl
test test_ssl failed -- multiple errors occurred; run in verbose mode for details
0:04:28 load avg: 0.42 [302/391/1] test_startfile -- test_ssl failed
test_startfile skipped -- module 'os' has no attribute 'startfile'
0:04:28 load avg: 0.46 [303/391/1] test_stat -- test_startfile skipped
0:04:28 load avg: 0.46 [304/391/1] test_str
0:04:29 load avg: 0.46 [305/391/1] test_strftime
0:04:29 load avg: 0.46 [306/391/1] test_string
0:04:30 load avg: 0.46 [307/391/1] test_stringprep
0:04:30 load avg: 0.46 [308/391/1] test_strop
0:04:31 load avg: 0.46 [309/391/1] test_strptime
0:04:31 load avg: 0.46 [310/391/1] test_strtod
0:04:32 load avg: 0.46 [311/391/1] test_struct
0:04:33 load avg: 0.51 [312/391/1] test_structmembers
0:04:33 load avg: 0.51 [313/391/1] test_structseq
0:04:34 load avg: 0.51 [314/391/1] test_subprocess
0:05:55 load avg: 0.92 [315/391/1] test_sunau -- test_subprocess passed in 1 min 21 sec
0:05:55 load avg: 0.92 [316/391/1] test_sunaudiodev
test_sunaudiodev skipped -- No module named sunaudiodev
0:05:55 load avg: 0.92 [317/391/1] test_sundry -- test_sunaudiodev skipped
0:05:55 load avg: 0.92 [318/391/1] test_symtable
0:05:55 load avg: 0.92 [319/391/1] test_syntax
0:05:56 load avg: 0.92 [320/391/1] test_sys
0:05:56 load avg: 0.92 [321/391/1] test_sys_setprofile
0:05:56 load avg: 0.92 [322/391/1] test_sys_settrace
0:05:57 load avg: 0.92 [323/391/1] test_sysconfig
0:05:57 load avg: 0.92 [324/391/1] test_tarfile
0:05:59 load avg: 0.93 [325/391/1] test_tcl
0:05:59 load avg: 0.93 [326/391/1] test_telnetlib
0:06:04 load avg: 0.93 [327/391/1] test_tempfile
0:06:05 load avg: 0.93 [328/391/1] test_test_support
0:06:05 load avg: 0.93 [329/391/1] test_textwrap
0:06:05 load avg: 0.93 [330/391/1] test_thread
0:06:06 load avg: 0.93 [331/391/1] test_threaded_import
0:06:06 load avg: 0.93 [332/391/1] test_threadedtempfile
0:06:06 load avg: 0.93 [333/391/1] test_threading
0:06:10 load avg: 1.02 [334/391/1] test_threading_local
0:06:11 load avg: 1.02 [335/391/1] test_threadsignals
0:06:11 load avg: 1.02 [336/391/1] test_time
0:06:13 load avg: 0.94 [337/391/1] test_timeit
0:06:13 load avg: 0.94 [338/391/1] test_timeout
test_timeout skipped -- Use of the `network' resource not enabled
0:06:13 load avg: 0.94 [339/391/1] test_tk -- test_timeout skipped (resource denied)
test_tk skipped -- Use of the `gui' resource not enabled
0:06:13 load avg: 0.94 [340/391/1] test_tokenize -- test_tk skipped (resource denied)
0:06:14 load avg: 0.94 [341/391/1] test_tools
recursedown('@test_5877_tmp')
0:06:15 load avg: 0.94 [342/391/1] test_trace
0:06:17 load avg: 0.94 [343/391/1] test_traceback
0:06:22 load avg: 0.86 [344/391/1] test_transformer
0:06:22 load avg: 0.86 [345/391/1] test_ttk_guionly
test_ttk_guionly skipped -- Use of the `gui' resource not enabled
0:06:22 load avg: 0.86 [346/391/1] test_ttk_textonly -- test_ttk_guionly skipped (resource denied)
0:06:22 load avg: 0.86 [347/391/1] test_tuple
0:06:32 load avg: 0.88 [348/391/1] test_turtle
0:06:32 load avg: 0.88 [349/391/1] test_typechecks
0:06:32 load avg: 0.88 [350/391/1] test_ucn
0:06:32 load avg: 0.88 [351/391/1] test_unary
0:06:33 load avg: 0.88 [352/391/1] test_undocumented_details
0:06:33 load avg: 0.88 [353/391/1] test_unicode
0:06:46 load avg: 0.91 [354/391/1] test_unicode_file
0:06:46 load avg: 0.91 [355/391/1] test_unicodedata
0:06:49 load avg: 0.92 [356/391/1] test_univnewlines
0:06:49 load avg: 0.92 [357/391/1] test_univnewlines2k
0:06:49 load avg: 0.92 [358/391/1] test_unpack
0:06:49 load avg: 0.92 [359/391/1] test_urllib
0:06:49 load avg: 0.92 [360/391/1] test_urllib2_localnet
0:06:50 load avg: 0.92 [361/391/1] test_urllib2net
test_urllib2net skipped -- Use of the `network' resource not enabled
0:06:50 load avg: 0.92 [362/391/1] test_urllibnet -- test_urllib2net skipped (resource denied)
test_urllibnet skipped -- Use of the `network' resource not enabled
0:06:50 load avg: 0.92 [363/391/1] test_urlparse -- test_urllibnet skipped (resource denied)
0:06:50 load avg: 0.92 [364/391/1] test_userdict
0:06:51 load avg: 0.92 [365/391/1] test_userlist
0:06:52 load avg: 0.92 [366/391/1] test_userstring
0:06:55 load avg: 0.92 [367/391/1] test_uu
0:06:55 load avg: 0.92 [368/391/1] test_uuid
0:06:56 load avg: 0.92 [369/391/1] test_wait3
0:07:01 load avg: 0.85 [370/391/1] test_wait4
0:07:07 load avg: 0.78 [371/391/1] test_warnings
0:07:08 load avg: 0.78 [372/391/1] test_wave
0:07:08 load avg: 0.80 [373/391/1] test_weakref
0:08:50 load avg: 0.96 [374/391/1] test_weakset -- test_weakref passed in 1 min 42 sec
0:08:50 load avg: 0.96 [375/391/1] test_whichdb
0:08:51 load avg: 0.96 [376/391/1] test_winreg
test_winreg skipped -- No module named _winreg
0:08:51 load avg: 0.96 [377/391/1] test_winsound -- test_winreg skipped
test_winsound skipped -- Use of the `audio' resource not enabled
0:08:51 load avg: 0.96 [378/391/1] test_with -- test_winsound skipped (resource denied)
0:08:51 load avg: 0.96 [379/391/1] test_wsgiref
0:08:51 load avg: 0.96 [380/391/1] test_xdrlib
0:08:51 load avg: 0.96 [381/391/1] test_xml_etree
0:08:52 load avg: 0.96 [382/391/1] test_xml_etree_c
0:08:52 load avg: 0.96 [383/391/1] test_xmllib
0:08:53 load avg: 0.96 [384/391/1] test_xmlrpc
0:08:56 load avg: 0.97 [385/391/1] test_xpickle
0:08:56 load avg: 0.97 [386/391/1] test_xrange
0:08:57 load avg: 0.97 [387/391/1] test_zipfile
0:09:00 load avg: 0.97 [388/391/1] test_zipfile64
test_zipfile64 skipped -- test requires loads of disk-space bytes and a long time to run
0:09:00 load avg: 0.97 [389/391/1] test_zipimport -- test_zipfile64 skipped (resource denied)
0:09:01 load avg: 0.97 [390/391/1] test_zipimport_support
0:09:01 load avg: 0.97 [391/391/1] test_zlib
354 tests OK.
1 test failed:
    test_ssl
36 tests skipped:
    test_aepack test_al test_applesingle test_bsddb185 test_bsddb3
    test_cd test_cl test_codecmaps_cn test_codecmaps_hk
    test_codecmaps_jp test_codecmaps_kr test_codecmaps_tw test_curses
    test_gl test_imgfile test_ioctl test_kqueue test_linuxaudiodev
    test_macos test_macostools test_msilib test_ossaudiodev
    test_py3kwarn test_scriptpackages test_smtpnet test_socketserver
    test_startfile test_sunaudiodev test_timeout test_tk
    test_ttk_guionly test_urllib2net test_urllibnet test_winreg
    test_winsound test_zipfile64
1 skip unexpected on linux2:
    test_ioctl
Re-running failed tests in verbose mode
Re-running test 'test_ssl' in verbose mode
test_ssl: testing with 'OpenSSL 1.1.1  11 Sep 2018' (1, 1, 1, 0, 15)
          under Linux ('PLD Linux (Th)', '3.0', '')
          HAS_SNI = True
          OP_ALL = 0x-7fffffac
          OP_NO_TLSv1_1 = 0x10000000
test__create_stdlib_context (test.test_ssl.ContextTests) ... ok
test__https_verify_certificates (test.test_ssl.ContextTests) ... ok
test__https_verify_envvar (test.test_ssl.ContextTests) ... ok
test_cert_store_stats (test.test_ssl.ContextTests) ... ok
test_check_hostname (test.test_ssl.ContextTests) ... ok
test_ciphers (test.test_ssl.ContextTests) ... ok
test_constructor (test.test_ssl.ContextTests) ... ok
test_create_default_context (test.test_ssl.ContextTests) ... ok
test_get_ca_certs (test.test_ssl.ContextTests) ... ok
test_load_cert_chain (test.test_ssl.ContextTests) ... ok
test_load_default_certs (test.test_ssl.ContextTests) ... ok
test_load_default_certs_env (test.test_ssl.ContextTests) ... ok
test_load_default_certs_env_windows (test.test_ssl.ContextTests) ... skipped 'Windows specific'
test_load_dh_params (test.test_ssl.ContextTests) ... ok
test_load_verify_cadata (test.test_ssl.ContextTests) ... ok
test_load_verify_locations (test.test_ssl.ContextTests) ... ok
test_options (test.test_ssl.ContextTests) ... FAIL
test_protocol (test.test_ssl.ContextTests) ... ok
test_session_stats (test.test_ssl.ContextTests) ... ok
test_set_default_verify_paths (test.test_ssl.ContextTests) ... ok
test_set_ecdh_curve (test.test_ssl.ContextTests) ... ok
test_sni_callback (test.test_ssl.ContextTests) ... ok
test_sni_callback_refcycle (test.test_ssl.ContextTests) ... ok
test_verify_flags (test.test_ssl.ContextTests) ... ok
test_verify_mode (test.test_ssl.ContextTests) ... ok
test_sslwrap_simple (test.test_ssl.BasicTests) ... ok
test_DER_to_PEM (test.test_ssl.BasicSocketTests) ... ok
test_asn1object (test.test_ssl.BasicSocketTests) ... ok
test_cert_time_to_seconds (test.test_ssl.BasicSocketTests) ... ok
test_cert_time_to_seconds_locale (test.test_ssl.BasicSocketTests) ... skipped 'locale-specific month name needs to be different from C locale'
test_cert_time_to_seconds_timezone (test.test_ssl.BasicSocketTests) ... ok
test_constants (test.test_ssl.BasicSocketTests) ... ok
test_empty_cert (test.test_ssl.BasicSocketTests)
Wrapping with an empty cert file ... ok
test_enum_certificates (test.test_ssl.BasicSocketTests) ... skipped 'Windows specific'
test_enum_crls (test.test_ssl.BasicSocketTests) ... skipped 'Windows specific'
test_errors (test.test_ssl.BasicSocketTests) ... ok
test_get_default_verify_paths (test.test_ssl.BasicSocketTests) ... ok
test_malformed_cert (test.test_ssl.BasicSocketTests)
Wrapping with a badly formatted certificate (syntax error) ... ok
test_malformed_key (test.test_ssl.BasicSocketTests)
Wrapping with a badly formatted key (syntax error) ... ok
test_match_hostname (test.test_ssl.BasicSocketTests) ... ok
test_openssl_version (test.test_ssl.BasicSocketTests) ... ok
test_parse_all_sans (test.test_ssl.BasicSocketTests) ... ok
test_parse_cert (test.test_ssl.BasicSocketTests) ... 
{'issuer': ((('countryName', u'XY'),),
            (('localityName', u'Castle Anthrax'),),
            (('organizationName', u'Python Software Foundation'),),
            (('commonName', u'localhost'),)),
 'notAfter': 'Oct  5 23:01:56 2020 GMT',
 'notBefore': u'Oct  8 23:01:56 2010 GMT',
 'serialNumber': u'D7C7381919AFC24E',
 'subject': ((('countryName', u'XY'),),
             (('localityName', u'Castle Anthrax'),),
             (('organizationName', u'Python Software Foundation'),),
             (('commonName', u'localhost'),)),
 'subjectAltName': (('DNS', 'localhost'),),
 'version': 3L}

{'OCSP': (u'http://ocsp.verisign.com',),
 'caIssuers': (u'http://SVRIntl-G3-aia.verisign.com/SVRIntlG3.cer',),
 'crlDistributionPoints': (u'http://SVRIntl-G3-crl.verisign.com/SVRIntlG3.crl',),
 'issuer': ((('countryName', u'US'),),
            (('organizationName', u'VeriSign, Inc.'),),
            (('organizationalUnitName', u'VeriSign Trust Network'),),
            (('organizationalUnitName',
              u'Terms of use at https://www.verisign.com/rpa (c)10'),),
            (('commonName',
              u'VeriSign Class 3 International Server CA - G3'),)),
 'notAfter': 'Sep 20 23:59:59 2012 GMT',
 'notBefore': u'Sep 21 00:00:00 2011 GMT',
 'serialNumber': u'2EE6EA7640A075CEE5005F4D7C79549A',
 'subject': ((('countryName', u'FI'),),
             (('stateOrProvinceName', u'Espoo'),),
             (('localityName', u'Espoo'),),
             (('organizationName', u'Nokia'),),
             (('organizationalUnitName', u'BI'),),
             (('commonName', u'projects.developer.nokia.com'),)),
 'subjectAltName': (('DNS', 'projects.developer.nokia.com'),
                    ('DNS', 'projects.forum.nokia.com')),
 'version': 3L}
ok
test_parse_cert_CVE_2013_4238 (test.test_ssl.BasicSocketTests) ... 
{'issuer': ((('countryName', u'US'),),
            (('stateOrProvinceName', u'Oregon'),),
            (('localityName', u'Beaverton'),),
            (('organizationName', u'Python Software Foundation'),),
            (('organizationalUnitName', u'Python Core Development'),),
            (('commonName', u'null.python.org\x00example.org'),),
            (('emailAddress', u'python-dev@python.org'),)),
 'notAfter': 'Aug  7 13:12:52 2013 GMT',
 'notBefore': u'Aug  7 13:11:52 2013 GMT',
 'serialNumber': u'00',
 'subject': ((('countryName', u'US'),),
             (('stateOrProvinceName', u'Oregon'),),
             (('localityName', u'Beaverton'),),
             (('organizationName', u'Python Software Foundation'),),
             (('organizationalUnitName', u'Python Core Development'),),
             (('commonName', u'null.python.org\x00example.org'),),
             (('emailAddress', u'python-dev@python.org'),)),
 'subjectAltName': (('DNS', 'altnull.python.org\x00example.com'),
                    ('email', 'null@python.org\x00user@example.org'),
                    ('URI', 'http://null.python.org\x00http://example.org'),
                    ('IP Address', '192.0.2.1'),
                    ('IP Address', '2001:DB8:0:0:0:0:0:1\n')),
 'version': 3L}
ok
test_purpose_enum (test.test_ssl.BasicSocketTests) ... ok
test_random (test.test_ssl.BasicSocketTests) ... 
 RAND_status is 1 (sufficient randomness)
ok
test_refcycle (test.test_ssl.BasicSocketTests) ... ok
test_server_side (test.test_ssl.BasicSocketTests) ... ok
test_timeout (test.test_ssl.BasicSocketTests) ... ok
test_tls_unique_channel_binding (test.test_ssl.BasicSocketTests) ... ok
test_unknown_channel_binding (test.test_ssl.BasicSocketTests) ... ok
test_unsupported_dtls (test.test_ssl.BasicSocketTests) ... ok
test_wrapped_unconnected (test.test_ssl.BasicSocketTests) ... ok
test_lib_reason (test.test_ssl.SSLErrorTests) ... ok
test_str (test.test_ssl.SSLErrorTests) ... ok
test_subclass (test.test_ssl.SSLErrorTests) ... ok
test_alpn_protocols (test.test_ssl.ThreadedTests) ...  server:  new connection from ('127.0.0.1', 33400)
 server: connection cipher is now ('ECDHE-RSA-AES256-GCM-SHA384', 'TLSv1.2', 256)
 server: selected protocol is now None
 client:  sending 'FOO\n'...
 client:  read 'foo\n'
 client:  sending 'FOO\n'...
 client:  read 'foo\n'
 client:  sending 'FOO\n'...
 client:  read 'foo\n'
 client:  closing connection.
 server:  new connection from ('127.0.0.1', 54202)
 server: connection cipher is now ('ECDHE-RSA-AES256-GCM-SHA384', 'TLSv1.2', 256)
 server: selected protocol is now None
 client:  sending 'FOO\n'...
 client:  read 'foo\n'
 client:  sending 'FOO\n'...
 client:  read 'foo\n'
 client:  sending 'FOO\n'...
 client:  read 'foo\n'
 client:  closing connection.
 server:  new connection from ('127.0.0.1', 40946)
 server: connection cipher is now ('ECDHE-RSA-AES256-GCM-SHA384', 'TLSv1.2', 256)
 server: selected protocol is now None
 client:  sending 'FOO\n'...
 client:  read 'foo\n'
 client:  sending 'FOO\n'...
 client:  read 'foo\n'
 client:  sending 'FOO\n'...
 client:  read 'foo\n'
 client:  closing connection.
 server:  new connection from ('127.0.0.1', 56154)
 server: connection cipher is now ('ECDHE-RSA-AES256-GCM-SHA384', 'TLSv1.2', 256)
 server: selected protocol is now None
 client:  sending 'FOO\n'...
 client:  read 'foo\n'
 client:  sending 'FOO\n'...
 client:  read 'foo\n'
 client:  sending 'FOO\n'...
 client:  read 'foo\n'
 client:  closing connection.
ok
test_asyncore_server (test.test_ssl.ThreadedTests)
Check the example asyncore integration. ... 
 server:  new connection from 127.0.0.1:38802
 client:  sending 'FOO\n'...
 server:  read 'FOO\n' from client
 client:  read 'foo\n'
 client:  closing connection.
 client:  connection closed.
 cleanup: stopping server.
 cleanup: joining server thread.
 server:  read 'over\n' from client
 server:  closed connection <ssl.SSLSocket object at 0xf188733c>
 server:  read '' from client
 cleanup: successfully joined.
ok
test_check_hostname (test.test_ssl.ThreadedTests) ... 
 server:  new connection from ('127.0.0.1', 46368)
 server: connection cipher is now ('ECDHE-RSA-AES256-SHA', 'TLSv1.0', 256)
 server: selected protocol is now None
 server:  new connection from ('127.0.0.1', 35616)
 server: connection cipher is now ('ECDHE-RSA-AES256-SHA', 'TLSv1.0', 256)
 server: selected protocol is now None
ok
test_compression (test.test_ssl.ThreadedTests) ...  server:  new connection from ('127.0.0.1', 38808)
 server: connection cipher is now ('ECDHE-RSA-AES256-SHA', 'TLSv1.0', 256)
 server: selected protocol is now None
 client:  sending 'FOO\n'...
 client:  read 'foo\n'
 client:  sending 'FOO\n'...
 client:  read 'foo\n'
 client:  sending 'FOO\n'...
 client:  read 'foo\n'
 client:  closing connection.
 got compression: None
ok
test_compression_disabled (test.test_ssl.ThreadedTests) ...  server:  new connection from ('127.0.0.1', 39266)
 server: connection cipher is now ('ECDHE-RSA-AES256-SHA', 'TLSv1.0', 256)
 server: selected protocol is now None
 client:  sending 'FOO\n'...
 client:  read 'foo\n'
 client:  sending 'FOO\n'...
 client:  read 'foo\n'
 client:  sending 'FOO\n'...
 client:  read 'foo\n'
 client:  closing connection.
ok
test_crl_check (test.test_ssl.ThreadedTests) ... 
 server:  new connection from ('127.0.0.1', 39910)
 server: connection cipher is now ('ECDHE-RSA-AES256-SHA', 'TLSv1.0', 256)
 server: selected protocol is now None
 server:  new connection from ('127.0.0.1', 39616)

 server:  bad connection attempt from ('127.0.0.1', 39616):
Traceback (most recent call last):
   File "/tmp/B.nglcTi/BUILD/Python-2.7.15/Lib/test/test_ssl.py", line 1663, in wrap_conn
    self.sock, server_side=True)
   File "/tmp/B.nglcTi/BUILD/Python-2.7.15/Lib/ssl.py", line 369, in wrap_socket
    _context=self)
   File "/tmp/B.nglcTi/BUILD/Python-2.7.15/Lib/ssl.py", line 617, in __init__
    self.do_handshake()
   File "/tmp/B.nglcTi/BUILD/Python-2.7.15/Lib/ssl.py", line 846, in do_handshake
    self._sslobj.do_handshake()
 SSLError: [SSL: TLSV1_ALERT_UNKNOWN_CA] tlsv1 alert unknown ca (_ssl.c:726)
 server:  new connection from ('127.0.0.1', 56094)
 server: connection cipher is now ('ECDHE-RSA-AES256-SHA', 'TLSv1.0', 256)
 server: selected protocol is now None
ok
test_default_ciphers (test.test_ssl.ThreadedTests) ... FAIL
test_default_ecdh_curve (test.test_ssl.ThreadedTests) ...  server:  new connection from ('127.0.0.1', 39714)
 server: connection cipher is now ('TLS_AES_256_GCM_SHA384', 'TLSv1.3', 256)
 server: selected protocol is now None
FAIL
test_dh_params (test.test_ssl.ThreadedTests) ...  server:  new connection from ('127.0.0.1', 33856)
 server: connection cipher is now ('DHE-RSA-AES256-SHA', 'SSLv3', 256)
 server: selected protocol is now None
 client:  sending 'FOO\n'...
 client:  read 'foo\n'
 client:  sending 'FOO\n'...
 client:  read 'foo\n'
 client:  sending 'FOO\n'...
 client:  read 'foo\n'
 client:  closing connection.
ok
test_do_handshake_enotconn (test.test_ssl.ThreadedTests) ... ok
test_echo (test.test_ssl.ThreadedTests)
Basic test of an SSL client connecting to a server ... 
 server:  new connection from ('127.0.0.1', 53124)
 client:  sending 'FOO\n'...
 server: connection cipher is now ('TLS_AES_256_GCM_SHA384', 'TLSv1.3', 256)
 server: selected protocol is now None
 client:  read 'foo\n'
 client:  sending 'FOO\n'...
 client:  read 'foo\n'
 client:  sending 'FOO\n'...
 client:  read 'foo\n'
 client:  closing connection.
 server:  new connection from ('127.0.0.1', 60590)
 server: connection cipher is now ('ECDHE-RSA-AES256-SHA', 'TLSv1.0', 256)
 server: selected protocol is now None
 client:  sending 'FOO\n'...
 client:  read 'foo\n'
 client:  sending 'FOO\n'...
 client:  read 'foo\n'
 client:  sending 'FOO\n'...
 client:  read 'foo\n'
 client:  closing connection.
 server:  new connection from ('127.0.0.1', 56068)
 server: connection cipher is now ('ECDHE-RSA-AES256-SHA', 'TLSv1.0', 256)
 server: selected protocol is now None
 client:  sending 'FOO\n'...
 client:  read 'foo\n'
 client:  sending 'FOO\n'...
 client:  read 'foo\n'
 client:  sending 'FOO\n'...
 client:  read 'foo\n'
 client:  closing connection.
 server:  new connection from ('127.0.0.1', 43620)
 server: connection cipher is now ('ECDHE-RSA-AES256-GCM-SHA384', 'TLSv1.2', 256)
 server: selected protocol is now None
 client:  sending 'FOO\n'...
 client:  read 'foo\n'
 client:  sending 'FOO\n'...
 client:  read 'foo\n'
 client:  sending 'FOO\n'...
 client:  read 'foo\n'
 client:  closing connection.
ok
test_getpeercert (test.test_ssl.ThreadedTests) ... Exception in thread Thread-1473:
Traceback (most recent call last):
  File "/tmp/B.nglcTi/BUILD/Python-2.7.15/Lib/threading.py", line 801, in __bootstrap_inner
    self.run()
  File "/tmp/B.nglcTi/BUILD/Python-2.7.15/Lib/test/test_ssl.py", line 1723, in run
    msg = self.read()
  File "/tmp/B.nglcTi/BUILD/Python-2.7.15/Lib/test/test_ssl.py", line 1700, in read
    return self.sslconn.read()
  File "/tmp/B.nglcTi/BUILD/Python-2.7.15/Lib/ssl.py", line 659, in read
    v = self._sslobj.read(len)
error: [Errno 104] Connection reset by peer


{'issuer': ((('countryName', u'XY'),),
            (('localityName', u'Castle Anthrax'),),
            (('organizationName', u'Python Software Foundation'),),
            (('commonName', u'localhost'),)),
 'notAfter': 'Oct  5 23:01:56 2020 GMT',
 'notBefore': u'Oct  8 23:01:56 2010 GMT',
 'serialNumber': u'D7C7381919AFC24E',
 'subject': ((('countryName', u'XY'),),
             (('localityName', u'Castle Anthrax'),),
             (('organizationName', u'Python Software Foundation'),),
             (('commonName', u'localhost'),)),
 'subjectAltName': (('DNS', 'localhost'),),
 'version': 3L}
Connection cipher is ('TLS_AES_256_GCM_SHA384', 'TLSv1.3', 256).
ok
test_getpeercert_enotconn (test.test_ssl.ThreadedTests) ... ok
test_handshake_timeout (test.test_ssl.ThreadedTests) ... ok
test_npn_protocols (test.test_ssl.ThreadedTests) ... skipped 'NPN support needed for this test'
test_protocol_sslv2 (test.test_ssl.ThreadedTests)
Connecting to an SSLv2 server with various client options ... skipped 'OpenSSL is compiled without SSLv2 support'
test_protocol_sslv23 (test.test_ssl.ThreadedTests)
Connecting to an SSLv23 server with various client options ... 
 PROTOCOL_TLS->PROTOCOL_TLS CERT_NONE
 PROTOCOL_TLSv1->PROTOCOL_TLS CERT_NONE
 PROTOCOL_TLS->PROTOCOL_TLS CERT_OPTIONAL
 PROTOCOL_TLSv1->PROTOCOL_TLS CERT_OPTIONAL
 PROTOCOL_TLS->PROTOCOL_TLS CERT_REQUIRED
 PROTOCOL_TLSv1->PROTOCOL_TLS CERT_REQUIRED
 PROTOCOL_TLS->PROTOCOL_TLS CERT_NONE
 {PROTOCOL_TLSv1->PROTOCOL_TLS} CERT_NONE
ok
test_protocol_sslv3 (test.test_ssl.ThreadedTests)
Connecting to an SSLv3 server with various client options ... skipped 'OpenSSL is compiled without SSLv3 support'
test_protocol_tlsv1 (test.test_ssl.ThreadedTests)
Connecting to a TLSv1 server with various client options ... 
 PROTOCOL_TLSv1->PROTOCOL_TLSv1 CERT_NONE
 PROTOCOL_TLSv1->PROTOCOL_TLSv1 CERT_OPTIONAL
 PROTOCOL_TLSv1->PROTOCOL_TLSv1 CERT_REQUIRED
 {PROTOCOL_TLS->PROTOCOL_TLSv1} CERT_NONE
ok
test_protocol_tlsv1_1 (test.test_ssl.ThreadedTests)
Connecting to a TLSv1.1 server with various client options. ... 
 PROTOCOL_TLSv1_1->PROTOCOL_TLSv1_1 CERT_NONE
 {PROTOCOL_TLS->PROTOCOL_TLSv1_1} CERT_NONE
 PROTOCOL_TLSv1_1->PROTOCOL_TLS CERT_NONE
 {PROTOCOL_TLSv1->PROTOCOL_TLSv1_1} CERT_NONE
 {PROTOCOL_TLSv1_1->PROTOCOL_TLSv1} CERT_NONE
ok
test_protocol_tlsv1_2 (test.test_ssl.ThreadedTests)
Connecting to a TLSv1.2 server with various client options. ... 
 PROTOCOL_TLSv1_2->PROTOCOL_TLSv1_2 CERT_NONE
 {PROTOCOL_TLS->PROTOCOL_TLSv1_2} CERT_NONE
 PROTOCOL_TLSv1_2->PROTOCOL_TLS CERT_NONE
 {PROTOCOL_TLSv1->PROTOCOL_TLSv1_2} CERT_NONE
 {PROTOCOL_TLSv1_2->PROTOCOL_TLSv1} CERT_NONE
 {PROTOCOL_TLSv1_1->PROTOCOL_TLSv1_2} CERT_NONE
 {PROTOCOL_TLSv1_2->PROTOCOL_TLSv1_1} CERT_NONE
ok
test_read_write_after_close_raises_valuerror (test.test_ssl.ThreadedTests) ... ok
test_recv_send (test.test_ssl.ThreadedTests)
Test recv(), send() and friends. ... 
 server:  new connection from ('127.0.0.1', 39328)
 server: connection cipher is now ('ECDHE-RSA-AES256-SHA', 'TLSv1.0', 256)
 server: selected protocol is now None
ok
test_recv_zero (test.test_ssl.ThreadedTests) ...  server:  new connection from ('127.0.0.1', 42196)
 server: connection cipher is now ('TLS_AES_256_GCM_SHA384', 'TLSv1.3', 256)
 server: selected protocol is now None
ok
test_rude_shutdown (test.test_ssl.ThreadedTests)
A brutal shutdown of an SSL server should raise an OSError ... ok
test_selected_alpn_protocol (test.test_ssl.ThreadedTests) ...  server:  new connection from ('127.0.0.1', 57794)
 server: connection cipher is now ('ECDHE-RSA-AES256-SHA', 'TLSv1.0', 256)
 server: selected protocol is now None
 client:  sending 'FOO\n'...
 client:  read 'foo\n'
 client:  sending 'FOO\n'...
 client:  read 'foo\n'
 client:  sending 'FOO\n'...
 client:  read 'foo\n'
 client:  closing connection.
ok
test_selected_alpn_protocol_if_server_uses_alpn (test.test_ssl.ThreadedTests) ...  server:  new connection from ('127.0.0.1', 55502)
 server: connection cipher is now ('ECDHE-RSA-AES256-SHA', 'TLSv1.0', 256)
 server: selected protocol is now None
 client:  sending 'FOO\n'...
 client:  read 'foo\n'
 client:  sending 'FOO\n'...
 client:  read 'foo\n'
 client:  sending 'FOO\n'...
 client:  read 'foo\n'
 client:  closing connection.
ok
test_selected_npn_protocol (test.test_ssl.ThreadedTests) ...  server:  new connection from ('127.0.0.1', 42758)
 server: connection cipher is now ('ECDHE-RSA-AES256-SHA', 'TLSv1.0', 256)
 server: selected protocol is now None
 client:  sending 'FOO\n'...
 client:  read 'foo\n'
 client:  sending 'FOO\n'...
 client:  read 'foo\n'
 client:  sending 'FOO\n'...
 client:  read 'foo\n'
 client:  closing connection.
ok
test_server_accept (test.test_ssl.ThreadedTests) ... ok
test_sni_callback (test.test_ssl.ThreadedTests) ...  server:  new connection from ('127.0.0.1', 57550)
 server: connection cipher is now ('ECDHE-RSA-AES256-SHA', 'TLSv1.0', 256)
 server: selected protocol is now None
 server:  new connection from ('127.0.0.1', 44220)
 server: connection cipher is now ('ECDHE-RSA-AES256-SHA', 'TLSv1.0', 256)
 server: selected protocol is now None
 server:  new connection from ('127.0.0.1', 32838)
 server: connection cipher is now ('ECDHE-RSA-AES256-SHA', 'TLSv1.0', 256)
 server: selected protocol is now None
ok
test_sni_callback_alert (test.test_ssl.ThreadedTests) ... ok
test_sni_callback_raising (test.test_ssl.ThreadedTests) ... ok
test_sni_callback_wrong_return_type (test.test_ssl.ThreadedTests) ... ok
test_socketserver (test.test_ssl.ThreadedTests)
Using a SocketServer to create and manage SSL connections. ... 
 server (('127.0.0.1', 36799):36799 ('TLS_AES_256_GCM_SHA384', 'TLSv1.3', 256)):
   [14/Sep/2018 07:31:34] "GET /keycert.pem HTTP/1.1" 200 -
 client: read 1783 bytes from remote server '<HTTPSServerThread <HTTPSServer localhost:36799>>'
stopping HTTPS server
joining HTTPS thread
ok
test_starttls (test.test_ssl.ThreadedTests)
Switching from clear text to encrypted and back again. ... 
 client:  sending 'msg 1'...
 server:  new connection from ('127.0.0.1', 51244)
 server: read 'msg 1' (unencrypted), sending back 'msg 1' (unencrypted)...
 client:  read 'msg 1' from server
 client:  sending 'MSG 2'...
 server: read 'MSG 2' (unencrypted), sending back 'msg 2' (unencrypted)...
 client:  read 'msg 2' from server
 client:  sending 'STARTTLS'...
 server: read STARTTLS from client, sending OK...
 client:  read 'ok' from server, starting TLS...
 server: connection cipher is now ('ECDHE-RSA-AES256-SHA', 'TLSv1.0', 256)
 server: selected protocol is now None
 client:  sending 'MSG 3'...
 server: read 'MSG 3' (encrypted), sending back 'msg 3' (encrypted)...
 client:  read 'msg 3' from server
 client:  sending 'msg 4'...
 server: read 'msg 4' (encrypted), sending back 'msg 4' (encrypted)...
 client:  read 'msg 4' from server
 client:  sending 'ENDTLS'...
 server: read ENDTLS from client, sending OK...
 client:  read 'ok' from server, ending TLS...
 server: connection is now unencrypted...
 client:  sending 'msg 5'...
 server: read 'msg 5' (unencrypted), sending back 'msg 5' (unencrypted)...
 client:  read 'msg 5' from server
 client:  sending 'msg 6'...
 server: read 'msg 6' (unencrypted), sending back 'msg 6' (unencrypted)...
 client:  read 'msg 6' from server
 client:  closing connection.
 server: client closed connection
ok
test_tls1_3 (test.test_ssl.ThreadedTests) ... ERROR
test_tls_unique_channel_binding (test.test_ssl.ThreadedTests)
Test tls-unique channel binding. ... 
 server:  new connection from ('127.0.0.1', 42090)
 server: connection cipher is now ('ECDHE-RSA-AES256-SHA', 'TLSv1.0', 256)
 server: selected protocol is now None
 got channel binding data: '{\x1c\x1b\x14/)J \xa7\x9fW\xa5'
 server:  new connection from ('127.0.0.1', 42092)
 server: connection cipher is now ('ECDHE-RSA-AES256-SHA', 'TLSv1.0', 256)
 server: selected protocol is now None
 got another channel binding data: 'R\x89o\x98A\x08G\x0c/k\x05\xcb'
ok
test_version_basic (test.test_ssl.ThreadedTests) ... ok
test_wrong_cert (test.test_ssl.ThreadedTests)
Connecting when the server rejects the client's certificate ... test test_ssl failed -- multiple errors occurred

SSLError is SSLError(1, u'[SSL: TLSV1_ALERT_UNKNOWN_CA] tlsv1 alert unknown ca (_ssl.c:726)')
ok

======================================================================
ERROR: test_tls1_3 (test.test_ssl.ThreadedTests)
----------------------------------------------------------------------
Traceback (most recent call last):
  File "/tmp/B.nglcTi/BUILD/Python-2.7.15/Lib/test/test_ssl.py", line 2808, in test_tls1_3
    with context.wrap_socket(socket.socket()) as s:
AttributeError: __exit__

======================================================================
FAIL: test_options (test.test_ssl.ContextTests)
----------------------------------------------------------------------
Traceback (most recent call last):
  File "/tmp/B.nglcTi/BUILD/Python-2.7.15/Lib/test/test_ssl.py", line 780, in test_options
    self.assertEqual(default, ctx.options)
AssertionError: -2113798060 != -2112749484L

======================================================================
FAIL: test_default_ciphers (test.test_ssl.ThreadedTests)
----------------------------------------------------------------------
Traceback (most recent call last):
  File "/tmp/B.nglcTi/BUILD/Python-2.7.15/Lib/test/test_ssl.py", line 2780, in test_default_ciphers
    s.connect((HOST, server.port))
AssertionError: SSLError not raised

======================================================================
FAIL: test_default_ecdh_curve (test.test_ssl.ThreadedTests)
----------------------------------------------------------------------
Traceback (most recent call last):
  File "/tmp/B.nglcTi/BUILD/Python-2.7.15/Lib/test/test_ssl.py", line 2831, in test_default_ecdh_curve
    self.assertIn("ECDH", s.cipher()[0])
AssertionError: 'ECDH' not found in 'TLS_AES_256_GCM_SHA384'

----------------------------------------------------------------------
Ran 95 tests in 1.893s

FAILED (failures=3, errors=1, skipped=7)
1 test failed again:
    test_ssl

Total duration: 9 min 6 sec
Tests result: FAILURE
make: *** [Makefile:880: test] Error 2
error: Bad exit status from /tmp/B.nglcTi/BUILD/tmp/rpm-tmp.50282 (%build)


RPM build errors:
    Bad exit status from /tmp/B.nglcTi/BUILD/tmp/rpm-tmp.50282 (%build)
ended at: Fri Sep 14 07:31:34 2018, done in 0:19:55.272551
error: No files produced.
+ chmod -R u+rwX /tmp/B.nglcTi/BUILD
+ rm -rf /tmp/B.nglcTi/tmp /tmp/B.nglcTi/BUILD
+ rm -rf /tmp/B.nglcTi
Begin-PLD-Builder-Info
Build-Time: user:780.27s sys:250.30s real:1208.42s (faults io:153 non-io:7947423)

End-PLD-Builder-Info
[Back to list of logs] [View rpm -qa of builder]