FailedOk

th/SRPMS[OK]
th/x32[OK]
th/i686[OK]
th/x86_64[OK]

ac/SRPMS[OK]
ac/i386[OK]
ac/i586[OK]
ac/i686[OK]
ac/alpha[OK]
ac/amd64[OK]
ac/athlon[OK]
ac/ppc[OK]
ac/sparc[OK]
ac/sparc64[OK]

Advanced Search
main()
Powered by PLD Linux
(c) 2002-2018 PLD Team
$Revision: 1.37 $
Powered by The Right Thing.
Your IP: 54.158.52.166

python-PyGitUp 194c33d9-5879-4e40-8151-650582596175

Status:Failed
Source URL:ftp://buildlogs.pld-linux.org/th/i686/FAIL/python-PyGitUp,194c33d9-5879-4e40-8151-650582596175.bz2
text/plain URL:View!
rpm -qa of builder:View!
Date:2018/04/04 10:06:27
Runtime:0:00:09.738691

Toc:

  • error 1
  • rpm: error: Failed build dependencies:
  • error 2
  • rpm: error: Failed build dependencies:
  • prep
  • Executing(%prep): /bin/sh -e /tmp/B._7icfw/BUILD/tmp/rpm-tmp.60418
  • build
  • Executing(%build): /bin/sh -e /tmp/B._7icfw/BUILD/tmp/rpm-tmp.60418
  • error 3
  • ERROR: PyGitUp.tests.test_nofetch.test_no_fetch
  • error 4
  • RebaseError: Failed to rebase origin/no-fetch onto no-fetch.2
  • error 5
  • ERROR: PyGitUp.tests.test_rebasing.test_rebasing
  • error 6
  • RebaseError: Failed to rebase origin/rebasing onto rebasing
  • error 7
  • ERROR: PyGitUp.tests.test_stash_error.test_stash_error
  • error 8
  • RebaseError: Failed to rebase origin/stash_error onto stash_error
  • error 9
  • ERROR: <nose.suite.ContextSuite context=PyGitUp.tests.test_submodules>
  • error 10
  • GitCommandError: Cmd('git') failed due to: exit code(128)
  • error 11
  • ERROR: <nose.suite.ContextSuite context=PyGitUp.tests.test_submodules_dirty>
  • error 12
  • GitCommandError: Cmd('git') failed due to: exit code(128)
  • error 13
  • ERROR: PyGitUp.tests.test_unstash_error.test_unstash_error
  • error 14
  • StashError: Stashing failed!
  • error 15
  • error: Test failed: <unittest.runner.TextTestResult run=31 errors=6 failures=0>
  • error 16
  • error: Bad exit status from /tmp/B._7icfw/BUILD/tmp/rpm-tmp.60418 (%build)
  • error 17
  • RPM build errors:
  • error 18
  • error: No files produced.

Content:

request from: baggins
checking if we should skip the build
started at: Wed Apr  4 10:05:56 2018
killing old processes on a builder
sending signal 9 to pid -1
Killed
fetching https://srcbuilder.pld-linux.org/th//srpms/194c33d9-5879-4e40-8151-650582596175/python-PyGitUp-1.4.6-1.src.rpm
fetched 35025 bytes, 107.7 K/s
installing srpm: python-PyGitUp-1.4.6-1.src.rpm
+ install -d /tmp/B._7icfw/BUILD /tmp/B._7icfw/RPMS
+ LC_ALL=en_US.UTF-8
+ rpm -qp --changelog python-PyGitUp-1.4.6-1.src.rpm
* Wed Apr 04 2018 PLD Linux Team <feedback@pld-linux.org>
- For complete changelog see: http://git.pld-linux.org/?p=packages/python-PyGitUp.git;a=log;h=master
* Wed Apr 04 2018 Jan Rękorajski <baggins@pld-linux.org> d81fce0
- removed obsolete patch * Wed Apr 04 2018 Jan Rękorajski <baggins@pld-linux.org> 7f13615
- up to 1.4.6 + rpm -Uhv --nodeps --define '_topdir /tmp/B._7icfw' --define '_specdir %{_topdir}' --define '_sourcedir %{_specdir}' --define '_rpmdir %{_topdir}/RPMS' --define '_builddir %{_topdir}/BUILD' python-PyGitUp-1.4.6-1.src.rpm Preparing... ################################################## python-PyGitUp ################################################## + rm -f python-PyGitUp-1.4.6-1.src.rpm + install -m 700 -d /tmp/B._7icfw/BUILD/tmp + TMPDIR=/tmp/B._7icfw/BUILD/tmp + exec nice -n 0 rpmbuild -bp --short-circuit --nodeps --define '_topdir /tmp/B._7icfw' --define '_specdir %{_topdir}' --define '_sourcedir %{_specdir}' --define '_rpmdir %{_topdir}/RPMS' --define '_builddir %{_topdir}/BUILD' --target i686-pld-linux --define 'prep exit 0' /tmp/B._7icfw/python-PyGitUp.spec Building target platforms: i686-pld-linux checking BuildConflict-ing packages no BuildConflicts found checking BR rpm: error: Failed build dependencies: rpm: python-git >= 2.1.8 is needed by python-PyGitUp-1.4.6-1.src rpm: python-async is needed by python-PyGitUp-1.4.6-1.src rpm: python-colorama >= 0.3.7 is needed by python-PyGitUp-1.4.6-1.src rpm: python-gitdb is needed by python-PyGitUp-1.4.6-1.src rpm: python-smmap is needed by python-PyGitUp-1.4.6-1.src rpm: python-termcolor >= 1.1.0 is needed by python-PyGitUp-1.4.6-1.src rpm: Building target platforms: i686-pld-linux updating poldek cache... ready is up to date Retrieving th::packages.ndir.md... th is up to date Retrieving th::packages.ndir.md... th is up to date Retrieving th-ready::packages.ndir.md... th-ready is up to date Retrieving th-ready::packages.ndir.md... th-ready is up to date Retrieving th-test::packages.ndir.md... Retrieving th-test::packages.ndir.diff.toc.gz... ..............................done Retrieving diff::packages.ndir.2018.04.02-20.06.08.gz... ..............................done Retrieving diff::packages.ndir.dscr.2018.04.02-20.06.08.gz... Loading [pndir]th-test... Applying packages.ndir.2018.04.02-20.06.08.gz... Retrieving diff::packages.ndir.2018.04.03-10.40.01.gz... ..............................done Retrieving diff::packages.ndir.dscr.2018.04.03-10.40.01.gz... Applying packages.ndir.2018.04.03-10.40.01.gz... Retrieving diff::packages.ndir.2018.04.03-13.59.02.gz... ..............................done Retrieving diff::packages.ndir.dscr.2018.04.03-13.59.02.gz... Applying packages.ndir.2018.04.03-13.59.02.gz... Retrieving diff::packages.ndir.2018.04.03-19.22.01.gz... Applying packages.ndir.2018.04.03-19.22.01.gz... Writing /root/.poldek-cache/[...]/packages.ndir.gz... Retrieving th-test::packages.ndir.md... Retrieving th-test::packages.ndir.diff.toc.gz... Retrieving diff::packages.ndir.2018.04.02-19.22.01.gz... Loading [pndir]th-test... Applying packages.ndir.2018.04.02-19.22.01.gz... Retrieving diff::packages.ndir.2018.04.03-01.47.02.gz... Retrieving diff::packages.ndir.dscr.2018.04.03-01.47.02.gz... Applying packages.ndir.2018.04.03-01.47.02.gz... Retrieving diff::packages.ndir.2018.04.03-13.59.01.gz... ..............................done Retrieving diff::packages.ndir.dscr.2018.04.03-13.59.01.gz... Applying packages.ndir.2018.04.03-13.59.01.gz... Retrieving diff::packages.ndir.2018.04.04-07.42.02.gz... Retrieving diff::packages.ndir.dscr.2018.04.04-07.42.02.gz... Applying packages.ndir.2018.04.04-07.42.02.gz... Retrieving diff::packages.ndir.2018.04.04-07.53.02.gz... Retrieving diff::packages.ndir.dscr.2018.04.04-07.53.02.gz... Applying packages.ndir.2018.04.04-07.53.02.gz... Writing /root/.poldek-cache/[...]/packages.ndir.gz... checking conflicting packages in BRed packages poldek: Loading [pndir]ready... poldek: Loading [pndir]th-test... poldek: Loading [pndir]th-test... poldek: Loading [pndir]th-ready... poldek: Loading [pndir]th-ready... poldek: Loading [pndir]th... poldek: Loading [pndir]th... poldek: 27793 packages read poldek: Removed 1060 duplicate packages from available set poldek: Processing dependencies... poldek: There are 6 packages to install: poldek: I python-async-0.6.1-4.i686 python-colorama-0.3.7-1.noarch poldek: I python-git-2.1.9-1.noarch python-gitdb-2.0.3-1.noarch poldek: I python-smmap-2.0.3-1.noarch python-termcolor-1.1.0-2.noarch poldek: This operation will use 2.4MB of disk space. poldek: Need to get 519.5KB of archives (70.2KB to download). poldek: poldek: Retrieving [1/3] th::python-async-0.6.1-4.i686.rpm... poldek: ..............................done poldek: Retrieving [2/3] th::python-colorama-0.3.7-1.noarch.rpm... poldek: ..............................done poldek: Retrieving [3/3] th::python-termcolor-1.1.0-2.noarch.rpm... poldek: ..............................done poldek: Executing pm-command.sh --upgrade -vh --test --root / --define _check_dirname_deps 1... poldek: Preparing... ################################################## no conflicts found checking BR rpm: error: Failed build dependencies: rpm: python-git >= 2.1.8 is needed by python-PyGitUp-1.4.6-1.src rpm: python-async is needed by python-PyGitUp-1.4.6-1.src rpm: python-colorama >= 0.3.7 is needed by python-PyGitUp-1.4.6-1.src rpm: python-gitdb is needed by python-PyGitUp-1.4.6-1.src rpm: python-smmap is needed by python-PyGitUp-1.4.6-1.src rpm: python-termcolor >= 1.1.0 is needed by python-PyGitUp-1.4.6-1.src rpm: Building target platforms: i686-pld-linux installing BR: python\-termcolor python\-git python\-colorama python\-smmap python\-gitdb python\-async + poldek --noask --caplookup -Q -v '--ignore=hhvm-*' '--ignore=php4-*' '--ignore=php52-*' '--ignore=php54-*' '--ignore=php55-*' '--ignore=php56-*' '--ignore=php70-*' '--ignore=php71-*' '--ignore=php72-*' --upgrade python-termcolor python-git python-colorama python-smmap python-gitdb python-async Loading [pndir]ready... Loading [pndir]th-test... Loading [pndir]th-test... Loading [pndir]th-ready... Loading [pndir]th-ready... Loading [pndir]th... Loading [pndir]th... 27793 packages read Removed 1060 duplicate packages from available set Processing dependencies... There are 6 packages to install: I python-async-0.6.1-4.i686 python-colorama-0.3.7-1.noarch I python-git-2.1.9-1.noarch python-gitdb-2.0.3-1.noarch I python-smmap-2.0.3-1.noarch python-termcolor-1.1.0-2.noarch This operation will use 2.4MB of disk space. Need to get 519.5KB of archives. Executing pm-command.sh --upgrade -vh --root / --define _check_dirname_deps 1... Preparing... ################################################## python-async ################################################## python-smmap ################################################## python-termcolor ################################################## python-colorama ################################################## python-gitdb ################################################## python-git ################################################## building RPM using: set -ex; : build-id: 194c33d9-5879-4e40-8151-650582596175; TMPDIR=/tmp/B._7icfw/BUILD/tmp exec nice -n 0 rpmbuild -bb --define '_smp_mflags -j9' --define '_make_opts -Otarget' --define '_pld_builder 1' --define '_topdir /tmp/B._7icfw' --define '_specdir %{_topdir}' --define '_sourcedir %{_specdir}' --define '_rpmdir %{_topdir}/RPMS' --define '_builddir %{_topdir}/BUILD' --target i686-pld-linux /tmp/B._7icfw/python-PyGitUp.spec + : build-id: 194c33d9-5879-4e40-8151-650582596175 + TMPDIR=/tmp/B._7icfw/BUILD/tmp + exec nice -n 0 rpmbuild -bb --define '_smp_mflags -j9' --define '_make_opts -Otarget' --define '_pld_builder 1' --define '_topdir /tmp/B._7icfw' --define '_specdir %{_topdir}' --define '_sourcedir %{_specdir}' --define '_rpmdir %{_topdir}/RPMS' --define '_builddir %{_topdir}/BUILD' --target i686-pld-linux /tmp/B._7icfw/python-PyGitUp.spec Building target platforms: i686-pld-linux Executing(%prep): /bin/sh -e /tmp/B._7icfw/BUILD/tmp/rpm-tmp.60418 + umask 022 + cd /tmp/B._7icfw/BUILD + cd /tmp/B._7icfw/BUILD + rm -rf PyGitUp-1.4.6 + /usr/bin/gzip -dc /tmp/B._7icfw/PyGitUp-v1.4.6.tar.gz + /bin/tar -xf - + STATUS=0 + '[' 0 -ne 0 ']' + cd PyGitUp-1.4.6 + /bin/id -u + '[' 1001 '=' 0 ']' + /bin/id -u + '[' 1001 '=' 0 ']' + /bin/chmod -Rf a+rX,u+w,g-w,o-w . + exit 0 Executing(%build): /bin/sh -e /tmp/B._7icfw/BUILD/tmp/rpm-tmp.60418 TMP=/home/users/builder/tmp HOME=/home/users/builder PATH=/home/users/builder/GNUstep/Tools:/usr/local/bin:/usr/bin:/bin:/home/users/builder/bin TMPDIR=/tmp/B._7icfw/BUILD/tmp + umask 022 + cd /tmp/B._7icfw/BUILD + cd PyGitUp-1.4.6 + LDFLAGS='-Wl,--as-needed -Wl,--no-copy-dt-needed-entries -Wl,-z,relro -Wl,-z,combreloc ' + export LDFLAGS + CFLAGS=' -O2 -fwrapv -pipe -Wformat -Werror=format-security -gdwarf-4 -fno-debug-types-section -fvar-tracking-assignments -g2 -Wp,-D_FORTIFY_SOURCE=2 -fstack-protector-strong --param=ssp-buffer-size=4 -fomit-frame-pointer -march=i686 -fasynchronous-unwind-tables -mtune=pentium4 -gdwarf-4 -fno-debug-types-section -fvar-tracking-assignments -g2 ' + export CFLAGS + CXXFLAGS=' -O2 -fwrapv -pipe -Wformat -Werror=format-security -gdwarf-4 -fno-debug-types-section -fvar-tracking-assignments -g2 -Wp,-D_FORTIFY_SOURCE=2 -fstack-protector-strong --param=ssp-buffer-size=4 -fomit-frame-pointer -march=i686 -fasynchronous-unwind-tables -mtune=pentium4 -gdwarf-4 -fno-debug-types-section -fvar-tracking-assignments -g2 ' + export CXXFLAGS + CC=i686-pld-linux-gcc + export CC + CXX=i686-pld-linux-g++ + export CXX + /usr/bin/python2 setup.py build '--build-base=build-2' test running build running build_py creating build-2 creating build-2/lib creating build-2/lib/PyGitUp copying PyGitUp/__init__.py -> build-2/lib/PyGitUp copying PyGitUp/git_wrapper.py -> build-2/lib/PyGitUp copying PyGitUp/gitup.py -> build-2/lib/PyGitUp copying PyGitUp/utils.py -> build-2/lib/PyGitUp creating build-2/lib/PyGitUp/tests copying PyGitUp/tests/__init__.py -> build-2/lib/PyGitUp/tests copying PyGitUp/tests/test_ahead_of_upstream.py -> build-2/lib/PyGitUp/tests copying PyGitUp/tests/test_bundler.py -> build-2/lib/PyGitUp/tests copying PyGitUp/tests/test_detached.py -> build-2/lib/PyGitUp/tests copying PyGitUp/tests/test_diverged.py -> build-2/lib/PyGitUp/tests copying PyGitUp/tests/test_fast_forwarded.py -> build-2/lib/PyGitUp/tests copying PyGitUp/tests/test_fetch_fail.py -> build-2/lib/PyGitUp/tests copying PyGitUp/tests/test_fetchall.py -> build-2/lib/PyGitUp/tests copying PyGitUp/tests/test_git_not_in_path.py -> build-2/lib/PyGitUp/tests copying PyGitUp/tests/test_issue_55.py -> build-2/lib/PyGitUp/tests copying PyGitUp/tests/test_local_tracking.py -> build-2/lib/PyGitUp/tests copying PyGitUp/tests/test_log_hook.py -> build-2/lib/PyGitUp/tests copying PyGitUp/tests/test_multiple_remotes.py -> build-2/lib/PyGitUp/tests copying PyGitUp/tests/test_no_remotes.py -> build-2/lib/PyGitUp/tests copying PyGitUp/tests/test_nofetch.py -> build-2/lib/PyGitUp/tests copying PyGitUp/tests/test_not_on_a_git_repo.py -> build-2/lib/PyGitUp/tests copying PyGitUp/tests/test_out_of_tree.py -> build-2/lib/PyGitUp/tests copying PyGitUp/tests/test_overwrite_untracked_error.py -> build-2/lib/PyGitUp/tests copying PyGitUp/tests/test_rebase_arguments.py -> build-2/lib/PyGitUp/tests copying PyGitUp/tests/test_rebase_error.py -> build-2/lib/PyGitUp/tests copying PyGitUp/tests/test_rebasing.py -> build-2/lib/PyGitUp/tests copying PyGitUp/tests/test_remote_branch_deleted.py -> build-2/lib/PyGitUp/tests copying PyGitUp/tests/test_returning_to_branch.py -> build-2/lib/PyGitUp/tests copying PyGitUp/tests/test_run_in_subdir.py -> build-2/lib/PyGitUp/tests copying PyGitUp/tests/test_separate_worktree.py -> build-2/lib/PyGitUp/tests copying PyGitUp/tests/test_stash_error.py -> build-2/lib/PyGitUp/tests copying PyGitUp/tests/test_submodules.py -> build-2/lib/PyGitUp/tests copying PyGitUp/tests/test_submodules_dirty.py -> build-2/lib/PyGitUp/tests copying PyGitUp/tests/test_tracking.py -> build-2/lib/PyGitUp/tests copying PyGitUp/tests/test_unstash_error.py -> build-2/lib/PyGitUp/tests copying PyGitUp/tests/test_up_to_date.py -> build-2/lib/PyGitUp/tests copying PyGitUp/tests/test_utils.py -> build-2/lib/PyGitUp/tests copying PyGitUp/tests/test_version.py -> build-2/lib/PyGitUp/tests copying PyGitUp/check-bundler.rb -> build-2/lib/PyGitUp running test running egg_info creating git_up.egg-info writing requirements to git_up.egg-info/requires.txt writing git_up.egg-info/PKG-INFO writing top-level names to git_up.egg-info/top_level.txt writing dependency_links to git_up.egg-info/dependency_links.txt writing entry points to git_up.egg-info/entry_points.txt writing manifest file 'git_up.egg-info/SOURCES.txt' reading manifest file 'git_up.egg-info/SOURCES.txt' writing manifest file 'git_up.egg-info/SOURCES.txt' running build_ext PyGitUp.tests.test_ahead_of_upstream.test_ahead_of_upstream Run 'git up' with result: ahead of upstream ... ok PyGitUp.tests.test_bundler.test_bundler Run bundler integration ... SKIP: Ruby not installed, skipped Bundler integration test PyGitUp.tests.test_detached.test_detached Run 'git up' with detached head ... ok PyGitUp.tests.test_diverged.test_diverged Run 'git up' with result: diverged ... ok PyGitUp.tests.test_fast_forwarded.test_fast_forwarded Run 'git up' with result: fast-forwarding ... ok PyGitUp.tests.test_fetch_fail.test_fetch_fail Run 'git up' with a non-existent remote ... ok PyGitUp.tests.test_fetchall.test_fetchall Run 'git up' with fetch.all ... ok PyGitUp.tests.test_git_not_in_path.test_not_a_git_repo Run 'git up' with git no being in PATH ... ok PyGitUp.tests.test_issue_55.test_issue_55 Regression test for #55 ... ok PyGitUp.tests.test_local_tracking.test_local_tracking Run 'git up' with a local tracking branch ... ok PyGitUp.tests.test_log_hook.test_log_hook Run 'git up' with log-hook ... ok PyGitUp.tests.test_multiple_remotes.test_fast_forwarded Run 'git up' with multiple remotes ... ok PyGitUp.tests.test_no_remotes.test_no_remotes Run 'git up' w/o remotes ... ok PyGitUp.tests.test_nofetch.test_no_fetch Run 'git up' with '--no-fetch' argument ... ERROR PyGitUp.tests.test_not_on_a_git_repo.test_not_a_git_repo Run 'git up' being not on a git repo ... ok PyGitUp.tests.test_out_of_tree.test_out_of_tree Run 'git up' with an out-of-tree source ... ok PyGitUp.tests.test_overwrite_untracked_error.test_fast_forwarded Fail correctly when a rebase would overwrite untracked files ... ok PyGitUp.tests.test_rebase_arguments.test_rebase_arguments Run 'git up' with rebasing.arguments ... ok PyGitUp.tests.test_rebase_error.test_rebase_error Run 'git up' with a failing rebase ... ok PyGitUp.tests.test_rebasing.test_rebasing Run 'git up' with result: rebasing ... ERROR PyGitUp.tests.test_remote_branch_deleted.test_remote_branch_deleted Run 'git up' with remotely deleted branch ... ok PyGitUp.tests.test_returning_to_branch.test_returning_to_branch Run 'git up': return to branch ... ok PyGitUp.tests.test_run_in_subdir.test_run_in_subdir Run 'git up' in a subdir of the repo ... ok PyGitUp.tests.test_separate_worktree.test_separate_worktree Run 'git up' with separate work tree ... ok PyGitUp.tests.test_stash_error.test_stash_error Run 'git up' with an error while stashing ... ERROR ERROR ERROR PyGitUp.tests.test_tracking.test_tracking Run 'git up' with a local tracking branch ... ok PyGitUp.tests.test_unstash_error.test_unstash_error Run 'git up' with an unclean unstash ... ERROR PyGitUp.tests.test_up_to_date.test_up_to_date Run 'git up' with result: up to date ... ok PyGitUp.tests.test_utils.test_find ... ok PyGitUp.tests.test_utils.test_uniq ... ok PyGitUp.tests.test_version.test_version Run 'git up': Check version ... SKIP: Can't connect to PYPI ====================================================================== ERROR: PyGitUp.tests.test_nofetch.test_no_fetch Run 'git up' with '--no-fetch' argument ---------------------------------------------------------------------- Traceback (most recent call last): File "/usr/share/python2.7/site-packages/nose/case.py", line 197, in runTest File "/tmp/B._7icfw/BUILD/PyGitUp-1.4.6/PyGitUp/tests/test_nofetch.py", line 58, in test_no_fetch gitup.run() File "/tmp/B._7icfw/BUILD/PyGitUp-1.4.6/PyGitUp/gitup.py", line 197, in run self.rebase_all_branches() File "/tmp/B._7icfw/BUILD/PyGitUp-1.4.6/PyGitUp/gitup.py", line 283, in rebase_all_branches self.git.rebase(target) File "/tmp/B._7icfw/BUILD/PyGitUp-1.4.6/PyGitUp/git_wrapper.py", line 170, in rebase **e.__dict__) RebaseError: Failed to rebase origin/no-fetch onto no-fetch.2 -------------------- >> begin captured stdout << --------------------- Failed to rebase origin/no-fetch onto no-fetch.2 Here's what git said: stderr: ' *** Please tell me who you are. Run git config --global user.email "you@example.com" git config --global user.name "Your Name" to set your account's default identity. Omit --global to set the identity only in this repository. fatal: unable to auto-detect email address (got 'builder@nereid-builder.(none)')' --------------------- >> end captured stdout << ---------------------- -------------------- >> begin captured logging << -------------------- git.cmd: DEBUG: Popen(['git', 'init'], cwd=/tmp/B._7icfw/BUILD/tmp/PyGitUp.YmEYJW/master.no-fetch, universal_newlines=False, shell=None) git.cmd: DEBUG: Popen(['git', 'cat-file', '--batch-check'], cwd=/tmp/B._7icfw/BUILD/tmp/PyGitUp.YmEYJW/master.no-fetch, universal_newlines=False, shell=None) git.cmd: DEBUG: Popen(['git', 'cat-file', '--batch'], cwd=/tmp/B._7icfw/BUILD/tmp/PyGitUp.YmEYJW/master.no-fetch, universal_newlines=False, shell=None) git.cmd: DEBUG: Popen(['git', 'checkout', '-b', 'initial'], cwd=/tmp/B._7icfw/BUILD/tmp/PyGitUp.YmEYJW/master.no-fetch, universal_newlines=False, shell=None) git.cmd: DEBUG: Popen(['git', 'checkout', '-b', 'no-fetch'], cwd=/tmp/B._7icfw/BUILD/tmp/PyGitUp.YmEYJW/master.no-fetch, universal_newlines=False, shell=None) git.cmd: DEBUG: Popen(['git', 'clone', '-b', 'no-fetch', '-v', '/tmp/B._7icfw/BUILD/tmp/PyGitUp.YmEYJW/master.no-fetch/.git', '/tmp/B._7icfw/BUILD/tmp/PyGitUp.YmEYJW/no-fetch'], cwd=/tmp/B._7icfw/BUILD/tmp/PyGitUp.YmEYJW/master.no-fetch, universal_newlines=True, shell=None) git.repo.base: DEBUG: Cmd(['git', 'clone', '-b', 'no-fetch', '-v', '/tmp/B._7icfw/BUILD/tmp/PyGitUp.YmEYJW/master.no-fetch/.git', '/tmp/B._7icfw/BUILD/tmp/PyGitUp.YmEYJW/no-fetch'])'s unused stdout: git.cmd: DEBUG: Popen(['git', 'checkout', '-b', 'no-fetch.2'], cwd=/tmp/B._7icfw/BUILD/tmp/PyGitUp.YmEYJW/no-fetch, universal_newlines=False, shell=None) git.cmd: DEBUG: Popen(['git', 'branch', '-u', 'origin/no-fetch'], cwd=/tmp/B._7icfw/BUILD/tmp/PyGitUp.YmEYJW/no-fetch, universal_newlines=False, shell=None) git.cmd: DEBUG: Popen(['git', 'cat-file', '--batch-check'], cwd=/tmp/B._7icfw/BUILD/tmp/PyGitUp.YmEYJW/no-fetch, universal_newlines=False, shell=None) git.cmd: DEBUG: Popen(['git', 'cat-file', '--batch'], cwd=/tmp/B._7icfw/BUILD/tmp/PyGitUp.YmEYJW/no-fetch, universal_newlines=False, shell=None) git.cmd: DEBUG: Popen(['git', 'checkout', 'no-fetch'], cwd=/tmp/B._7icfw/BUILD/tmp/PyGitUp.YmEYJW/no-fetch, universal_newlines=False, shell=None) git.cmd: DEBUG: Popen(['git', 'pull'], cwd=/tmp/B._7icfw/BUILD/tmp/PyGitUp.YmEYJW/no-fetch, universal_newlines=False, shell=None) git.cmd: DEBUG: Popen(['git', 'status', '--porcelain', '--untracked-files=no'], cwd=/tmp/B._7icfw/BUILD/tmp/PyGitUp.YmEYJW/no-fetch, universal_newlines=False, shell=None) git.cmd: DEBUG: Popen(['git', 'config', 'git-up.rebase.auto'], cwd=/tmp/B._7icfw/BUILD/tmp/PyGitUp.YmEYJW/no-fetch, universal_newlines=False, shell=None) git.cmd: DEBUG: Popen(['git', 'config', 'git-up.rebase.log-hook'], cwd=/tmp/B._7icfw/BUILD/tmp/PyGitUp.YmEYJW/no-fetch, universal_newlines=False, shell=None) git.cmd: DEBUG: Popen(['git', 'config', 'git-up.bundler.local'], cwd=/tmp/B._7icfw/BUILD/tmp/PyGitUp.YmEYJW/no-fetch, universal_newlines=False, shell=None) git.cmd: DEBUG: Popen(['git', 'config', 'git-up.bundler.check'], cwd=/tmp/B._7icfw/BUILD/tmp/PyGitUp.YmEYJW/no-fetch, universal_newlines=False, shell=None) git.cmd: DEBUG: Popen(['git', 'config', 'git-up.bundler.autoinstall'], cwd=/tmp/B._7icfw/BUILD/tmp/PyGitUp.YmEYJW/no-fetch, universal_newlines=False, shell=None) git.cmd: DEBUG: Popen(['git', 'config', 'git-up.updates.check'], cwd=/tmp/B._7icfw/BUILD/tmp/PyGitUp.YmEYJW/no-fetch, universal_newlines=False, shell=None) git.cmd: DEBUG: Popen(['git', 'config', 'git-up.rebase.show-hashes'], cwd=/tmp/B._7icfw/BUILD/tmp/PyGitUp.YmEYJW/no-fetch, universal_newlines=False, shell=None) git.cmd: DEBUG: Popen(['git', 'config', 'git-up.fetch.prune'], cwd=/tmp/B._7icfw/BUILD/tmp/PyGitUp.YmEYJW/no-fetch, universal_newlines=False, shell=None) git.cmd: DEBUG: Popen(['git', 'config', 'git-up.bundler.rbenv'], cwd=/tmp/B._7icfw/BUILD/tmp/PyGitUp.YmEYJW/no-fetch, universal_newlines=False, shell=None) git.cmd: DEBUG: Popen(['git', 'config', 'git-up.rebase.arguments'], cwd=/tmp/B._7icfw/BUILD/tmp/PyGitUp.YmEYJW/no-fetch, universal_newlines=False, shell=None) git.cmd: DEBUG: Popen(['git', 'config', 'git-up.fetch.all'], cwd=/tmp/B._7icfw/BUILD/tmp/PyGitUp.YmEYJW/no-fetch, universal_newlines=False, shell=None) git.cmd: DEBUG: Popen(['git', 'diff', '--cached', '--abbrev=40', '--full-index', '--raw', '--ignore-submodules'], cwd=/tmp/B._7icfw/BUILD/tmp/PyGitUp.YmEYJW/no-fetch, universal_newlines=False, shell=None) git.cmd: DEBUG: Popen(['git', 'diff', '--abbrev=40', '--full-index', '--raw', '--ignore-submodules'], cwd=/tmp/B._7icfw/BUILD/tmp/PyGitUp.YmEYJW/no-fetch, universal_newlines=False, shell=None) git.cmd: DEBUG: Popen(['git', 'cat-file', '--batch-check'], cwd=/tmp/B._7icfw/BUILD/tmp/PyGitUp.YmEYJW/no-fetch, universal_newlines=False, shell=None) git.cmd: DEBUG: Popen(['git', 'merge-base', 'no-fetch.2', 'origin/no-fetch'], cwd=/tmp/B._7icfw/BUILD/tmp/PyGitUp.YmEYJW/no-fetch, universal_newlines=False, shell=None) git.cmd: DEBUG: Popen(['git', 'checkout', 'no-fetch.2'], cwd=/tmp/B._7icfw/BUILD/tmp/PyGitUp.YmEYJW/no-fetch, universal_newlines=False, shell=None) git.cmd: DEBUG: Popen(['git', 'config', 'git-up.rebase.arguments'], cwd=/tmp/B._7icfw/BUILD/tmp/PyGitUp.YmEYJW/no-fetch, universal_newlines=False, shell=None) git.cmd: DEBUG: Popen(['git', 'rebase', 'origin/no-fetch'], cwd=/tmp/B._7icfw/BUILD/tmp/PyGitUp.YmEYJW/no-fetch, universal_newlines=False, shell=None) --------------------- >> end captured logging << --------------------- ====================================================================== ERROR: PyGitUp.tests.test_rebasing.test_rebasing Run 'git up' with result: rebasing ---------------------------------------------------------------------- Traceback (most recent call last): File "/usr/share/python2.7/site-packages/nose/case.py", line 197, in runTest File "/tmp/B._7icfw/BUILD/PyGitUp-1.4.6/PyGitUp/tests/test_rebasing.py", line 52, in test_rebasing gitup.run() File "/tmp/B._7icfw/BUILD/PyGitUp-1.4.6/PyGitUp/gitup.py", line 197, in run self.rebase_all_branches() File "/tmp/B._7icfw/BUILD/PyGitUp-1.4.6/PyGitUp/gitup.py", line 283, in rebase_all_branches self.git.rebase(target) File "/tmp/B._7icfw/BUILD/PyGitUp-1.4.6/PyGitUp/git_wrapper.py", line 170, in rebase **e.__dict__) RebaseError: Failed to rebase origin/rebasing onto rebasing -------------------- >> begin captured stdout << --------------------- Fetching origin rebasing  rebasing Failed to rebase origin/rebasing onto rebasing Here's what git said: stderr: ' *** Please tell me who you are. Run git config --global user.email "you@example.com" git config --global user.name "Your Name" to set your account's default identity. Omit --global to set the identity only in this repository. fatal: unable to auto-detect email address (got 'builder@nereid-builder.(none)')' --------------------- >> end captured stdout << ---------------------- -------------------- >> begin captured logging << -------------------- git.cmd: DEBUG: Popen(['git', 'init'], cwd=/tmp/B._7icfw/BUILD/tmp/PyGitUp.YmEYJW/master.rebasing, universal_newlines=False, shell=None) git.cmd: DEBUG: Popen(['git', 'cat-file', '--batch-check'], cwd=/tmp/B._7icfw/BUILD/tmp/PyGitUp.YmEYJW/master.rebasing, universal_newlines=False, shell=None) git.cmd: DEBUG: Popen(['git', 'cat-file', '--batch'], cwd=/tmp/B._7icfw/BUILD/tmp/PyGitUp.YmEYJW/master.rebasing, universal_newlines=False, shell=None) git.cmd: DEBUG: Popen(['git', 'checkout', '-b', 'initial'], cwd=/tmp/B._7icfw/BUILD/tmp/PyGitUp.YmEYJW/master.rebasing, universal_newlines=False, shell=None) git.cmd: DEBUG: Popen(['git', 'checkout', '-b', 'rebasing'], cwd=/tmp/B._7icfw/BUILD/tmp/PyGitUp.YmEYJW/master.rebasing, universal_newlines=False, shell=None) git.cmd: DEBUG: Popen(['git', 'clone', '-b', 'rebasing', '-v', '/tmp/B._7icfw/BUILD/tmp/PyGitUp.YmEYJW/master.rebasing/.git', '/tmp/B._7icfw/BUILD/tmp/PyGitUp.YmEYJW/rebasing'], cwd=/tmp/B._7icfw/BUILD/tmp/PyGitUp.YmEYJW/master.rebasing, universal_newlines=True, shell=None) git.repo.base: DEBUG: Cmd(['git', 'clone', '-b', 'rebasing', '-v', '/tmp/B._7icfw/BUILD/tmp/PyGitUp.YmEYJW/master.rebasing/.git', '/tmp/B._7icfw/BUILD/tmp/PyGitUp.YmEYJW/rebasing'])'s unused stdout: git.cmd: DEBUG: Popen(['git', 'cat-file', '--batch-check'], cwd=/tmp/B._7icfw/BUILD/tmp/PyGitUp.YmEYJW/rebasing, universal_newlines=False, shell=None) git.cmd: DEBUG: Popen(['git', 'cat-file', '--batch'], cwd=/tmp/B._7icfw/BUILD/tmp/PyGitUp.YmEYJW/rebasing, universal_newlines=False, shell=None) git.cmd: DEBUG: Popen(['git', 'status', '--porcelain', '--untracked-files=no'], cwd=/tmp/B._7icfw/BUILD/tmp/PyGitUp.YmEYJW/rebasing, universal_newlines=False, shell=None) git.cmd: DEBUG: Popen(['git', 'config', 'git-up.rebase.auto'], cwd=/tmp/B._7icfw/BUILD/tmp/PyGitUp.YmEYJW/rebasing, universal_newlines=False, shell=None) git.cmd: DEBUG: Popen(['git', 'config', 'git-up.rebase.log-hook'], cwd=/tmp/B._7icfw/BUILD/tmp/PyGitUp.YmEYJW/rebasing, universal_newlines=False, shell=None) git.cmd: DEBUG: Popen(['git', 'config', 'git-up.bundler.local'], cwd=/tmp/B._7icfw/BUILD/tmp/PyGitUp.YmEYJW/rebasing, universal_newlines=False, shell=None) git.cmd: DEBUG: Popen(['git', 'config', 'git-up.bundler.check'], cwd=/tmp/B._7icfw/BUILD/tmp/PyGitUp.YmEYJW/rebasing, universal_newlines=False, shell=None) git.cmd: DEBUG: Popen(['git', 'config', 'git-up.bundler.autoinstall'], cwd=/tmp/B._7icfw/BUILD/tmp/PyGitUp.YmEYJW/rebasing, universal_newlines=False, shell=None) git.cmd: DEBUG: Popen(['git', 'config', 'git-up.updates.check'], cwd=/tmp/B._7icfw/BUILD/tmp/PyGitUp.YmEYJW/rebasing, universal_newlines=False, shell=None) git.cmd: DEBUG: Popen(['git', 'config', 'git-up.rebase.show-hashes'], cwd=/tmp/B._7icfw/BUILD/tmp/PyGitUp.YmEYJW/rebasing, universal_newlines=False, shell=None) git.cmd: DEBUG: Popen(['git', 'config', 'git-up.fetch.prune'], cwd=/tmp/B._7icfw/BUILD/tmp/PyGitUp.YmEYJW/rebasing, universal_newlines=False, shell=None) git.cmd: DEBUG: Popen(['git', 'config', 'git-up.bundler.rbenv'], cwd=/tmp/B._7icfw/BUILD/tmp/PyGitUp.YmEYJW/rebasing, universal_newlines=False, shell=None) git.cmd: DEBUG: Popen(['git', 'config', 'git-up.rebase.arguments'], cwd=/tmp/B._7icfw/BUILD/tmp/PyGitUp.YmEYJW/rebasing, universal_newlines=False, shell=None) git.cmd: DEBUG: Popen(['git', 'config', 'git-up.fetch.all'], cwd=/tmp/B._7icfw/BUILD/tmp/PyGitUp.YmEYJW/rebasing, universal_newlines=False, shell=None) git.cmd: DEBUG: Popen(['git', 'version'], cwd=/tmp/B._7icfw/BUILD/tmp/PyGitUp.YmEYJW/rebasing, universal_newlines=False, shell=None) git.cmd: DEBUG: Popen(['git', 'fetch', '--multiple', '--prune', 'origin'], cwd=/tmp/B._7icfw/BUILD/tmp/PyGitUp.YmEYJW/rebasing, universal_newlines=False, shell=None) git.cmd: DEBUG: Popen(['git', 'diff', '--cached', '--abbrev=40', '--full-index', '--raw', '--ignore-submodules'], cwd=/tmp/B._7icfw/BUILD/tmp/PyGitUp.YmEYJW/rebasing, universal_newlines=False, shell=None) git.cmd: DEBUG: Popen(['git', 'diff', '--abbrev=40', '--full-index', '--raw', '--ignore-submodules'], cwd=/tmp/B._7icfw/BUILD/tmp/PyGitUp.YmEYJW/rebasing, universal_newlines=False, shell=None) git.cmd: DEBUG: Popen(['git', 'cat-file', '--batch-check'], cwd=/tmp/B._7icfw/BUILD/tmp/PyGitUp.YmEYJW/rebasing, universal_newlines=False, shell=None) git.cmd: DEBUG: Popen(['git', 'merge-base', 'rebasing', 'origin/rebasing'], cwd=/tmp/B._7icfw/BUILD/tmp/PyGitUp.YmEYJW/rebasing, universal_newlines=False, shell=None) git.cmd: DEBUG: Popen(['git', 'checkout', 'rebasing'], cwd=/tmp/B._7icfw/BUILD/tmp/PyGitUp.YmEYJW/rebasing, universal_newlines=False, shell=None) git.cmd: DEBUG: Popen(['git', 'config', 'git-up.rebase.arguments'], cwd=/tmp/B._7icfw/BUILD/tmp/PyGitUp.YmEYJW/rebasing, universal_newlines=False, shell=None) git.cmd: DEBUG: Popen(['git', 'rebase', 'origin/rebasing'], cwd=/tmp/B._7icfw/BUILD/tmp/PyGitUp.YmEYJW/rebasing, universal_newlines=False, shell=None) --------------------- >> end captured logging << --------------------- ====================================================================== ERROR: PyGitUp.tests.test_stash_error.test_stash_error Run 'git up' with an error while stashing ---------------------------------------------------------------------- Traceback (most recent call last): File "/usr/share/python2.7/site-packages/nose/case.py", line 197, in runTest File "/usr/share/python2.7/site-packages/nose/tools/nontrivial.py", line 60, in newfunc File "/tmp/B._7icfw/BUILD/PyGitUp-1.4.6/PyGitUp/tests/test_stash_error.py", line 63, in test_stash_error gitup.run() File "/tmp/B._7icfw/BUILD/PyGitUp-1.4.6/PyGitUp/gitup.py", line 197, in run self.rebase_all_branches() File "/tmp/B._7icfw/BUILD/PyGitUp-1.4.6/PyGitUp/gitup.py", line 283, in rebase_all_branches self.git.rebase(target) File "/tmp/B._7icfw/BUILD/PyGitUp-1.4.6/PyGitUp/git_wrapper.py", line 170, in rebase **e.__dict__) RebaseError: Failed to rebase origin/stash_error onto stash_error -------------------- >> begin captured stdout << --------------------- Fetching origin stash_error  rebasing Failed to rebase origin/stash_error onto stash_error Here's what git said: stderr: ' *** Please tell me who you are. Run git config --global user.email "you@example.com" git config --global user.name "Your Name" to set your account's default identity. Omit --global to set the identity only in this repository. fatal: unable to auto-detect email address (got 'builder@nereid-builder.(none)')' --------------------- >> end captured stdout << ---------------------- -------------------- >> begin captured logging << -------------------- git.cmd: DEBUG: Popen(['git', 'init'], cwd=/tmp/B._7icfw/BUILD/tmp/PyGitUp.YmEYJW/master.stash_error, universal_newlines=False, shell=None) git.cmd: DEBUG: Popen(['git', 'cat-file', '--batch-check'], cwd=/tmp/B._7icfw/BUILD/tmp/PyGitUp.YmEYJW/master.stash_error, universal_newlines=False, shell=None) git.cmd: DEBUG: Popen(['git', 'cat-file', '--batch'], cwd=/tmp/B._7icfw/BUILD/tmp/PyGitUp.YmEYJW/master.stash_error, universal_newlines=False, shell=None) git.cmd: DEBUG: Popen(['git', 'checkout', '-b', 'initial'], cwd=/tmp/B._7icfw/BUILD/tmp/PyGitUp.YmEYJW/master.stash_error, universal_newlines=False, shell=None) git.cmd: DEBUG: Popen(['git', 'checkout', '-b', 'stash_error'], cwd=/tmp/B._7icfw/BUILD/tmp/PyGitUp.YmEYJW/master.stash_error, universal_newlines=False, shell=None) git.cmd: DEBUG: Popen(['git', 'clone', '-b', 'stash_error', '-v', '/tmp/B._7icfw/BUILD/tmp/PyGitUp.YmEYJW/master.stash_error/.git', '/tmp/B._7icfw/BUILD/tmp/PyGitUp.YmEYJW/stash_error'], cwd=/tmp/B._7icfw/BUILD/tmp/PyGitUp.YmEYJW/master.stash_error, universal_newlines=True, shell=None) git.repo.base: DEBUG: Cmd(['git', 'clone', '-b', 'stash_error', '-v', '/tmp/B._7icfw/BUILD/tmp/PyGitUp.YmEYJW/master.stash_error/.git', '/tmp/B._7icfw/BUILD/tmp/PyGitUp.YmEYJW/stash_error'])'s unused stdout: git.cmd: DEBUG: Popen(['git', 'cat-file', '--batch-check'], cwd=/tmp/B._7icfw/BUILD/tmp/PyGitUp.YmEYJW/stash_error, universal_newlines=False, shell=None) git.cmd: DEBUG: Popen(['git', 'checkout', 'stash_error.branch'], cwd=/tmp/B._7icfw/BUILD/tmp/PyGitUp.YmEYJW/stash_error, universal_newlines=False, shell=None) git.cmd: DEBUG: Popen(['git', 'cat-file', '--batch'], cwd=/tmp/B._7icfw/BUILD/tmp/PyGitUp.YmEYJW/stash_error, universal_newlines=False, shell=None) git.cmd: DEBUG: Popen(['git', 'checkout', 'stash_error'], cwd=/tmp/B._7icfw/BUILD/tmp/PyGitUp.YmEYJW/stash_error, universal_newlines=False, shell=None) git.cmd: DEBUG: Popen(['git', 'merge', 'stash_error.branch'], cwd=/tmp/B._7icfw/BUILD/tmp/PyGitUp.YmEYJW/stash_error, universal_newlines=False, shell=None) git.cmd: DEBUG: Popen(['git', 'status', '--porcelain', '--untracked-files=no'], cwd=/tmp/B._7icfw/BUILD/tmp/PyGitUp.YmEYJW/stash_error, universal_newlines=False, shell=None) git.cmd: DEBUG: Popen(['git', 'config', 'git-up.rebase.auto'], cwd=/tmp/B._7icfw/BUILD/tmp/PyGitUp.YmEYJW/stash_error, universal_newlines=False, shell=None) git.cmd: DEBUG: Popen(['git', 'config', 'git-up.rebase.log-hook'], cwd=/tmp/B._7icfw/BUILD/tmp/PyGitUp.YmEYJW/stash_error, universal_newlines=False, shell=None) git.cmd: DEBUG: Popen(['git', 'config', 'git-up.bundler.local'], cwd=/tmp/B._7icfw/BUILD/tmp/PyGitUp.YmEYJW/stash_error, universal_newlines=False, shell=None) git.cmd: DEBUG: Popen(['git', 'config', 'git-up.bundler.check'], cwd=/tmp/B._7icfw/BUILD/tmp/PyGitUp.YmEYJW/stash_error, universal_newlines=False, shell=None) git.cmd: DEBUG: Popen(['git', 'config', 'git-up.bundler.autoinstall'], cwd=/tmp/B._7icfw/BUILD/tmp/PyGitUp.YmEYJW/stash_error, universal_newlines=False, shell=None) git.cmd: DEBUG: Popen(['git', 'config', 'git-up.updates.check'], cwd=/tmp/B._7icfw/BUILD/tmp/PyGitUp.YmEYJW/stash_error, universal_newlines=False, shell=None) git.cmd: DEBUG: Popen(['git', 'config', 'git-up.rebase.show-hashes'], cwd=/tmp/B._7icfw/BUILD/tmp/PyGitUp.YmEYJW/stash_error, universal_newlines=False, shell=None) git.cmd: DEBUG: Popen(['git', 'config', 'git-up.fetch.prune'], cwd=/tmp/B._7icfw/BUILD/tmp/PyGitUp.YmEYJW/stash_error, universal_newlines=False, shell=None) git.cmd: DEBUG: Popen(['git', 'config', 'git-up.bundler.rbenv'], cwd=/tmp/B._7icfw/BUILD/tmp/PyGitUp.YmEYJW/stash_error, universal_newlines=False, shell=None) git.cmd: DEBUG: Popen(['git', 'config', 'git-up.rebase.arguments'], cwd=/tmp/B._7icfw/BUILD/tmp/PyGitUp.YmEYJW/stash_error, universal_newlines=False, shell=None) git.cmd: DEBUG: Popen(['git', 'config', 'git-up.fetch.all'], cwd=/tmp/B._7icfw/BUILD/tmp/PyGitUp.YmEYJW/stash_error, universal_newlines=False, shell=None) git.cmd: DEBUG: Popen(['git', 'version'], cwd=/tmp/B._7icfw/BUILD/tmp/PyGitUp.YmEYJW/stash_error, universal_newlines=False, shell=None) git.cmd: DEBUG: Popen(['git', 'fetch', '--multiple', '--prune', 'origin'], cwd=/tmp/B._7icfw/BUILD/tmp/PyGitUp.YmEYJW/stash_error, universal_newlines=False, shell=None) git.cmd: DEBUG: Popen(['git', 'diff', '--cached', '--abbrev=40', '--full-index', '--raw', '--ignore-submodules'], cwd=/tmp/B._7icfw/BUILD/tmp/PyGitUp.YmEYJW/stash_error, universal_newlines=False, shell=None) git.cmd: DEBUG: Popen(['git', 'diff', '--abbrev=40', '--full-index', '--raw', '--ignore-submodules'], cwd=/tmp/B._7icfw/BUILD/tmp/PyGitUp.YmEYJW/stash_error, universal_newlines=False, shell=None) git.cmd: DEBUG: Popen(['git', 'cat-file', '--batch-check'], cwd=/tmp/B._7icfw/BUILD/tmp/PyGitUp.YmEYJW/stash_error, universal_newlines=False, shell=None) git.cmd: DEBUG: Popen(['git', 'merge-base', 'stash_error', 'origin/stash_error'], cwd=/tmp/B._7icfw/BUILD/tmp/PyGitUp.YmEYJW/stash_error, universal_newlines=False, shell=None) git.cmd: DEBUG: Popen(['git', 'checkout', 'stash_error'], cwd=/tmp/B._7icfw/BUILD/tmp/PyGitUp.YmEYJW/stash_error, universal_newlines=False, shell=None) git.cmd: DEBUG: Popen(['git', 'config', 'git-up.rebase.arguments'], cwd=/tmp/B._7icfw/BUILD/tmp/PyGitUp.YmEYJW/stash_error, universal_newlines=False, shell=None) git.cmd: DEBUG: Popen(['git', 'rebase', 'origin/stash_error'], cwd=/tmp/B._7icfw/BUILD/tmp/PyGitUp.YmEYJW/stash_error, universal_newlines=False, shell=None) --------------------- >> end captured logging << --------------------- ====================================================================== ERROR: <nose.suite.ContextSuite context=PyGitUp.tests.test_submodules> test suite for <module 'PyGitUp.tests.test_submodules' from '/tmp/B._7icfw/BUILD/PyGitUp-1.4.6/PyGitUp/tests/test_submodules.py'> ---------------------------------------------------------------------- Traceback (most recent call last): File "/usr/share/python2.7/site-packages/nose/suite.py", line 209, in run File "/usr/share/python2.7/site-packages/nose/suite.py", line 292, in setUp File "/usr/share/python2.7/site-packages/nose/suite.py", line 315, in setupContext File "/usr/share/python2.7/site-packages/nose/util.py", line 471, in try_run File "/tmp/B._7icfw/BUILD/PyGitUp-1.4.6/PyGitUp/tests/test_submodules.py", line 42, in setup repo.git.commit(m='Added submodule') File "/usr/share/python2.7/site-packages/git/cmd.py", line 550, in <lambda> File "/usr/share/python2.7/site-packages/git/cmd.py", line 1009, in _call_process File "/usr/share/python2.7/site-packages/git/cmd.py", line 820, in execute GitCommandError: Cmd('git') failed due to: exit code(128) cmdline: git commit -m Added submodule stderr: ' *** Please tell me who you are. Run git config --global user.email "you@example.com" git config --global user.name "Your Name" to set your account's default identity. Omit --global to set the identity only in this repository. fatal: unable to auto-detect email address (got 'builder@nereid-builder.(none)')' -------------------- >> begin captured logging << -------------------- git.cmd: DEBUG: Popen(['git', 'init'], cwd=/tmp/B._7icfw/BUILD/tmp/PyGitUp.YmEYJW/master.submodule, universal_newlines=False, shell=None) git.cmd: DEBUG: Popen(['git', 'cat-file', '--batch-check'], cwd=/tmp/B._7icfw/BUILD/tmp/PyGitUp.YmEYJW/master.submodule, universal_newlines=False, shell=None) git.cmd: DEBUG: Popen(['git', 'cat-file', '--batch'], cwd=/tmp/B._7icfw/BUILD/tmp/PyGitUp.YmEYJW/master.submodule, universal_newlines=False, shell=None) git.cmd: DEBUG: Popen(['git', 'checkout', '-b', 'initial'], cwd=/tmp/B._7icfw/BUILD/tmp/PyGitUp.YmEYJW/master.submodule, universal_newlines=False, shell=None) git.cmd: DEBUG: Popen(['git', 'checkout', '-b', 'submodule'], cwd=/tmp/B._7icfw/BUILD/tmp/PyGitUp.YmEYJW/master.submodule, universal_newlines=False, shell=None) git.cmd: DEBUG: Popen(['git', 'clone', '-b', 'submodule', '-v', '/tmp/B._7icfw/BUILD/tmp/PyGitUp.YmEYJW/master.submodule/.git', '/tmp/B._7icfw/BUILD/tmp/PyGitUp.YmEYJW/submodule'], cwd=/tmp/B._7icfw/BUILD/tmp/PyGitUp.YmEYJW/master.submodule, universal_newlines=True, shell=None) git.repo.base: DEBUG: Cmd(['git', 'clone', '-b', 'submodule', '-v', '/tmp/B._7icfw/BUILD/tmp/PyGitUp.YmEYJW/master.submodule/.git', '/tmp/B._7icfw/BUILD/tmp/PyGitUp.YmEYJW/submodule'])'s unused stdout: git.cmd: DEBUG: Popen(['git', 'branch', '-m', 'submodule_renamed'], cwd=/tmp/B._7icfw/BUILD/tmp/PyGitUp.YmEYJW/submodule, universal_newlines=False, shell=None) git.cmd: DEBUG: Popen(['git', 'cat-file', '--batch-check'], cwd=/tmp/B._7icfw/BUILD/tmp/PyGitUp.YmEYJW/submodule, universal_newlines=False, shell=None) git.cmd: DEBUG: Popen(['git', 'version'], cwd=/tmp/B._7icfw/BUILD/tmp/PyGitUp.YmEYJW/submodule, universal_newlines=False, shell=None) git.cmd: DEBUG: Popen(['git', 'clone', '--separate-git-dir=/tmp/B._7icfw/BUILD/tmp/PyGitUp.YmEYJW/submodule/.git/modules/sub', '-v', '/tmp/B._7icfw/BUILD/tmp/PyGitUp.YmEYJW/master.submodule', '/tmp/B._7icfw/BUILD/tmp/PyGitUp.YmEYJW/submodule/sub'], cwd=/tmp/B._7icfw/BUILD/tmp/PyGitUp.YmEYJW/submodule, universal_newlines=True, shell=None) git.repo.base: DEBUG: Cmd(['git', 'clone', '--separate-git-dir=/tmp/B._7icfw/BUILD/tmp/PyGitUp.YmEYJW/submodule/.git/modules/sub', '-v', '/tmp/B._7icfw/BUILD/tmp/PyGitUp.YmEYJW/master.submodule', '/tmp/B._7icfw/BUILD/tmp/PyGitUp.YmEYJW/submodule/sub'])'s unused stdout: git.cmd: DEBUG: Popen(['git', 'cat-file', '--batch-check'], cwd=/tmp/B._7icfw/BUILD/tmp/PyGitUp.YmEYJW/submodule/sub, universal_newlines=False, shell=None) git.cmd: DEBUG: Popen(['git', 'add', '.gitmodules', 'sub/'], cwd=/tmp/B._7icfw/BUILD/tmp/PyGitUp.YmEYJW/submodule, universal_newlines=False, shell=None) git.cmd: DEBUG: Popen(['git', 'commit', '-m', 'Added submodule'], cwd=/tmp/B._7icfw/BUILD/tmp/PyGitUp.YmEYJW/submodule, universal_newlines=False, shell=None) --------------------- >> end captured logging << --------------------- ====================================================================== ERROR: <nose.suite.ContextSuite context=PyGitUp.tests.test_submodules_dirty> test suite for <module 'PyGitUp.tests.test_submodules_dirty' from '/tmp/B._7icfw/BUILD/PyGitUp-1.4.6/PyGitUp/tests/test_submodules_dirty.py'> ---------------------------------------------------------------------- Traceback (most recent call last): File "/usr/share/python2.7/site-packages/nose/suite.py", line 209, in run File "/usr/share/python2.7/site-packages/nose/suite.py", line 292, in setUp File "/usr/share/python2.7/site-packages/nose/suite.py", line 315, in setupContext File "/usr/share/python2.7/site-packages/nose/util.py", line 471, in try_run File "/tmp/B._7icfw/BUILD/PyGitUp-1.4.6/PyGitUp/tests/test_submodules_dirty.py", line 42, in setup repo.git.commit(m='Added submodule') File "/usr/share/python2.7/site-packages/git/cmd.py", line 550, in <lambda> File "/usr/share/python2.7/site-packages/git/cmd.py", line 1009, in _call_process File "/usr/share/python2.7/site-packages/git/cmd.py", line 820, in execute GitCommandError: Cmd('git') failed due to: exit code(128) cmdline: git commit -m Added submodule stderr: ' *** Please tell me who you are. Run git config --global user.email "you@example.com" git config --global user.name "Your Name" to set your account's default identity. Omit --global to set the identity only in this repository. fatal: unable to auto-detect email address (got 'builder@nereid-builder.(none)')' -------------------- >> begin captured logging << -------------------- git.cmd: DEBUG: Popen(['git', 'init'], cwd=/tmp/B._7icfw/BUILD/tmp/PyGitUp.YmEYJW/master.submodule, universal_newlines=False, shell=None) git.cmd: DEBUG: Popen(['git', 'cat-file', '--batch-check'], cwd=/tmp/B._7icfw/BUILD/tmp/PyGitUp.YmEYJW/master.submodule, universal_newlines=False, shell=None) git.cmd: DEBUG: Popen(['git', 'cat-file', '--batch'], cwd=/tmp/B._7icfw/BUILD/tmp/PyGitUp.YmEYJW/master.submodule, universal_newlines=False, shell=None) git.cmd: DEBUG: Popen(['git', 'checkout', '-b', 'initial'], cwd=/tmp/B._7icfw/BUILD/tmp/PyGitUp.YmEYJW/master.submodule, universal_newlines=False, shell=None) git.cmd: DEBUG: Popen(['git', 'checkout', '-b', 'submodule'], cwd=/tmp/B._7icfw/BUILD/tmp/PyGitUp.YmEYJW/master.submodule, universal_newlines=False, shell=None) git.cmd: DEBUG: Popen(['git', 'clone', '-b', 'submodule', '-v', '/tmp/B._7icfw/BUILD/tmp/PyGitUp.YmEYJW/master.submodule/.git', '/tmp/B._7icfw/BUILD/tmp/PyGitUp.YmEYJW/submodule'], cwd=/tmp/B._7icfw/BUILD/tmp/PyGitUp.YmEYJW/master.submodule, universal_newlines=True, shell=None) git.repo.base: DEBUG: Cmd(['git', 'clone', '-b', 'submodule', '-v', '/tmp/B._7icfw/BUILD/tmp/PyGitUp.YmEYJW/master.submodule/.git', '/tmp/B._7icfw/BUILD/tmp/PyGitUp.YmEYJW/submodule'])'s unused stdout: git.cmd: DEBUG: Popen(['git', 'branch', '-m', 'submodule_renamed'], cwd=/tmp/B._7icfw/BUILD/tmp/PyGitUp.YmEYJW/submodule, universal_newlines=False, shell=None) git.cmd: DEBUG: Popen(['git', 'cat-file', '--batch-check'], cwd=/tmp/B._7icfw/BUILD/tmp/PyGitUp.YmEYJW/submodule, universal_newlines=False, shell=None) git.cmd: DEBUG: Popen(['git', 'version'], cwd=/tmp/B._7icfw/BUILD/tmp/PyGitUp.YmEYJW/submodule, universal_newlines=False, shell=None) git.cmd: DEBUG: Popen(['git', 'clone', '--separate-git-dir=/tmp/B._7icfw/BUILD/tmp/PyGitUp.YmEYJW/submodule/.git/modules/sub', '-v', '/tmp/B._7icfw/BUILD/tmp/PyGitUp.YmEYJW/master.submodule', '/tmp/B._7icfw/BUILD/tmp/PyGitUp.YmEYJW/submodule/sub'], cwd=/tmp/B._7icfw/BUILD/tmp/PyGitUp.YmEYJW/submodule, universal_newlines=True, shell=None) git.repo.base: DEBUG: Cmd(['git', 'clone', '--separate-git-dir=/tmp/B._7icfw/BUILD/tmp/PyGitUp.YmEYJW/submodule/.git/modules/sub', '-v', '/tmp/B._7icfw/BUILD/tmp/PyGitUp.YmEYJW/master.submodule', '/tmp/B._7icfw/BUILD/tmp/PyGitUp.YmEYJW/submodule/sub'])'s unused stdout: git.cmd: DEBUG: Popen(['git', 'cat-file', '--batch-check'], cwd=/tmp/B._7icfw/BUILD/tmp/PyGitUp.YmEYJW/submodule/sub, universal_newlines=False, shell=None) git.cmd: DEBUG: Popen(['git', 'add', '.gitmodules', 'sub/'], cwd=/tmp/B._7icfw/BUILD/tmp/PyGitUp.YmEYJW/submodule, universal_newlines=False, shell=None) git.cmd: DEBUG: Popen(['git', 'commit', '-m', 'Added submodule'], cwd=/tmp/B._7icfw/BUILD/tmp/PyGitUp.YmEYJW/submodule, universal_newlines=False, shell=None) git.cmd: DEBUG: Popen(['git', 'init'], cwd=/tmp/B._7icfw/BUILD/tmp/PyGitUp.YmEYJW/master.submodule-dirty, universal_newlines=False, shell=None) git.cmd: DEBUG: Popen(['git', 'cat-file', '--batch-check'], cwd=/tmp/B._7icfw/BUILD/tmp/PyGitUp.YmEYJW/master.submodule-dirty, universal_newlines=False, shell=None) git.cmd: DEBUG: Popen(['git', 'cat-file', '--batch'], cwd=/tmp/B._7icfw/BUILD/tmp/PyGitUp.YmEYJW/master.submodule-dirty, universal_newlines=False, shell=None) git.cmd: DEBUG: Popen(['git', 'checkout', '-b', 'initial'], cwd=/tmp/B._7icfw/BUILD/tmp/PyGitUp.YmEYJW/master.submodule-dirty, universal_newlines=False, shell=None) git.cmd: DEBUG: Popen(['git', 'checkout', '-b', 'submodule-dirty'], cwd=/tmp/B._7icfw/BUILD/tmp/PyGitUp.YmEYJW/master.submodule-dirty, universal_newlines=False, shell=None) git.cmd: DEBUG: Popen(['git', 'clone', '-b', 'submodule-dirty', '-v', '/tmp/B._7icfw/BUILD/tmp/PyGitUp.YmEYJW/master.submodule-dirty/.git', '/tmp/B._7icfw/BUILD/tmp/PyGitUp.YmEYJW/submodule-dirty'], cwd=/tmp/B._7icfw/BUILD/tmp/PyGitUp.YmEYJW/master.submodule-dirty, universal_newlines=True, shell=None) git.repo.base: DEBUG: Cmd(['git', 'clone', '-b', 'submodule-dirty', '-v', '/tmp/B._7icfw/BUILD/tmp/PyGitUp.YmEYJW/master.submodule-dirty/.git', '/tmp/B._7icfw/BUILD/tmp/PyGitUp.YmEYJW/submodule-dirty'])'s unused stdout: git.cmd: DEBUG: Popen(['git', 'branch', '-m', 'submodule-dirty_renamed'], cwd=/tmp/B._7icfw/BUILD/tmp/PyGitUp.YmEYJW/submodule-dirty, universal_newlines=False, shell=None) git.cmd: DEBUG: Popen(['git', 'cat-file', '--batch-check'], cwd=/tmp/B._7icfw/BUILD/tmp/PyGitUp.YmEYJW/submodule-dirty, universal_newlines=False, shell=None) git.cmd: DEBUG: Popen(['git', 'version'], cwd=/tmp/B._7icfw/BUILD/tmp/PyGitUp.YmEYJW/submodule-dirty, universal_newlines=False, shell=None) git.cmd: DEBUG: Popen(['git', 'clone', '--separate-git-dir=/tmp/B._7icfw/BUILD/tmp/PyGitUp.YmEYJW/submodule-dirty/.git/modules/sub', '-v', '/tmp/B._7icfw/BUILD/tmp/PyGitUp.YmEYJW/master.submodule-dirty', '/tmp/B._7icfw/BUILD/tmp/PyGitUp.YmEYJW/submodule-dirty/sub'], cwd=/tmp/B._7icfw/BUILD/tmp/PyGitUp.YmEYJW/submodule-dirty, universal_newlines=True, shell=None) git.repo.base: DEBUG: Cmd(['git', 'clone', '--separate-git-dir=/tmp/B._7icfw/BUILD/tmp/PyGitUp.YmEYJW/submodule-dirty/.git/modules/sub', '-v', '/tmp/B._7icfw/BUILD/tmp/PyGitUp.YmEYJW/master.submodule-dirty', '/tmp/B._7icfw/BUILD/tmp/PyGitUp.YmEYJW/submodule-dirty/sub'])'s unused stdout: git.cmd: DEBUG: Popen(['git', 'cat-file', '--batch-check'], cwd=/tmp/B._7icfw/BUILD/tmp/PyGitUp.YmEYJW/submodule-dirty/sub, universal_newlines=False, shell=None) git.cmd: DEBUG: Popen(['git', 'add', '.gitmodules', 'sub/'], cwd=/tmp/B._7icfw/BUILD/tmp/PyGitUp.YmEYJW/submodule-dirty, universal_newlines=False, shell=None) git.cmd: DEBUG: Popen(['git', 'commit', '-m', 'Added submodule'], cwd=/tmp/B._7icfw/BUILD/tmp/PyGitUp.YmEYJW/submodule-dirty, universal_newlines=False, shell=None) --------------------- >> end captured logging << --------------------- ====================================================================== ERROR: PyGitUp.tests.test_unstash_error.test_unstash_error Run 'git up' with an unclean unstash ---------------------------------------------------------------------- Traceback (most recent call last): File "/usr/share/python2.7/site-packages/nose/case.py", line 197, in runTest File "/usr/share/python2.7/site-packages/nose/tools/nontrivial.py", line 60, in newfunc File "/tmp/B._7icfw/BUILD/PyGitUp-1.4.6/PyGitUp/tests/test_unstash_error.py", line 47, in test_unstash_error gitup.run() File "/tmp/B._7icfw/BUILD/PyGitUp-1.4.6/PyGitUp/gitup.py", line 195, in run with self.git.stash(): File "/usr/lib/python2.7/contextlib.py", line 17, in __enter__ return self.gen.next() File "/tmp/B._7icfw/BUILD/PyGitUp-1.4.6/PyGitUp/git_wrapper.py", line 136, in stash raise StashError(stderr=e.stderr, stdout=e.stdout) StashError: Stashing failed! -------------------- >> begin captured stdout << --------------------- Fetching origin stashing 1 change Stashing failed! Here's what git said: stderr: ' *** Please tell me who you are. Run git config --global user.email "you@example.com" git config --global user.name "Your Name" to set your account's default identity. Omit --global to set the identity only in this repository. fatal: unable to auto-detect email address (got 'builder@nereid-builder.(none)') Cannot save the current index state' --------------------- >> end captured stdout << ---------------------- -------------------- >> begin captured logging << -------------------- git.cmd: DEBUG: Popen(['git', 'init'], cwd=/tmp/B._7icfw/BUILD/tmp/PyGitUp.YmEYJW/master.unstash_error, universal_newlines=False, shell=None) git.cmd: DEBUG: Popen(['git', 'cat-file', '--batch-check'], cwd=/tmp/B._7icfw/BUILD/tmp/PyGitUp.YmEYJW/master.unstash_error, universal_newlines=False, shell=None) git.cmd: DEBUG: Popen(['git', 'cat-file', '--batch'], cwd=/tmp/B._7icfw/BUILD/tmp/PyGitUp.YmEYJW/master.unstash_error, universal_newlines=False, shell=None) git.cmd: DEBUG: Popen(['git', 'checkout', '-b', 'initial'], cwd=/tmp/B._7icfw/BUILD/tmp/PyGitUp.YmEYJW/master.unstash_error, universal_newlines=False, shell=None) git.cmd: DEBUG: Popen(['git', 'checkout', '-b', 'unstash_error'], cwd=/tmp/B._7icfw/BUILD/tmp/PyGitUp.YmEYJW/master.unstash_error, universal_newlines=False, shell=None) git.cmd: DEBUG: Popen(['git', 'clone', '-b', 'unstash_error', '-v', '/tmp/B._7icfw/BUILD/tmp/PyGitUp.YmEYJW/master.unstash_error/.git', '/tmp/B._7icfw/BUILD/tmp/PyGitUp.YmEYJW/unstash_error'], cwd=/tmp/B._7icfw/BUILD/tmp/PyGitUp.YmEYJW/master.unstash_error, universal_newlines=True, shell=None) git.repo.base: DEBUG: Cmd(['git', 'clone', '-b', 'unstash_error', '-v', '/tmp/B._7icfw/BUILD/tmp/PyGitUp.YmEYJW/master.unstash_error/.git', '/tmp/B._7icfw/BUILD/tmp/PyGitUp.YmEYJW/unstash_error'])'s unused stdout: git.cmd: DEBUG: Popen(['git', 'status', '--porcelain', '--untracked-files=no'], cwd=/tmp/B._7icfw/BUILD/tmp/PyGitUp.YmEYJW/unstash_error, universal_newlines=False, shell=None) git.cmd: DEBUG: Popen(['git', 'config', 'git-up.rebase.auto'], cwd=/tmp/B._7icfw/BUILD/tmp/PyGitUp.YmEYJW/unstash_error, universal_newlines=False, shell=None) git.cmd: DEBUG: Popen(['git', 'config', 'git-up.rebase.log-hook'], cwd=/tmp/B._7icfw/BUILD/tmp/PyGitUp.YmEYJW/unstash_error, universal_newlines=False, shell=None) git.cmd: DEBUG: Popen(['git', 'config', 'git-up.bundler.local'], cwd=/tmp/B._7icfw/BUILD/tmp/PyGitUp.YmEYJW/unstash_error, universal_newlines=False, shell=None) git.cmd: DEBUG: Popen(['git', 'config', 'git-up.bundler.check'], cwd=/tmp/B._7icfw/BUILD/tmp/PyGitUp.YmEYJW/unstash_error, universal_newlines=False, shell=None) git.cmd: DEBUG: Popen(['git', 'config', 'git-up.bundler.autoinstall'], cwd=/tmp/B._7icfw/BUILD/tmp/PyGitUp.YmEYJW/unstash_error, universal_newlines=False, shell=None) git.cmd: DEBUG: Popen(['git', 'config', 'git-up.updates.check'], cwd=/tmp/B._7icfw/BUILD/tmp/PyGitUp.YmEYJW/unstash_error, universal_newlines=False, shell=None) git.cmd: DEBUG: Popen(['git', 'config', 'git-up.rebase.show-hashes'], cwd=/tmp/B._7icfw/BUILD/tmp/PyGitUp.YmEYJW/unstash_error, universal_newlines=False, shell=None) git.cmd: DEBUG: Popen(['git', 'config', 'git-up.fetch.prune'], cwd=/tmp/B._7icfw/BUILD/tmp/PyGitUp.YmEYJW/unstash_error, universal_newlines=False, shell=None) git.cmd: DEBUG: Popen(['git', 'config', 'git-up.bundler.rbenv'], cwd=/tmp/B._7icfw/BUILD/tmp/PyGitUp.YmEYJW/unstash_error, universal_newlines=False, shell=None) git.cmd: DEBUG: Popen(['git', 'config', 'git-up.rebase.arguments'], cwd=/tmp/B._7icfw/BUILD/tmp/PyGitUp.YmEYJW/unstash_error, universal_newlines=False, shell=None) git.cmd: DEBUG: Popen(['git', 'config', 'git-up.fetch.all'], cwd=/tmp/B._7icfw/BUILD/tmp/PyGitUp.YmEYJW/unstash_error, universal_newlines=False, shell=None) git.cmd: DEBUG: Popen(['git', 'version'], cwd=/tmp/B._7icfw/BUILD/tmp/PyGitUp.YmEYJW/unstash_error, universal_newlines=False, shell=None) git.cmd: DEBUG: Popen(['git', 'fetch', '--multiple', '--prune', 'origin'], cwd=/tmp/B._7icfw/BUILD/tmp/PyGitUp.YmEYJW/unstash_error, universal_newlines=False, shell=None) git.cmd: DEBUG: Popen(['git', 'diff', '--cached', '--abbrev=40', '--full-index', '--raw', '--ignore-submodules'], cwd=/tmp/B._7icfw/BUILD/tmp/PyGitUp.YmEYJW/unstash_error, universal_newlines=False, shell=None) git.cmd: DEBUG: Popen(['git', 'diff', '--abbrev=40', '--full-index', '--raw', '--ignore-submodules'], cwd=/tmp/B._7icfw/BUILD/tmp/PyGitUp.YmEYJW/unstash_error, universal_newlines=False, shell=None) git.cmd: DEBUG: Popen(['git', 'status', '--porcelain', '--untracked-files=no'], cwd=/tmp/B._7icfw/BUILD/tmp/PyGitUp.YmEYJW/unstash_error, universal_newlines=False, shell=None) git.cmd: DEBUG: Popen(['git', 'status', '--porcelain', '--untracked-files=no'], cwd=/tmp/B._7icfw/BUILD/tmp/PyGitUp.YmEYJW/unstash_error, universal_newlines=False, shell=None) git.cmd: DEBUG: Popen(['git', 'stash'], cwd=/tmp/B._7icfw/BUILD/tmp/PyGitUp.YmEYJW/unstash_error, universal_newlines=False, shell=None) --------------------- >> end captured logging << --------------------- ---------------------------------------------------------------------- Ran 31 tests in 7.542s FAILED (errors=6, skipped=2) Test failed: <unittest.runner.TextTestResult run=31 errors=6 failures=0> error: Test failed: <unittest.runner.TextTestResult run=31 errors=6 failures=0> error: Bad exit status from /tmp/B._7icfw/BUILD/tmp/rpm-tmp.60418 (%build) RPM build errors: Bad exit status from /tmp/B._7icfw/BUILD/tmp/rpm-tmp.60418 (%build) ended at: Wed Apr 4 10:06:27 2018, done in 0:00:09.738691 error: No files produced. + chmod -R u+rwX /tmp/B._7icfw/BUILD + rm -rf /tmp/B._7icfw/tmp /tmp/B._7icfw/BUILD + rm -rf /tmp/B._7icfw Begin-PLD-Builder-Info Build-Time: user:12.25s sys:4.43s real:31.41s (faults io:51 non-io:1174912) End-PLD-Builder-Info
[Back to list of logs] [View rpm -qa of builder]