FailedOk

th/SRPMS[OK]
th/x32[OK]
th/i686[OK]
th/x86_64[OK]

ac/SRPMS[OK]
ac/i386[OK]
ac/i586[OK]
ac/i686[OK]
ac/alpha[OK]
ac/amd64[OK]
ac/athlon[OK]
ac/ppc[OK]
ac/sparc[OK]
ac/sparc64[OK]

Advanced Search
main()
Powered by PLD Linux
(c) 2002-2020 PLD Team
$Revision: 1.37 $
Powered by bogon.
Your IP: 3.236.15.142

python-httplib2 e1df37ae-ce10-424b-a149-9df926d0fc20

Status:Failed
Source URL:https://buildlogs.pld-linux.org/pld/th/i686/FAIL/python-httplib2,e1df37ae-ce10-424b-a149-9df926d0fc20.bz2
text/plain URL:View!
rpm -qa of builder:View!
Date:2020/06/07 09:28:37
Runtime:0:00:26.992845

Toc:

  • prep
  • Executing(%prep): /bin/sh -e /tmp/B.v4pRIC/BUILD/tmp/rpm-tmp.42859
  • build
  • Executing(%build): /bin/sh -e /tmp/B.v4pRIC/BUILD/tmp/rpm-tmp.42859
  • error 1
  • error: Bad exit status from /tmp/B.v4pRIC/BUILD/tmp/rpm-tmp.42859 (%build)
  • error 2
  • RPM build errors:
  • error 3
  • error: No files produced.

Content:

request from: qboosh
checking if we should skip the build
started at: Sun Jun  7 09:28:07 2020
killing old processes on a builder
sending signal 9 to pid -1
Killed
cleaning up /tmp
fetching https://srcbuilder.pld-linux.org/th//srpms/e1df37ae-ce10-424b-a149-9df926d0fc20/python-httplib2-0.18.1-1.src.rpm
fetched 421262 bytes, 1069.5 K/s
installing srpm: python-httplib2-0.18.1-1.src.rpm
+ install -d /tmp/B.v4pRIC/BUILD /tmp/B.v4pRIC/RPMS
+ LC_ALL=en_US.UTF-8
+ rpm -qp --changelog python-httplib2-0.18.1-1.src.rpm
* Sun Jun 07 2020 PLD Linux Team <feedback@pld-linux.org>
- For complete changelog see: http://git.pld-linux.org/?p=packages/python-httplib2.git;a=log;h=master
* Sun Jun 07 2020 Jakub Bogusz <qboosh@pld-linux.org> 408d990
- updated to 0.18.1 (CRLF injection fix) * Thu Apr 02 2020 Jakub Bogusz <qboosh@pld-linux.org> ebcdddb
- added mock patch (prefer unittest.mock from stdlib on python3) - added tests and doc, updated dependencies * Sat Feb 08 2020 Arkadiusz Miśkiewicz <arekm@maven.pl> 8625bb3
- up to 0.17.0 * Mon Oct 28 2019 Jan Rękorajski <baggins@pld-linux.org> c8b8447
- rebuild with python 3.8 - release 2 (by relup.sh) + rpm -Uhv --nodeps --define '_topdir /tmp/B.v4pRIC' --define '_specdir %{_topdir}' --define '_sourcedir %{_specdir}' --define '_rpmdir %{_topdir}/RPMS' --define '_builddir %{_topdir}/BUILD' python-httplib2-0.18.1-1.src.rpm Preparing... ################################################## python-httplib2 ################################################## + rm -f python-httplib2-0.18.1-1.src.rpm + install -m 700 -d /tmp/B.v4pRIC/BUILD/tmp + TMPDIR=/tmp/B.v4pRIC/BUILD/tmp + exec nice -n 0 rpmbuild -bp --short-circuit --nodeps --define '_topdir /tmp/B.v4pRIC' --define '_specdir %{_topdir}' --define '_sourcedir %{_specdir}' --define '_rpmdir %{_topdir}/RPMS' --define '_builddir %{_topdir}/BUILD' --target i686-pld-linux --define 'prep exit 0' /tmp/B.v4pRIC/python-httplib2.spec Building target platforms: i686-pld-linux checking BuildConflict-ing packages no BuildConflicts found checking BR rpm: Building target platforms: i686-pld-linux no BR needed building RPM using: set -ex; : build-id: e1df37ae-ce10-424b-a149-9df926d0fc20; TMPDIR=/tmp/B.v4pRIC/BUILD/tmp exec nice -n 0 rpmbuild -bb --define '_smp_mflags -j9' --define '_make_opts -Otarget' --define '_pld_builder 1' --define '_topdir /tmp/B.v4pRIC' --define '_specdir %{_topdir}' --define '_sourcedir %{_specdir}' --define '_rpmdir %{_topdir}/RPMS' --define '_builddir %{_topdir}/BUILD' --target i686-pld-linux /tmp/B.v4pRIC/python-httplib2.spec + : build-id: e1df37ae-ce10-424b-a149-9df926d0fc20 + TMPDIR=/tmp/B.v4pRIC/BUILD/tmp + exec nice -n 0 rpmbuild -bb --define '_smp_mflags -j9' --define '_make_opts -Otarget' --define '_pld_builder 1' --define '_topdir /tmp/B.v4pRIC' --define '_specdir %{_topdir}' --define '_sourcedir %{_specdir}' --define '_rpmdir %{_topdir}/RPMS' --define '_builddir %{_topdir}/BUILD' --target i686-pld-linux /tmp/B.v4pRIC/python-httplib2.spec Building target platforms: i686-pld-linux Executing(%prep): /bin/sh -e /tmp/B.v4pRIC/BUILD/tmp/rpm-tmp.42859 + umask 022 + cd /tmp/B.v4pRIC/BUILD + cd /tmp/B.v4pRIC/BUILD + rm -rf httplib2-0.18.1 + /bin/gzip -dc /tmp/B.v4pRIC/httplib2-0.18.1.tar.gz + /bin/tar -xf - + STATUS=0 + '[' 0 -ne 0 ']' + cd httplib2-0.18.1 + /bin/id -u + '[' 1001 '=' 0 ']' + /bin/id -u + '[' 1001 '=' 0 ']' + /bin/chmod -Rf a+rX,u+w,g-w,o-w . + echo 'Patch #0 (python-httplib2.certfile.patch):' Patch #0 (python-httplib2.certfile.patch): + '[' -f /tmp/B.v4pRIC/python-httplib2.certfile.patch ']' + /bin/cat /tmp/B.v4pRIC/python-httplib2.certfile.patch + /usr/bin/patch -s -p1 + echo 'Patch #1 (python-httplib2-0.9-proxy-http.patch):' Patch #1 (python-httplib2-0.9-proxy-http.patch): + '[' -f /tmp/B.v4pRIC/python-httplib2-0.9-proxy-http.patch ']' + /bin/cat /tmp/B.v4pRIC/python-httplib2-0.9-proxy-http.patch + /usr/bin/patch -s -p1 + echo 'Patch #2 (python-httplib2-mock.patch):' Patch #2 (python-httplib2-mock.patch): + '[' -f /tmp/B.v4pRIC/python-httplib2-mock.patch ']' + /bin/cat /tmp/B.v4pRIC/python-httplib2-mock.patch + /usr/bin/patch -s -p1 + exit 0 Executing(%build): /bin/sh -e /tmp/B.v4pRIC/BUILD/tmp/rpm-tmp.42859 TMP=/home/users/builder/tmp HOME=/home/users/builder PATH=/home/users/builder/GNUstep/Tools:/bin:/usr/bin:/usr/local/bin:/home/users/builder/bin TMPDIR=/tmp/B.v4pRIC/BUILD/tmp + umask 022 + cd /tmp/B.v4pRIC/BUILD + cd httplib2-0.18.1 + LDFLAGS='-Wl,--as-needed -Wl,--no-copy-dt-needed-entries -Wl,-z,relro -Wl,-z,combreloc ' + export LDFLAGS + CFLAGS=' -O2 -fwrapv -pipe -Wformat -Werror=format-security -gdwarf-4 -fno-debug-types-section -fvar-tracking-assignments -g2 -Wp,-D_FORTIFY_SOURCE=2 -fstack-protector-strong --param=ssp-buffer-size=4 -Werror=trampolines -fomit-frame-pointer -march=i686 -fasynchronous-unwind-tables -mtune=pentium4 -gdwarf-4 -fno-debug-types-section -fvar-tracking-assignments -g2 ' + export CFLAGS + CXXFLAGS=' -O2 -fwrapv -pipe -Wformat -Werror=format-security -gdwarf-4 -fno-debug-types-section -fvar-tracking-assignments -g2 -Wp,-D_FORTIFY_SOURCE=2 -fstack-protector-strong --param=ssp-buffer-size=4 -Werror=trampolines -fomit-frame-pointer -march=i686 -fasynchronous-unwind-tables -mtune=pentium4 -gdwarf-4 -fno-debug-types-section -fvar-tracking-assignments -g2 ' + export CXXFLAGS + CC=i686-pld-linux-gcc + export CC + CXX=i686-pld-linux-g++ + export CXX + /usr/bin/python2 setup.py build '--build-base=build-2' running build running build_py creating build-2 creating build-2/lib creating build-2/lib/httplib2 copying python2/httplib2/certs.py -> build-2/lib/httplib2 copying python2/httplib2/iri2uri.py -> build-2/lib/httplib2 copying python2/httplib2/socks.py -> build-2/lib/httplib2 copying python2/httplib2/__init__.py -> build-2/lib/httplib2 copying python2/httplib2/cacerts.txt -> build-2/lib/httplib2 + pwd + PYTHONPATH=/tmp/B.v4pRIC/BUILD/httplib2-0.18.1/build-2/lib /usr/bin/python2 -m pytest tests -k 'not test_certs_file_from_builtin and not test_certs_file_from_environment and not test_with_certifi_removed_from_modules and not test_noproxy_star' /usr/share/python2.7/site-packages/hypothesis/extra/pytestplugin.py:61: HypothesisWarning: You are using Pytest version 3.10.1. Hypothesis tests work with any test runner, but our Pytest plugin requires Pytest 4.3 or newer. Note that the Pytest developers no longer support this version either! Disabling the Hypothesis pytest plugin... ============================= test session starts ============================== platform linux2 -- Python 2.7.18, pytest-3.10.1, py-1.8.1, pluggy-0.13.1 -- /usr/bin/python2 cachedir: .pytest_cache benchmark: 3.2.3 (defaults: timer=time.time disable_gc=False min_rounds=5 min_time=0.000005 max_time=1.0 calibration_precision=10 warmup=False warmup_iterations=100000) rootdir: /tmp/B.v4pRIC/BUILD/httplib2-0.18.1, inifile: setup.cfg plugins: mock-1.10.3, benchmark-3.2.3, forked-1.1.3, hypothesis-4.57.1, xdist-1.27.0, expect-1.1.0, backports.unittest-mock-1.2.1, flake8-1.0.4, pyfakefs-3.7.2, cov-2.8.1, timeout-1.3.4 timeout: 17.0s timeout method: signal timeout func_only: False collecting ... collected 184 items / 4 deselected tests/test_auth.py::test_credentials PASSED [ 0%] tests/test_auth.py::test_basic PASSED [ 1%] tests/test_auth.py::test_basic_for_domain PASSED [ 1%] tests/test_auth.py::test_basic_two_credentials PASSED [ 2%] tests/test_auth.py::test_digest PASSED [ 2%] tests/test_auth.py::test_digest_next_nonce_nc PASSED [ 3%] tests/test_auth.py::test_digest_auth_stale PASSED [ 3%] tests/test_auth.py::test_parse_www_authenticate_correct[strict-{}] PASSED [ 4%] tests/test_auth.py::test_parse_www_authenticate_correct[strict-{'www-authenticate': ''}] PASSED [ 5%] tests/test_auth.py::test_parse_www_authenticate_correct[strict-{'www-authenticate': 'Test realm="test realm" , foo=foo ,bar="bar", baz=baz,qux=qux'}] PASSED [ 5%] tests/test_auth.py::test_parse_www_authenticate_correct[strict-{'www-authenticate': 'T*!%#st realm=to*!%#en, to*!%#en="quoted string"'}] PASSED [ 6%] tests/test_auth.py::test_parse_www_authenticate_correct[strict-{'www-authenticate': 'Test realm="a \\"test\\" realm"'}] PASSED [ 6%] tests/test_auth.py::test_parse_www_authenticate_correct[strict-{'www-authenticate': 'Basic realm="me"'}] PASSED [ 7%] tests/test_auth.py::test_parse_www_authenticate_correct[strict-{'www-authenticate': 'Basic realm="me", algorithm="MD5"'}] PASSED [ 7%] tests/test_auth.py::test_parse_www_authenticate_correct[strict-{'www-authenticate': 'Basic realm="me", algorithm=MD5'}] PASSED [ 8%] tests/test_auth.py::test_parse_www_authenticate_correct[strict-{'www-authenticate': 'Basic realm="me",other="fred" '}] PASSED [ 8%] tests/test_auth.py::test_parse_www_authenticate_correct[strict-{'www-authenticate': 'Basic REAlm="me" '}] PASSED [ 9%] tests/test_auth.py::test_parse_www_authenticate_correct[strict-{'www-authenticate': 'Digest realm="digest1", qop="auth,auth-int", nonce="7102dd2", opaque="e9517f"'}] PASSED [ 10%] tests/test_auth.py::test_parse_www_authenticate_correct[strict-{'www-authenticate': 'Digest realm="multi-d", nonce="8b11d0f6", opaque="cc069c" Basic realm="multi-b" '}] PASSED [ 10%] tests/test_auth.py::test_parse_www_authenticate_correct[strict-{'www-authenticate': 'Digest realm="myrealm", nonce="KBAA=3", algorithm=MD5, qop="auth", stale=true'}] PASSED [ 11%] tests/test_auth.py::test_parse_www_authenticate_correct[relax-{}] PASSED [ 11%] tests/test_auth.py::test_parse_www_authenticate_correct[relax-{'www-authenticate': ''}] PASSED [ 12%] tests/test_auth.py::test_parse_www_authenticate_correct[relax-{'www-authenticate': 'Test realm="test realm" , foo=foo ,bar="bar", baz=baz,qux=qux'}] PASSED [ 12%] tests/test_auth.py::test_parse_www_authenticate_correct[relax-{'www-authenticate': 'T*!%#st realm=to*!%#en, to*!%#en="quoted string"'}] PASSED [ 13%] tests/test_auth.py::test_parse_www_authenticate_correct[relax-{'www-authenticate': 'Test realm="a \\"test\\" realm"'}] PASSED [ 13%] tests/test_auth.py::test_parse_www_authenticate_correct[relax-{'www-authenticate': 'Basic realm="me"'}] PASSED [ 14%] tests/test_auth.py::test_parse_www_authenticate_correct[relax-{'www-authenticate': 'Basic realm="me", algorithm="MD5"'}] PASSED [ 15%] tests/test_auth.py::test_parse_www_authenticate_correct[relax-{'www-authenticate': 'Basic realm="me", algorithm=MD5'}] PASSED [ 15%] tests/test_auth.py::test_parse_www_authenticate_correct[relax-{'www-authenticate': 'Basic realm="me",other="fred" '}] PASSED [ 16%] tests/test_auth.py::test_parse_www_authenticate_correct[relax-{'www-authenticate': 'Basic REAlm="me" '}] PASSED [ 16%] tests/test_auth.py::test_parse_www_authenticate_correct[relax-{'www-authenticate': 'Digest realm="digest1", qop="auth,auth-int", nonce="7102dd2", opaque="e9517f"'}] PASSED [ 17%] tests/test_auth.py::test_parse_www_authenticate_correct[relax-{'www-authenticate': 'Digest realm="multi-d", nonce="8b11d0f6", opaque="cc069c" Basic realm="multi-b" '}] PASSED [ 17%] tests/test_auth.py::test_parse_www_authenticate_correct[relax-{'www-authenticate': 'Digest realm="myrealm", nonce="KBAA=3", algorithm=MD5, qop="auth", stale=true'}] PASSED [ 18%] tests/test_auth.py::test_parse_www_authenticate_malformed PASSED [ 18%] tests/test_auth.py::test_digest_object PASSED [ 19%] tests/test_auth.py::test_digest_object_with_opaque PASSED [ 20%] tests/test_auth.py::test_digest_object_stale PASSED [ 20%] tests/test_auth.py::test_digest_object_auth_info PASSED [ 21%] tests/test_auth.py::test_wsse_algorithm PASSED [ 21%] tests/test_cacerts_from_env.py::test_certs_file_from_certifi PASSED [ 22%] tests/test_cacerts_from_env.py::test_certs_file_from_custom_getter PASSED [ 22%] tests/test_cache.py::test_get_only_if_cached_cache_hit PASSED [ 23%] tests/test_cache.py::test_get_only_if_cached_cache_miss PASSED [ 23%] tests/test_cache.py::test_get_only_if_cached_no_cache_at_all PASSED [ 24%] tests/test_cache.py::test_TODO_vary_no SKIPPED [ 25%] tests/test_cache.py::test_vary_header_is_sent PASSED [ 25%] tests/test_cache.py::test_vary_header_double PASSED [ 26%] tests/test_cache.py::test_vary_unused_header PASSED [ 26%] tests/test_cache.py::test_get_cache_control_no_cache PASSED [ 27%] tests/test_cache.py::test_get_cache_control_pragma_no_cache PASSED [ 27%] tests/test_cache.py::test_get_cache_control_no_store_request PASSED [ 28%] tests/test_cache.py::test_get_cache_control_no_store_response PASSED [ 28%] tests/test_cache.py::test_get_cache_control_no_cache_no_store_request PASSED [ 29%] tests/test_cache.py::test_update_invalidates_cache PASSED [ 30%] tests/test_cache.py::test_update_uses_cached_etag[PUT] PASSED [ 30%] tests/test_cache.py::test_update_uses_cached_etag[PATCH] PASSED [ 31%] tests/test_cache.py::test_update_uses_cached_etag_and_oc_method PASSED [ 31%] tests/test_cache.py::test_update_uses_cached_etag_overridden PASSED [ 32%] tests/test_cache.py::test_parse_cache_control[{}] PASSED [ 32%] tests/test_cache.py::test_parse_cache_control[{'cache-control': ' no-cache'}] PASSED [ 33%] tests/test_cache.py::test_parse_cache_control[{'cache-control': ' no-store, max-age = 7200'}] PASSED [ 33%] tests/test_cache.py::test_parse_cache_control[{'cache-control': ' , '}] PASSED [ 34%] tests/test_cache.py::test_parse_cache_control[{'cache-control': 'Max-age=3600;post-check=1800,pre-check=3600'}] PASSED [ 35%] tests/test_cache.py::test_normalize_headers PASSED [ 35%] tests/test_cache.py::test_entry_disposition[({'cache-control': 'no-cache'}, {'cache-control': 'max-age=7200'}, 'TRANSPARENT')] PASSED [ 36%] tests/test_cache.py::test_entry_disposition[({}, {'cache-control': 'max-age=fred, min-fresh=barney'}, 'STALE')] PASSED [ 36%] tests/test_cache.py::test_entry_disposition[({}, {'date': '{now}', 'expires': '{now+3}'}, 'FRESH')] PASSED [ 37%] tests/test_cache.py::test_entry_disposition[({}, {'date': '{now}', 'expires': '{now+3}', 'cache-control': 'no-cache'}, 'STALE')] PASSED [ 37%] tests/test_cache.py::test_entry_disposition[({'cache-control': 'must-revalidate'}, {}, 'STALE')] PASSED [ 38%] tests/test_cache.py::test_entry_disposition[({}, {'cache-control': 'must-revalidate'}, 'STALE')] PASSED [ 38%] tests/test_cache.py::test_entry_disposition[({}, {'date': '{now}', 'cache-control': 'max-age=0'}, 'STALE')] PASSED [ 39%] tests/test_cache.py::test_entry_disposition[({'cache-control': 'only-if-cached'}, {}, 'FRESH')] PASSED [ 40%] tests/test_cache.py::test_entry_disposition[({}, {'date': '{now}', 'expires': '0'}, 'STALE')] PASSED [ 40%] tests/test_cache.py::test_entry_disposition[({}, {'data': '{now+3}'}, 'STALE')] PASSED [ 41%] tests/test_cache.py::test_entry_disposition[({'cache-control': 'max-age=0'}, {'date': '{now}', 'cache-control': 'max-age=2'}, 'STALE')] PASSED [ 41%] tests/test_cache.py::test_entry_disposition[({'cache-control': 'min-fresh=2'}, {'date': '{now}', 'expires': '{now+2}'}, 'STALE')] PASSED [ 42%] tests/test_cache.py::test_entry_disposition[({'cache-control': 'min-fresh=2'}, {'date': '{now}', 'expires': '{now+4}'}, 'FRESH')] PASSED [ 42%] tests/test_cache.py::test_expiration_model_fresh PASSED [ 43%] tests/test_cache.py::test_expiration_model_date_and_expires PASSED [ 43%] tests/test_encoding.py::test_gzip_head PASSED [ 44%] tests/test_encoding.py::test_gzip_get PASSED [ 45%] tests/test_encoding.py::test_gzip_post_response PASSED [ 45%] tests/test_encoding.py::test_gzip_malformed_response PASSED [ 46%] tests/test_encoding.py::test_deflate_get PASSED [ 46%] tests/test_encoding.py::test_deflate_malformed_response PASSED [ 47%] tests/test_http.py::test_connection_type PASSED [ 47%] tests/test_http.py::test_bad_status_line_retry PASSED [ 48%] tests/test_http.py::test_unknown_server PASSED [ 48%] tests/test_http.py::test_connection_refused_raises_exception PASSED [ 49%] tests/test_http.py::test_connection_refused_returns_response PASSED [ 50%] tests/test_http.py::test_get_iri PASSED [ 50%] tests/test_http.py::test_get_is_default_method PASSED [ 51%] tests/test_http.py::test_different_methods PASSED [ 51%] tests/test_http.py::test_head_read PASSED [ 52%] tests/test_http.py::test_get_no_cache PASSED [ 52%] tests/test_http.py::test_user_agent PASSED [ 53%] tests/test_http.py::test_user_agent_non_default PASSED [ 53%] tests/test_http.py::test_get_300_with_location PASSED [ 54%] tests/test_http.py::test_get_300_with_location_noredirect PASSED [ 55%] tests/test_http.py::test_get_300_without_location PASSED [ 55%] tests/test_http.py::test_get_301 PASSED [ 56%] tests/test_http.py::test_head_301 SKIPPED [ 56%] tests/test_http.py::test_get_301_no_redirect xfail [ 57%] tests/test_http.py::test_get_302 PASSED [ 57%] tests/test_http.py::test_get_302_redirection_limit PASSED [ 58%] tests/test_http.py::test_get_302_no_location PASSED [ 58%] tests/test_http.py::test_303 SKIPPED [ 59%] tests/test_http.py::test_etag_used PASSED [ 60%] tests/test_http.py::test_etag_ignore PASSED [ 60%] tests/test_http.py::test_etag_override PASSED [ 61%] tests/test_http.py::test_get_304_end_to_end SKIPPED [ 61%] tests/test_http.py::test_get_304_last_modified PASSED [ 62%] tests/test_http.py::test_get_307 PASSED [ 62%] tests/test_http.py::test_post_307 PASSED [ 63%] tests/test_http.py::test_change_308 PASSED [ 63%] tests/test_http.py::test_get_410 PASSED [ 64%] tests/test_http.py::test_get_duplicate_headers PASSED [ 65%] tests/test_http.py::test_custom_redirect_codes PASSED [ 65%] tests/test_http.py::test_cwe93_inject_crlf PASSED [ 66%] tests/test_http.py::test_inject_space PASSED [ 66%] tests/test_https.py::test_get_via_https PASSED [ 67%] tests/test_https.py::test_get_301_via_https PASSED [ 67%] tests/test_https.py::test_get_301_via_https_spec_violation_on_location PASSED [ 68%] tests/test_https.py::test_invalid_ca_certs_path PASSED [ 68%] tests/test_https.py::test_not_trusted_ca PASSED [ 69%] tests/test_https.py::test_set_min_tls_version SKIPPED [ 70%] tests/test_https.py::test_set_max_tls_version SKIPPED [ 70%] tests/test_https.py::test_min_tls_version SKIPPED [ 71%] tests/test_https.py::test_max_tls_version SKIPPED [ 71%] tests/test_https.py::test_client_cert_verified PASSED [ 72%] tests/test_https.py::test_client_cert_password_verified PASSED [ 72%] tests/test_https.py::test_sni_set_servername_callback PASSED [ 73%] tests/test_other.py::test_convert_byte_str SKIPPED [ 73%] tests/test_other.py::test_reflect PASSED [ 74%] tests/test_other.py::test_pickle_http PASSED [ 75%] tests/test_other.py::test_pickle_http_with_connection PASSED [ 75%] tests/test_other.py::test_pickle_custom_request_http PASSED [ 76%] tests/test_other.py::test_timeout_global PASSED [ 76%] tests/test_other.py::test_timeout_individual PASSED [ 77%] tests/test_other.py::test_timeout_subsequent PASSED [ 77%] tests/test_other.py::test_timeout_https PASSED [ 78%] tests/test_other.py::test_connection_close PASSED [ 78%] tests/test_other.py::test_get_end2end_headers PASSED [ 79%] tests/test_other.py::test_ipv6[http] FAILED [ 80%] tests/test_other.py::test_ipv6[https] FAILED [ 80%] tests/test_other.py::test_connection_proxy_info_attribute_error[HTTPConnectionWithTimeout] PASSED [ 81%] tests/test_other.py::test_connection_proxy_info_attribute_error[HTTPSConnectionWithTimeout] PASSED [ 81%] tests/test_other.py::test_http_443_forced_https PASSED [ 82%] tests/test_other.py::test_close PASSED [ 82%] tests/test_other.py::test_connect_exception_type PASSED [ 83%] tests/test_proxy.py::test_from_url PASSED [ 83%] tests/test_proxy.py::test_from_url_ident PASSED [ 84%] tests/test_proxy.py::test_from_env PASSED [ 85%] tests/test_proxy.py::test_from_env_https PASSED [ 85%] tests/test_proxy.py::test_from_env_none PASSED [ 86%] tests/test_proxy.py::test_applies_to PASSED [ 86%] tests/test_proxy.py::test_noproxy_trailing_comma PASSED [ 87%] tests/test_proxy.py::test_headers PASSED [ 87%] tests/test_proxy.py::test_server_not_found_error_is_raised_for_invalid_hostname PASSED [ 88%] tests/test_proxy.py::test_auth_str_bytes PASSED [ 88%] tests/test_proxy.py::test_socks5_auth PASSED [ 89%] tests/test_proxy.py::test_functional_noproxy_star_http PASSED [ 90%] tests/test_proxy.py::test_functional_noproxy_star_https PASSED [ 90%] tests/test_uri.py::test_from_std66 PASSED [ 91%] tests/test_uri.py::test_norm PASSED [ 91%] tests/test_uri.py::test_safename[('', ',d41d8cd98f00b204e9800998ecf8427e')] PASSED [ 92%] tests/test_uri.py::test_safename[('http://example.org/fred/?a=b', 'example.orgfreda=b,58489f63a7a83c3b7794a6a398ee8b1f')] PASSED [ 92%] tests/test_uri.py::test_safename[('http://example.org/fred?/a=b', 'example.orgfreda=b,8c5946d56fec453071f43329ff0be46b')] PASSED [ 93%] tests/test_uri.py::test_safename[('http://www.example.org/fred?/a=b', 'www.example.orgfreda=b,499c44b8d844a011b67ea2c015116968')] PASSED [ 93%] tests/test_uri.py::test_safename[('https://www.example.org/fred?/a=b', 'www.example.orgfreda=b,692e843a333484ce0095b070497ab45d')] PASSED [ 94%] tests/test_uri.py::test_safename[('http://www/', u'www,1c73b6efd55cef1164fc084ecc331965')] PASSED [ 95%] tests/test_uri.py::test_safename[(u'http://\u2304.org/fred/?a=b', '.orgfreda=b,ecaf0f97756c0716de76f593bd60a35e')] PASSED [ 95%] tests/test_uri.py::test_safename[('normal-resource-name.js', 'normal-resource-name.js,8ff7c46fd6e61bf4e91a0a1606954a54')] PASSED [ 96%] tests/test_uri.py::test_safename[('foo://dom/path/brath/carapath', 'dompathbrathcarapath,83db942781ed975c7a5b7c24039f8ca3')] PASSED [ 96%] tests/test_uri.py::test_safename[('with/slash', 'withslash,17cc656656bb8ce2411bd41ead56d176')] PASSED [ 97%] tests/test_uri.py::test_safename[('thisistoomuchthisistoomuchthisistoomuchthisistoomuchthisistoomuchthisistoomuchthisistoomuchthisistoomuchthisistoomuchthisistoomuchthisistoomuchthisistoomuchthisistoomuchthisistoomuchthisistoomuchthisistoomuchthisistoomuchthisistoomuchthisistoomuchthisistoomuchthisistoomuchthisistoomuchthisistoomuchthisistoomuchthisistoomuchthisistoomuchthisistoomuchthisistoomuchthisistoomuchthisistoomuchthisistoomuchthisistoomuchthisistoomuchthisistoomuchthisistoomuchthisistoomuchthisistoomuchthisistoomuchthisistoomuchthisistoomuchthisistoomuchthisistoomuch', 'thisistoomuchthisistoomuchthisistoomuchthisistoomuchthisistoomuchthisistoomuchthisistoomuc,c4553439dd179422c6acf6a8ac093eb6')] PASSED [ 97%] tests/test_uri.py::test_safename[(u'\u043f\u0440', ',9f18c0db74a9734e9d18461e16345083')] PASSED [ 98%] tests/test_uri.py::test_safename[('\xd0\xbf\xd1\x80', ',9f18c0db74a9734e9d18461e16345083')] PASSED [ 98%] tests/test_uri.py::test_safename[('column\tvalues/unstr.zip', 'columnvaluesunstr.zip,b9740dcd0553e11b526450ceb8f76683')] PASSED [ 99%] tests/test_uri.py::test_safename2 PASSED [100%] =================================== FAILURES =================================== _______________________________ test_ipv6[http] ________________________________ tests/test_other.py:205: in test_ipv6 httplib2.Http(timeout=0.1).request(uri) build-2/lib/httplib2/__init__.py:2195: in request cachekey, build-2/lib/httplib2/__init__.py:1848: in _request conn, request_uri, method, body, headers build-2/lib/httplib2/__init__.py:1789: in _conn_request response = conn.getresponse() /usr/lib/python2.7/httplib.py:1148: in getresponse raise ResponseNotReady() E ResponseNotReady _______________________________ test_ipv6[https] _______________________________ tests/test_other.py:205: in test_ipv6 httplib2.Http(timeout=0.1).request(uri) build-2/lib/httplib2/__init__.py:2195: in request cachekey, build-2/lib/httplib2/__init__.py:1848: in _request conn, request_uri, method, body, headers build-2/lib/httplib2/__init__.py:1789: in _conn_request response = conn.getresponse() /usr/lib/python2.7/httplib.py:1148: in getresponse raise ResponseNotReady() E ResponseNotReady ---------- coverage: platform linux2, python 2.7.18-final-0 ---------- Name Stmts Miss Cover ------------------------------------------------------ build-2/lib/httplib2/__init__.py 1038 177 83% build-2/lib/httplib2/certs.py 29 8 72% build-2/lib/httplib2/iri2uri.py 40 15 63% build-2/lib/httplib2/socks.py 238 134 44% ------------------------------------------------------ TOTAL 1345 334 75% =========================== short test summary info ============================ FAIL tests/test_other.py::test_ipv6[http] FAIL tests/test_other.py::test_ipv6[https] SKIP [1] tests/test_https.py:74: ssl doesn't support TLS min/max SKIP [1] tests/test_http.py:252: FIXME: timeout on Travis py27 and pypy, works elsewhere SKIP [1] tests/test_cache.py:48: was commented in legacy code SKIP [1] tests/test_https.py:129: ssl doesn't support TLS min/max SKIP [1] tests/test_other.py:15: TODO: httplib2._convert_byte_str was defined only in python3 code version SKIP [1] tests/test_https.py:91: ssl doesn't support TLS min/max SKIP [1] tests/test_http.py:403: FIXME: timeout on Travis py27 and pypy, works elsewhere SKIP [1] tests/test_https.py:109: ssl doesn't support TLS min/max SKIP [1] tests/test_http.py:556: was commented in legacy code XFAIL tests/test_http.py::test_get_301_no_redirect FIXME: 301 cache works only with follow_redirects, should work regardless =============================== warnings summary =============================== /usr/share/python2.7/site-packages/_pytest/assertion/rewrite.py:272 /usr/share/python2.7/site-packages/_pytest/assertion/rewrite.py:272: PytestWarning: Module already imported so cannot be rewritten: backports tests/test_proxy.py::test_functional_noproxy_star_http /tmp/B.v4pRIC/BUILD/httplib2-0.18.1/tests/test_proxy.py:190: PytestWarning: Value of environment variable http_proxy type should be str, but got u'http://localhost:41607/' (type: unicode); converted to str implicitly monkeypatch.setenv("http_proxy", uri) tests/test_proxy.py::test_functional_noproxy_star_https /tmp/B.v4pRIC/BUILD/httplib2-0.18.1/tests/test_proxy.py:206: PytestWarning: Value of environment variable https_proxy type should be str, but got u'https://localhost:49617/' (type: unicode); converted to str implicitly monkeypatch.setenv("https_proxy", uri) -- Docs: https://docs.pytest.org/en/latest/warnings.html = 2 failed, 168 passed, 9 skipped, 4 deselected, 1 xfailed, 3 warnings in 13.13 seconds = error: Bad exit status from /tmp/B.v4pRIC/BUILD/tmp/rpm-tmp.42859 (%build) RPM build errors: Bad exit status from /tmp/B.v4pRIC/BUILD/tmp/rpm-tmp.42859 (%build) ended at: Sun Jun 7 09:28:37 2020, done in 0:00:26.992845 error: No files produced. + chmod -R u+rwX /tmp/B.v4pRIC/BUILD + rm -rf /tmp/B.v4pRIC/tmp /tmp/B.v4pRIC/BUILD + rm -rf /tmp/B.v4pRIC Begin-PLD-Builder-Info Build-Time: user:6.90s sys:0.64s real:30.24s (faults io:10 non-io:162891) End-PLD-Builder-Info
[Back to list of logs] [View rpm -qa of builder]