FailedOk

th/SRPMS[OK]
th/x32[OK]
th/i686[OK]
th/x86_64[OK]

ac/SRPMS[OK]
ac/i386[OK]
ac/i586[OK]
ac/i686[OK]
ac/alpha[OK]
ac/amd64[OK]
ac/athlon[OK]
ac/ppc[OK]
ac/sparc[OK]
ac/sparc64[OK]

Advanced Search
main()
Powered by PLD Linux
(c) 2002-2018 PLD Team
$Revision: 1.37 $
Powered by GNOME.
Your IP: 54.235.48.106

python-sqlalchemy 1A6C4D80-45CC-4E84-BA7B-D3373770D385

Status:Failed
Source URL:ftp://buildlogs.pld-linux.org/th/i686/FAIL/python-sqlalchemy,1A6C4D80-45CC-4E84-BA7B-D3373770D385.bz2
text/plain URL:View!
full text:View!
rpm -qa of builder:View!
Date:2018/11/08 10:25:14
Runtime:0:04:28.636818

Toc:

  • error 1
  • rpm: error: Failed build dependencies:
  • error 2
  • rpm: error: Failed build dependencies:
  • prep
  • Executing(%prep): /bin/sh -e /tmp/B.VpBclu/BUILD/tmp/rpm-tmp.24295
  • build
  • Executing(%build): /bin/sh -e /tmp/B.VpBclu/BUILD/tmp/rpm-tmp.24295
  • error 3
  • AssertionError: assert not 2
  • error 4
  • error: Bad exit status from /tmp/B.VpBclu/BUILD/tmp/rpm-tmp.24295 (%build)
  • error 5
  • RPM build errors:
  • error 6
  • error: No files produced.

Content:

checking if we should skip the build
started at: Thu Nov  8 10:20:06 2018
killing old processes on a builder
sending signal 9 to pid -1
Killed
cleaning up /tmp
fetching https://srcbuilder.pld-linux.org/th//srpms/1A6C4D80-45CC-4E84-BA7B-D3373770D385/python-sqlalchemy-1.2.13-1.src.rpm
fetched 5667479 bytes, 2016.6 K/s
installing srpm: python-sqlalchemy-1.2.13-1.src.rpm
+ install -d /tmp/B.VpBclu/BUILD /tmp/B.VpBclu/RPMS
+ LC_ALL=en_US.UTF-8
+ rpm -qp --changelog python-sqlalchemy-1.2.13-1.src.rpm
* Thu Nov 08 2018 PLD Linux Team <feedback@pld-linux.org>
- For complete changelog see: http://git.pld-linux.org/?p=packages/python-sqlalchemy.git;a=log;h=master
* Thu Nov 08 2018 Arkadiusz Miśkiewicz <arekm@maven.pl> 7192b5b
- up to 1.2.13 * Sun Jul 01 2018 Arkadiusz Miśkiewicz <arekm@maven.pl> c15a038
- up to 1.2.9 * Sun Jul 01 2018 Arkadiusz Miśkiewicz <arekm@maven.pl> 38ce6ce
- release 2 (by relup.sh) * Sat May 26 2018 Jakub Bogusz <qboosh@pld-linux.org> 0b211bb
- updated to 1.2.7 - added tests patch (don't require unused python3-mock, don't run distributed tests which require modules source) - big docs and examples moved to -apidocs and -examples packages * Sun Jan 07 2018 Arkadiusz Miśkiewicz <arekm@maven.pl> 3fda15f
- up to 1.2.0 * Fri Nov 24 2017 Arkadiusz Miśkiewicz <arekm@maven.pl> 58d88aa
- up to 1.1.15 + rpm -Uhv --nodeps --define '_topdir /tmp/B.VpBclu' --define '_specdir %{_topdir}' --define '_sourcedir %{_specdir}' --define '_rpmdir %{_topdir}/RPMS' --define '_builddir %{_topdir}/BUILD' python-sqlalchemy-1.2.13-1.src.rpm Preparing... ################################################## python-sqlalchemy ################################################## + rm -f python-sqlalchemy-1.2.13-1.src.rpm + install -m 700 -d /tmp/B.VpBclu/BUILD/tmp + TMPDIR=/tmp/B.VpBclu/BUILD/tmp + exec nice -n 0 rpmbuild -bp --short-circuit --nodeps --define '_topdir /tmp/B.VpBclu' --define '_specdir %{_topdir}' --define '_sourcedir %{_specdir}' --define '_rpmdir %{_topdir}/RPMS' --define '_builddir %{_topdir}/BUILD' --target i686-pld-linux --define 'prep exit 0' /tmp/B.VpBclu/python-sqlalchemy.spec Building target platforms: i686-pld-linux checking BuildConflict-ing packages no BuildConflicts found checking BR rpm: error: Failed build dependencies: rpm: python-pytest-xdist is needed by python-sqlalchemy-1.2.13-1.src rpm: python3-pytest-xdist is needed by python-sqlalchemy-1.2.13-1.src rpm: Building target platforms: i686-pld-linux updating poldek cache... ready is up to date Retrieving th::packages.ndir.md... th is up to date Retrieving th::packages.ndir.md... th is up to date Retrieving th-ready::packages.ndir.md... th-ready is up to date Retrieving th-ready::packages.ndir.md... th-ready is up to date Retrieving th-test::packages.ndir.md... Retrieving th-test::packages.ndir.diff.toc.gz... ..............................done Retrieving diff::packages.ndir.2018.11.08-07.13.05.gz... Retrieving diff::packages.ndir.dscr.2018.11.08-07.13.05.gz... Loading [pndir]th-test... Applying packages.ndir.2018.11.08-07.13.05.gz... Retrieving diff::packages.ndir.2018.11.08-08.27.01.gz... ..............................done Retrieving diff::packages.ndir.dscr.2018.11.08-08.27.01.gz... Applying packages.ndir.2018.11.08-08.27.01.gz... Retrieving diff::packages.ndir.2018.11.08-08.31.02.gz... ..............................done Retrieving diff::packages.ndir.dscr.2018.11.08-08.31.02.gz... Applying packages.ndir.2018.11.08-08.31.02.gz... Writing /root/tmp/poldek-cache-root/[...]/packages.ndir.gz... Retrieving th-test::packages.ndir.md... Retrieving th-test::packages.ndir.diff.toc.gz... Retrieving diff::packages.ndir.2018.11.08-05.58.02.gz... ..............................done Retrieving diff::packages.ndir.dscr.2018.11.08-05.58.02.gz... Loading [pndir]th-test... Applying packages.ndir.2018.11.08-05.58.02.gz... Retrieving diff::packages.ndir.2018.11.08-07.56.02.gz... ..............................done Retrieving diff::packages.ndir.dscr.2018.11.08-07.56.02.gz... Applying packages.ndir.2018.11.08-07.56.02.gz... Retrieving diff::packages.ndir.2018.11.08-07.57.02.gz... ..............................done Retrieving diff::packages.ndir.dscr.2018.11.08-07.57.02.gz... Applying packages.ndir.2018.11.08-07.57.02.gz... Retrieving diff::packages.ndir.2018.11.08-08.20.02.gz... Retrieving diff::packages.ndir.dscr.2018.11.08-08.20.02.gz... Applying packages.ndir.2018.11.08-08.20.02.gz... Retrieving diff::packages.ndir.2018.11.08-08.21.02.gz... ..............................done Retrieving diff::packages.ndir.dscr.2018.11.08-08.21.02.gz... Applying packages.ndir.2018.11.08-08.21.02.gz... Retrieving diff::packages.ndir.2018.11.08-08.24.01.gz... ..............................done Retrieving diff::packages.ndir.dscr.2018.11.08-08.24.01.gz... Applying packages.ndir.2018.11.08-08.24.01.gz... Retrieving diff::packages.ndir.2018.11.08-08.37.02.gz... ..............................done Retrieving diff::packages.ndir.dscr.2018.11.08-08.37.02.gz... Applying packages.ndir.2018.11.08-08.37.02.gz... Retrieving diff::packages.ndir.2018.11.08-08.39.01.gz... ..............................done Retrieving diff::packages.ndir.dscr.2018.11.08-08.39.01.gz... Applying packages.ndir.2018.11.08-08.39.01.gz... Retrieving diff::packages.ndir.2018.11.08-08.57.02.gz... ..............................done Retrieving diff::packages.ndir.dscr.2018.11.08-08.57.02.gz... Applying packages.ndir.2018.11.08-08.57.02.gz... Retrieving diff::packages.ndir.2018.11.08-08.59.03.gz... ..............................done Retrieving diff::packages.ndir.dscr.2018.11.08-08.59.03.gz... Applying packages.ndir.2018.11.08-08.59.03.gz... Writing /root/tmp/poldek-cache-root/[...]/packages.ndir.gz... checking conflicting packages in BRed packages poldek: Loading [pndir]ready... poldek: Loading [pndir]th-test... poldek: Loading [pndir]th-test... poldek: Loading [pndir]th-ready... poldek: Loading [pndir]th-ready... poldek: Loading [pndir]th... poldek: Loading [pndir]th... poldek: 33996 packages read poldek: Removed 6655 duplicate packages from available set poldek: Processing dependencies... poldek: python-pytest-xdist-1.22.5-1.noarch marks python-pytest-forked-0.2-1.noarch (cap pythonegg(pytest-forked)) poldek: There are 3 packages to install (1 marked by dependencies): poldek: I python-pytest-xdist-1.22.5-1.noarch poldek: I python3-pytest-xdist-1.22.5-1.noarch poldek: D python-pytest-forked-0.2-1.noarch poldek: This operation will use 464.9KB of disk space. poldek: Need to get 129.9KB of archives (129.9KB to download). poldek: poldek: Retrieving [1/3] th::python-pytest-forked-0.2-1.noarch.rpm... poldek: ..............................done poldek: Retrieving [2/3] th::python-pytest-xdist-1.22.5-1.noarch.rpm... poldek: ..............................done poldek: Retrieving [3/3] th::python3-pytest-xdist-1.22.5-1.noarch.rpm... poldek: ..............................done poldek: Executing pm-command.sh --upgrade -vh --test --root / --define _check_dirname_deps 1... poldek: Preparing... ################################################## no conflicts found checking BR rpm: error: Failed build dependencies: rpm: python-pytest-xdist is needed by python-sqlalchemy-1.2.13-1.src rpm: python3-pytest-xdist is needed by python-sqlalchemy-1.2.13-1.src rpm: Building target platforms: i686-pld-linux installing BR: python3\-pytest\-xdist python\-pytest\-xdist + poldek --noask --caplookup -Q -v '--ignore=hhvm-*' '--ignore=php4-*' '--ignore=php52-*' '--ignore=php54-*' '--ignore=php55-*' '--ignore=php56-*' '--ignore=php70-*' '--ignore=php71-*' '--ignore=php72-*' '--ignore=php73-*' --upgrade python3-pytest-xdist python-pytest-xdist Loading [pndir]ready... Loading [pndir]th-test... Loading [pndir]th-test... Loading [pndir]th-ready... Loading [pndir]th-ready... Loading [pndir]th... Loading [pndir]th... 33996 packages read Removed 6655 duplicate packages from available set Processing dependencies... python-pytest-xdist-1.22.5-1.noarch marks python-pytest-forked-0.2-1.noarch (cap pythonegg(pytest-forked)) There are 3 packages to install (1 marked by dependencies): I python-pytest-xdist-1.22.5-1.noarch I python3-pytest-xdist-1.22.5-1.noarch D python-pytest-forked-0.2-1.noarch This operation will use 464.9KB of disk space. Need to get 129.9KB of archives. Executing pm-command.sh --upgrade -vh --root / --define _check_dirname_deps 1... Preparing... ################################################## python-pytest-forked ################################################## python-pytest-xdist ################################################## python3-pytest-xdist ################################################## building RPM using: set -ex; : build-id: 1A6C4D80-45CC-4E84-BA7B-D3373770D385; TMPDIR=/tmp/B.VpBclu/BUILD/tmp exec nice -n 0 rpmbuild -bb --define '_smp_mflags -j9' --define '_make_opts -Otarget' --define '_pld_builder 1' --define '_topdir /tmp/B.VpBclu' --define '_specdir %{_topdir}' --define '_sourcedir %{_specdir}' --define '_rpmdir %{_topdir}/RPMS' --define '_builddir %{_topdir}/BUILD' --target i686-pld-linux /tmp/B.VpBclu/python-sqlalchemy.spec + : build-id: 1A6C4D80-45CC-4E84-BA7B-D3373770D385 + TMPDIR=/tmp/B.VpBclu/BUILD/tmp + exec nice -n 0 rpmbuild -bb --define '_smp_mflags -j9' --define '_make_opts -Otarget' --define '_pld_builder 1' --define '_topdir /tmp/B.VpBclu' --define '_specdir %{_topdir}' --define '_sourcedir %{_specdir}' --define '_rpmdir %{_topdir}/RPMS' --define '_builddir %{_topdir}/BUILD' --target i686-pld-linux /tmp/B.VpBclu/python-sqlalchemy.spec Building target platforms: i686-pld-linux Executing(%prep): /bin/sh -e /tmp/B.VpBclu/BUILD/tmp/rpm-tmp.24295 + umask 022 + cd /tmp/B.VpBclu/BUILD + cd /tmp/B.VpBclu/BUILD + rm -rf SQLAlchemy-1.2.13 + /usr/bin/gzip -dc /tmp/B.VpBclu/SQLAlchemy-1.2.13.tar.gz + /bin/tar -xf - + STATUS=0 + '[' 0 -ne 0 ']' + cd SQLAlchemy-1.2.13 + /bin/id -u + '[' 1001 '=' 0 ']' + /bin/id -u + '[' 1001 '=' 0 ']' + /bin/chmod -Rf a+rX,u+w,g-w,o-w . + echo 'Patch #0 (python-sqlalchemy-tests.patch):' Patch #0 (python-sqlalchemy-tests.patch): + '[' -f /tmp/B.VpBclu/python-sqlalchemy-tests.patch ']' + /bin/cat /tmp/B.VpBclu/python-sqlalchemy-tests.patch + /usr/bin/patch -s -p1 + exit 0 Executing(%build): /bin/sh -e /tmp/B.VpBclu/BUILD/tmp/rpm-tmp.24295 TMP=/home/users/builder/tmp HOME=/home/users/builder PATH=/usr/local/bin:/usr/bin:/bin:/home/users/builder/bin TMPDIR=/tmp/B.VpBclu/BUILD/tmp + umask 022 + cd /tmp/B.VpBclu/BUILD + cd SQLAlchemy-1.2.13 + LDFLAGS='-Wl,--as-needed -Wl,--no-copy-dt-needed-entries -Wl,-z,relro -Wl,-z,combreloc ' + export LDFLAGS + CFLAGS=' -O2 -fwrapv -pipe -Wformat -Werror=format-security -gdwarf-4 -fno-debug-types-section -fvar-tracking-assignments -g2 -Wp,-D_FORTIFY_SOURCE=2 -fstack-protector-strong --param=ssp-buffer-size=4 -fomit-frame-pointer -march=i686 -fasynchronous-unwind-tables -mtune=pentium4 -gdwarf-4 -fno-debug-types-section -fvar-tracking-assignments -g2 ' + export CFLAGS + CXXFLAGS=' -O2 -fwrapv -pipe -Wformat -Werror=format-security -gdwarf-4 -fno-debug-types-section -fvar-tracking-assignments -g2 -Wp,-D_FORTIFY_SOURCE=2 -fstack-protector-strong --param=ssp-buffer-size=4 -fomit-frame-pointer -march=i686 -fasynchronous-unwind-tables -mtune=pentium4 -gdwarf-4 -fno-debug-types-section -fvar-tracking-assignments -g2 ' + export CXXFLAGS + CC=i686-pld-linux-gcc + export CC + CXX=i686-pld-linux-g++ + export CXX + /usr/bin/python2 setup.py build '--build-base=build-2' test running build running build_py creating build-2 creating build-2/lib.linux-i686-2.7 creating build-2/lib.linux-i686-2.7/sqlalchemy copying lib/sqlalchemy/__init__.py -> build-2/lib.linux-i686-2.7/sqlalchemy copying lib/sqlalchemy/events.py -> build-2/lib.linux-i686-2.7/sqlalchemy copying lib/sqlalchemy/exc.py -> build-2/lib.linux-i686-2.7/sqlalchemy copying lib/sqlalchemy/inspection.py -> build-2/lib.linux-i686-2.7/sqlalchemy copying lib/sqlalchemy/interfaces.py -> build-2/lib.linux-i686-2.7/sqlalchemy copying lib/sqlalchemy/log.py -> build-2/lib.linux-i686-2.7/sqlalchemy copying lib/sqlalchemy/pool.py -> build-2/lib.linux-i686-2.7/sqlalchemy copying lib/sqlalchemy/processors.py -> build-2/lib.linux-i686-2.7/sqlalchemy copying lib/sqlalchemy/schema.py -> build-2/lib.linux-i686-2.7/sqlalchemy copying lib/sqlalchemy/types.py -> build-2/lib.linux-i686-2.7/sqlalchemy creating build-2/lib.linux-i686-2.7/sqlalchemy/connectors copying lib/sqlalchemy/connectors/__init__.py -> build-2/lib.linux-i686-2.7/sqlalchemy/connectors copying lib/sqlalchemy/connectors/mxodbc.py -> build-2/lib.linux-i686-2.7/sqlalchemy/connectors copying lib/sqlalchemy/connectors/pyodbc.py -> build-2/lib.linux-i686-2.7/sqlalchemy/connectors copying lib/sqlalchemy/connectors/zxJDBC.py -> build-2/lib.linux-i686-2.7/sqlalchemy/connectors creating build-2/lib.linux-i686-2.7/sqlalchemy/databases copying lib/sqlalchemy/databases/__init__.py -> build-2/lib.linux-i686-2.7/sqlalchemy/databases creating build-2/lib.linux-i686-2.7/sqlalchemy/dialects copying lib/sqlalchemy/dialects/__init__.py -> build-2/lib.linux-i686-2.7/sqlalchemy/dialects creating build-2/lib.linux-i686-2.7/sqlalchemy/engine copying lib/sqlalchemy/engine/__init__.py -> build-2/lib.linux-i686-2.7/sqlalchemy/engine copying lib/sqlalchemy/engine/base.py -> build-2/lib.linux-i686-2.7/sqlalchemy/engine copying lib/sqlalchemy/engine/default.py -> build-2/lib.linux-i686-2.7/sqlalchemy/engine copying lib/sqlalchemy/engine/interfaces.py -> build-2/lib.linux-i686-2.7/sqlalchemy/engine copying lib/sqlalchemy/engine/reflection.py -> build-2/lib.linux-i686-2.7/sqlalchemy/engine copying lib/sqlalchemy/engine/result.py -> build-2/lib.linux-i686-2.7/sqlalchemy/engine copying lib/sqlalchemy/engine/strategies.py -> build-2/lib.linux-i686-2.7/sqlalchemy/engine copying lib/sqlalchemy/engine/threadlocal.py -> build-2/lib.linux-i686-2.7/sqlalchemy/engine copying lib/sqlalchemy/engine/url.py -> build-2/lib.linux-i686-2.7/sqlalchemy/engine copying lib/sqlalchemy/engine/util.py -> build-2/lib.linux-i686-2.7/sqlalchemy/engine creating build-2/lib.linux-i686-2.7/sqlalchemy/event copying lib/sqlalchemy/event/__init__.py -> build-2/lib.linux-i686-2.7/sqlalchemy/event copying lib/sqlalchemy/event/api.py -> build-2/lib.linux-i686-2.7/sqlalchemy/event copying lib/sqlalchemy/event/attr.py -> build-2/lib.linux-i686-2.7/sqlalchemy/event copying lib/sqlalchemy/event/base.py -> build-2/lib.linux-i686-2.7/sqlalchemy/event copying lib/sqlalchemy/event/legacy.py -> build-2/lib.linux-i686-2.7/sqlalchemy/event copying lib/sqlalchemy/event/registry.py -> build-2/lib.linux-i686-2.7/sqlalchemy/event creating build-2/lib.linux-i686-2.7/sqlalchemy/ext copying lib/sqlalchemy/ext/__init__.py -> build-2/lib.linux-i686-2.7/sqlalchemy/ext copying lib/sqlalchemy/ext/associationproxy.py -> build-2/lib.linux-i686-2.7/sqlalchemy/ext copying lib/sqlalchemy/ext/automap.py -> build-2/lib.linux-i686-2.7/sqlalchemy/ext copying lib/sqlalchemy/ext/baked.py -> build-2/lib.linux-i686-2.7/sqlalchemy/ext copying lib/sqlalchemy/ext/compiler.py -> build-2/lib.linux-i686-2.7/sqlalchemy/ext copying lib/sqlalchemy/ext/horizontal_shard.py -> build-2/lib.linux-i686-2.7/sqlalchemy/ext copying lib/sqlalchemy/ext/hybrid.py -> build-2/lib.linux-i686-2.7/sqlalchemy/ext copying lib/sqlalchemy/ext/indexable.py -> build-2/lib.linux-i686-2.7/sqlalchemy/ext copying lib/sqlalchemy/ext/instrumentation.py -> build-2/lib.linux-i686-2.7/sqlalchemy/ext copying lib/sqlalchemy/ext/mutable.py -> build-2/lib.linux-i686-2.7/sqlalchemy/ext copying lib/sqlalchemy/ext/orderinglist.py -> build-2/lib.linux-i686-2.7/sqlalchemy/ext copying lib/sqlalchemy/ext/serializer.py -> build-2/lib.linux-i686-2.7/sqlalchemy/ext creating build-2/lib.linux-i686-2.7/sqlalchemy/orm copying lib/sqlalchemy/orm/__init__.py -> build-2/lib.linux-i686-2.7/sqlalchemy/orm copying lib/sqlalchemy/orm/attributes.py -> build-2/lib.linux-i686-2.7/sqlalchemy/orm copying lib/sqlalchemy/orm/base.py -> build-2/lib.linux-i686-2.7/sqlalchemy/orm copying lib/sqlalchemy/orm/collections.py -> build-2/lib.linux-i686-2.7/sqlalchemy/orm copying lib/sqlalchemy/orm/dependency.py -> build-2/lib.linux-i686-2.7/sqlalchemy/orm copying lib/sqlalchemy/orm/deprecated_interfaces.py -> build-2/lib.linux-i686-2.7/sqlalchemy/orm copying lib/sqlalchemy/orm/descriptor_props.py -> build-2/lib.linux-i686-2.7/sqlalchemy/orm copying lib/sqlalchemy/orm/dynamic.py -> build-2/lib.linux-i686-2.7/sqlalchemy/orm copying lib/sqlalchemy/orm/evaluator.py -> build-2/lib.linux-i686-2.7/sqlalchemy/orm copying lib/sqlalchemy/orm/events.py -> build-2/lib.linux-i686-2.7/sqlalchemy/orm copying lib/sqlalchemy/orm/exc.py -> build-2/lib.linux-i686-2.7/sqlalchemy/orm copying lib/sqlalchemy/orm/identity.py -> build-2/lib.linux-i686-2.7/sqlalchemy/orm copying lib/sqlalchemy/orm/instrumentation.py -> build-2/lib.linux-i686-2.7/sqlalchemy/orm copying lib/sqlalchemy/orm/interfaces.py -> build-2/lib.linux-i686-2.7/sqlalchemy/orm copying lib/sqlalchemy/orm/loading.py -> build-2/lib.linux-i686-2.7/sqlalchemy/orm copying lib/sqlalchemy/orm/mapper.py -> build-2/lib.linux-i686-2.7/sqlalchemy/orm copying lib/sqlalchemy/orm/path_registry.py -> build-2/lib.linux-i686-2.7/sqlalchemy/orm copying lib/sqlalchemy/orm/persistence.py -> build-2/lib.linux-i686-2.7/sqlalchemy/orm copying lib/sqlalchemy/orm/properties.py -> build-2/lib.linux-i686-2.7/sqlalchemy/orm copying lib/sqlalchemy/orm/query.py -> build-2/lib.linux-i686-2.7/sqlalchemy/orm copying lib/sqlalchemy/orm/relationships.py -> build-2/lib.linux-i686-2.7/sqlalchemy/orm copying lib/sqlalchemy/orm/scoping.py -> build-2/lib.linux-i686-2.7/sqlalchemy/orm copying lib/sqlalchemy/orm/session.py -> build-2/lib.linux-i686-2.7/sqlalchemy/orm copying lib/sqlalchemy/orm/state.py -> build-2/lib.linux-i686-2.7/sqlalchemy/orm copying lib/sqlalchemy/orm/strategies.py -> build-2/lib.linux-i686-2.7/sqlalchemy/orm copying lib/sqlalchemy/orm/strategy_options.py -> build-2/lib.linux-i686-2.7/sqlalchemy/orm copying lib/sqlalchemy/orm/sync.py -> build-2/lib.linux-i686-2.7/sqlalchemy/orm copying lib/sqlalchemy/orm/unitofwork.py -> build-2/lib.linux-i686-2.7/sqlalchemy/orm copying lib/sqlalchemy/orm/util.py -> build-2/lib.linux-i686-2.7/sqlalchemy/orm creating build-2/lib.linux-i686-2.7/sqlalchemy/sql copying lib/sqlalchemy/sql/__init__.py -> build-2/lib.linux-i686-2.7/sqlalchemy/sql copying lib/sqlalchemy/sql/annotation.py -> build-2/lib.linux-i686-2.7/sqlalchemy/sql copying lib/sqlalchemy/sql/base.py -> build-2/lib.linux-i686-2.7/sqlalchemy/sql copying lib/sqlalchemy/sql/compiler.py -> build-2/lib.linux-i686-2.7/sqlalchemy/sql copying lib/sqlalchemy/sql/crud.py -> build-2/lib.linux-i686-2.7/sqlalchemy/sql copying lib/sqlalchemy/sql/ddl.py -> build-2/lib.linux-i686-2.7/sqlalchemy/sql copying lib/sqlalchemy/sql/default_comparator.py -> build-2/lib.linux-i686-2.7/sqlalchemy/sql copying lib/sqlalchemy/sql/dml.py -> build-2/lib.linux-i686-2.7/sqlalchemy/sql copying lib/sqlalchemy/sql/elements.py -> build-2/lib.linux-i686-2.7/sqlalchemy/sql copying lib/sqlalchemy/sql/expression.py -> build-2/lib.linux-i686-2.7/sqlalchemy/sql copying lib/sqlalchemy/sql/functions.py -> build-2/lib.linux-i686-2.7/sqlalchemy/sql copying lib/sqlalchemy/sql/naming.py -> build-2/lib.linux-i686-2.7/sqlalchemy/sql copying lib/sqlalchemy/sql/operators.py -> build-2/lib.linux-i686-2.7/sqlalchemy/sql copying lib/sqlalchemy/sql/schema.py -> build-2/lib.linux-i686-2.7/sqlalchemy/sql copying lib/sqlalchemy/sql/selectable.py -> build-2/lib.linux-i686-2.7/sqlalchemy/sql copying lib/sqlalchemy/sql/sqltypes.py -> build-2/lib.linux-i686-2.7/sqlalchemy/sql copying lib/sqlalchemy/sql/type_api.py -> build-2/lib.linux-i686-2.7/sqlalchemy/sql copying lib/sqlalchemy/sql/util.py -> build-2/lib.linux-i686-2.7/sqlalchemy/sql copying lib/sqlalchemy/sql/visitors.py -> build-2/lib.linux-i686-2.7/sqlalchemy/sql creating build-2/lib.linux-i686-2.7/sqlalchemy/testing copying lib/sqlalchemy/testing/__init__.py -> build-2/lib.linux-i686-2.7/sqlalchemy/testing copying lib/sqlalchemy/testing/assertions.py -> build-2/lib.linux-i686-2.7/sqlalchemy/testing copying lib/sqlalchemy/testing/assertsql.py -> build-2/lib.linux-i686-2.7/sqlalchemy/testing copying lib/sqlalchemy/testing/config.py -> build-2/lib.linux-i686-2.7/sqlalchemy/testing copying lib/sqlalchemy/testing/engines.py -> build-2/lib.linux-i686-2.7/sqlalchemy/testing copying lib/sqlalchemy/testing/entities.py -> build-2/lib.linux-i686-2.7/sqlalchemy/testing copying lib/sqlalchemy/testing/exclusions.py -> build-2/lib.linux-i686-2.7/sqlalchemy/testing copying lib/sqlalchemy/testing/fixtures.py -> build-2/lib.linux-i686-2.7/sqlalchemy/testing copying lib/sqlalchemy/testing/mock.py -> build-2/lib.linux-i686-2.7/sqlalchemy/testing copying lib/sqlalchemy/testing/pickleable.py -> build-2/lib.linux-i686-2.7/sqlalchemy/testing copying lib/sqlalchemy/testing/profiling.py -> build-2/lib.linux-i686-2.7/sqlalchemy/testing copying lib/sqlalchemy/testing/provision.py -> build-2/lib.linux-i686-2.7/sqlalchemy/testing copying lib/sqlalchemy/testing/replay_fixture.py -> build-2/lib.linux-i686-2.7/sqlalchemy/testing copying lib/sqlalchemy/testing/requirements.py -> build-2/lib.linux-i686-2.7/sqlalchemy/testing copying lib/sqlalchemy/testing/runner.py -> build-2/lib.linux-i686-2.7/sqlalchemy/testing copying lib/sqlalchemy/testing/schema.py -> build-2/lib.linux-i686-2.7/sqlalchemy/testing copying lib/sqlalchemy/testing/util.py -> build-2/lib.linux-i686-2.7/sqlalchemy/testing copying lib/sqlalchemy/testing/warnings.py -> build-2/lib.linux-i686-2.7/sqlalchemy/testing creating build-2/lib.linux-i686-2.7/sqlalchemy/util copying lib/sqlalchemy/util/__init__.py -> build-2/lib.linux-i686-2.7/sqlalchemy/util copying lib/sqlalchemy/util/_collections.py -> build-2/lib.linux-i686-2.7/sqlalchemy/util copying lib/sqlalchemy/util/compat.py -> build-2/lib.linux-i686-2.7/sqlalchemy/util copying lib/sqlalchemy/util/deprecations.py -> build-2/lib.linux-i686-2.7/sqlalchemy/util copying lib/sqlalchemy/util/langhelpers.py -> build-2/lib.linux-i686-2.7/sqlalchemy/util copying lib/sqlalchemy/util/queue.py -> build-2/lib.linux-i686-2.7/sqlalchemy/util copying lib/sqlalchemy/util/topological.py -> build-2/lib.linux-i686-2.7/sqlalchemy/util creating build-2/lib.linux-i686-2.7/sqlalchemy/dialects/firebird copying lib/sqlalchemy/dialects/firebird/__init__.py -> build-2/lib.linux-i686-2.7/sqlalchemy/dialects/firebird copying lib/sqlalchemy/dialects/firebird/base.py -> build-2/lib.linux-i686-2.7/sqlalchemy/dialects/firebird copying lib/sqlalchemy/dialects/firebird/fdb.py -> build-2/lib.linux-i686-2.7/sqlalchemy/dialects/firebird copying lib/sqlalchemy/dialects/firebird/kinterbasdb.py -> build-2/lib.linux-i686-2.7/sqlalchemy/dialects/firebird creating build-2/lib.linux-i686-2.7/sqlalchemy/dialects/mssql copying lib/sqlalchemy/dialects/mssql/__init__.py -> build-2/lib.linux-i686-2.7/sqlalchemy/dialects/mssql copying lib/sqlalchemy/dialects/mssql/adodbapi.py -> build-2/lib.linux-i686-2.7/sqlalchemy/dialects/mssql copying lib/sqlalchemy/dialects/mssql/base.py -> build-2/lib.linux-i686-2.7/sqlalchemy/dialects/mssql copying lib/sqlalchemy/dialects/mssql/information_schema.py -> build-2/lib.linux-i686-2.7/sqlalchemy/dialects/mssql copying lib/sqlalchemy/dialects/mssql/mxodbc.py -> build-2/lib.linux-i686-2.7/sqlalchemy/dialects/mssql copying lib/sqlalchemy/dialects/mssql/pymssql.py -> build-2/lib.linux-i686-2.7/sqlalchemy/dialects/mssql copying lib/sqlalchemy/dialects/mssql/pyodbc.py -> build-2/lib.linux-i686-2.7/sqlalchemy/dialects/mssql copying lib/sqlalchemy/dialects/mssql/zxjdbc.py -> build-2/lib.linux-i686-2.7/sqlalchemy/dialects/mssql creating build-2/lib.linux-i686-2.7/sqlalchemy/dialects/mysql copying lib/sqlalchemy/dialects/mysql/__init__.py -> build-2/lib.linux-i686-2.7/sqlalchemy/dialects/mysql copying lib/sqlalchemy/dialects/mysql/base.py -> build-2/lib.linux-i686-2.7/sqlalchemy/dialects/mysql copying lib/sqlalchemy/dialects/mysql/cymysql.py -> build-2/lib.linux-i686-2.7/sqlalchemy/dialects/mysql copying lib/sqlalchemy/dialects/mysql/dml.py -> build-2/lib.linux-i686-2.7/sqlalchemy/dialects/mysql copying lib/sqlalchemy/dialects/mysql/enumerated.py -> build-2/lib.linux-i686-2.7/sqlalchemy/dialects/mysql copying lib/sqlalchemy/dialects/mysql/gaerdbms.py -> build-2/lib.linux-i686-2.7/sqlalchemy/dialects/mysql copying lib/sqlalchemy/dialects/mysql/json.py -> build-2/lib.linux-i686-2.7/sqlalchemy/dialects/mysql copying lib/sqlalchemy/dialects/mysql/mysqlconnector.py -> build-2/lib.linux-i686-2.7/sqlalchemy/dialects/mysql copying lib/sqlalchemy/dialects/mysql/mysqldb.py -> build-2/lib.linux-i686-2.7/sqlalchemy/dialects/mysql copying lib/sqlalchemy/dialects/mysql/oursql.py -> build-2/lib.linux-i686-2.7/sqlalchemy/dialects/mysql copying lib/sqlalchemy/dialects/mysql/pymysql.py -> build-2/lib.linux-i686-2.7/sqlalchemy/dialects/mysql copying lib/sqlalchemy/dialects/mysql/pyodbc.py -> build-2/lib.linux-i686-2.7/sqlalchemy/dialects/mysql copying lib/sqlalchemy/dialects/mysql/reflection.py -> build-2/lib.linux-i686-2.7/sqlalchemy/dialects/mysql copying lib/sqlalchemy/dialects/mysql/types.py -> build-2/lib.linux-i686-2.7/sqlalchemy/dialects/mysql copying lib/sqlalchemy/dialects/mysql/zxjdbc.py -> build-2/lib.linux-i686-2.7/sqlalchemy/dialects/mysql creating build-2/lib.linux-i686-2.7/sqlalchemy/dialects/oracle copying lib/sqlalchemy/dialects/oracle/__init__.py -> build-2/lib.linux-i686-2.7/sqlalchemy/dialects/oracle copying lib/sqlalchemy/dialects/oracle/base.py -> build-2/lib.linux-i686-2.7/sqlalchemy/dialects/oracle copying lib/sqlalchemy/dialects/oracle/cx_oracle.py -> build-2/lib.linux-i686-2.7/sqlalchemy/dialects/oracle copying lib/sqlalchemy/dialects/oracle/zxjdbc.py -> build-2/lib.linux-i686-2.7/sqlalchemy/dialects/oracle creating build-2/lib.linux-i686-2.7/sqlalchemy/dialects/postgresql copying lib/sqlalchemy/dialects/postgresql/__init__.py -> build-2/lib.linux-i686-2.7/sqlalchemy/dialects/postgresql copying lib/sqlalchemy/dialects/postgresql/array.py -> build-2/lib.linux-i686-2.7/sqlalchemy/dialects/postgresql copying lib/sqlalchemy/dialects/postgresql/base.py -> build-2/lib.linux-i686-2.7/sqlalchemy/dialects/postgresql copying lib/sqlalchemy/dialects/postgresql/dml.py -> build-2/lib.linux-i686-2.7/sqlalchemy/dialects/postgresql copying lib/sqlalchemy/dialects/postgresql/ext.py -> build-2/lib.linux-i686-2.7/sqlalchemy/dialects/postgresql copying lib/sqlalchemy/dialects/postgresql/hstore.py -> build-2/lib.linux-i686-2.7/sqlalchemy/dialects/postgresql copying lib/sqlalchemy/dialects/postgresql/json.py -> build-2/lib.linux-i686-2.7/sqlalchemy/dialects/postgresql copying lib/sqlalchemy/dialects/postgresql/pg8000.py -> build-2/lib.linux-i686-2.7/sqlalchemy/dialects/postgresql copying lib/sqlalchemy/dialects/postgresql/psycopg2.py -> build-2/lib.linux-i686-2.7/sqlalchemy/dialects/postgresql copying lib/sqlalchemy/dialects/postgresql/psycopg2cffi.py -> build-2/lib.linux-i686-2.7/sqlalchemy/dialects/postgresql copying lib/sqlalchemy/dialects/postgresql/pygresql.py -> build-2/lib.linux-i686-2.7/sqlalchemy/dialects/postgresql copying lib/sqlalchemy/dialects/postgresql/pypostgresql.py -> build-2/lib.linux-i686-2.7/sqlalchemy/dialects/postgresql copying lib/sqlalchemy/dialects/postgresql/ranges.py -> build-2/lib.linux-i686-2.7/sqlalchemy/dialects/postgresql copying lib/sqlalchemy/dialects/postgresql/zxjdbc.py -> build-2/lib.linux-i686-2.7/sqlalchemy/dialects/postgresql creating build-2/lib.linux-i686-2.7/sqlalchemy/dialects/sqlite copying lib/sqlalchemy/dialects/sqlite/__init__.py -> build-2/lib.linux-i686-2.7/sqlalchemy/dialects/sqlite copying lib/sqlalchemy/dialects/sqlite/base.py -> build-2/lib.linux-i686-2.7/sqlalchemy/dialects/sqlite copying lib/sqlalchemy/dialects/sqlite/pysqlcipher.py -> build-2/lib.linux-i686-2.7/sqlalchemy/dialects/sqlite copying lib/sqlalchemy/dialects/sqlite/pysqlite.py -> build-2/lib.linux-i686-2.7/sqlalchemy/dialects/sqlite creating build-2/lib.linux-i686-2.7/sqlalchemy/dialects/sybase copying lib/sqlalchemy/dialects/sybase/__init__.py -> build-2/lib.linux-i686-2.7/sqlalchemy/dialects/sybase copying lib/sqlalchemy/dialects/sybase/base.py -> build-2/lib.linux-i686-2.7/sqlalchemy/dialects/sybase copying lib/sqlalchemy/dialects/sybase/mxodbc.py -> build-2/lib.linux-i686-2.7/sqlalchemy/dialects/sybase copying lib/sqlalchemy/dialects/sybase/pyodbc.py -> build-2/lib.linux-i686-2.7/sqlalchemy/dialects/sybase copying lib/sqlalchemy/dialects/sybase/pysybase.py -> build-2/lib.linux-i686-2.7/sqlalchemy/dialects/sybase creating build-2/lib.linux-i686-2.7/sqlalchemy/ext/declarative copying lib/sqlalchemy/ext/declarative/__init__.py -> build-2/lib.linux-i686-2.7/sqlalchemy/ext/declarative copying lib/sqlalchemy/ext/declarative/api.py -> build-2/lib.linux-i686-2.7/sqlalchemy/ext/declarative copying lib/sqlalchemy/ext/declarative/base.py -> build-2/lib.linux-i686-2.7/sqlalchemy/ext/declarative copying lib/sqlalchemy/ext/declarative/clsregistry.py -> build-2/lib.linux-i686-2.7/sqlalchemy/ext/declarative creating build-2/lib.linux-i686-2.7/sqlalchemy/testing/plugin copying lib/sqlalchemy/testing/plugin/__init__.py -> build-2/lib.linux-i686-2.7/sqlalchemy/testing/plugin copying lib/sqlalchemy/testing/plugin/bootstrap.py -> build-2/lib.linux-i686-2.7/sqlalchemy/testing/plugin copying lib/sqlalchemy/testing/plugin/noseplugin.py -> build-2/lib.linux-i686-2.7/sqlalchemy/testing/plugin copying lib/sqlalchemy/testing/plugin/plugin_base.py -> build-2/lib.linux-i686-2.7/sqlalchemy/testing/plugin copying lib/sqlalchemy/testing/plugin/pytestplugin.py -> build-2/lib.linux-i686-2.7/sqlalchemy/testing/plugin creating build-2/lib.linux-i686-2.7/sqlalchemy/testing/suite copying lib/sqlalchemy/testing/suite/__init__.py -> build-2/lib.linux-i686-2.7/sqlalchemy/testing/suite copying lib/sqlalchemy/testing/suite/test_cte.py -> build-2/lib.linux-i686-2.7/sqlalchemy/testing/suite copying lib/sqlalchemy/testing/suite/test_ddl.py -> build-2/lib.linux-i686-2.7/sqlalchemy/testing/suite copying lib/sqlalchemy/testing/suite/test_dialect.py -> build-2/lib.linux-i686-2.7/sqlalchemy/testing/suite copying lib/sqlalchemy/testing/suite/test_insert.py -> build-2/lib.linux-i686-2.7/sqlalchemy/testing/suite copying lib/sqlalchemy/testing/suite/test_reflection.py -> build-2/lib.linux-i686-2.7/sqlalchemy/testing/suite copying lib/sqlalchemy/testing/suite/test_results.py -> build-2/lib.linux-i686-2.7/sqlalchemy/testing/suite copying lib/sqlalchemy/testing/suite/test_select.py -> build-2/lib.linux-i686-2.7/sqlalchemy/testing/suite copying lib/sqlalchemy/testing/suite/test_sequence.py -> build-2/lib.linux-i686-2.7/sqlalchemy/testing/suite copying lib/sqlalchemy/testing/suite/test_types.py -> build-2/lib.linux-i686-2.7/sqlalchemy/testing/suite copying lib/sqlalchemy/testing/suite/test_update_delete.py -> build-2/lib.linux-i686-2.7/sqlalchemy/testing/suite running build_ext building 'sqlalchemy.cprocessors' extension creating build-2/temp.linux-i686-2.7 creating build-2/temp.linux-i686-2.7/lib creating build-2/temp.linux-i686-2.7/lib/sqlalchemy creating build-2/temp.linux-i686-2.7/lib/sqlalchemy/cextension i686-pld-linux-gcc -DNDEBUG -O2 -fwrapv -pipe -Wformat -Werror=format-security -gdwarf-4 -fno-debug-types-section -fvar-tracking-assignments -g2 -Wp,-D_FORTIFY_SOURCE=2 -fstack-protector-strong --param=ssp-buffer-size=4 -fomit-frame-pointer -march=i686 -fasynchronous-unwind-tables -mtune=pentium4 -gdwarf-4 -fno-debug-types-section -fvar-tracking-assignments -g2 -O2 -fwrapv -pipe -Wformat -Werror=format-security -gdwarf-4 -fno-debug-types-section -fvar-tracking-assignments -g2 -Wp,-D_FORTIFY_SOURCE=2 -fstack-protector-strong --param=ssp-buffer-size=4 -fomit-frame-pointer -march=i686 -fasynchronous-unwind-tables -mtune=pentium4 -gdwarf-4 -fno-debug-types-section -fvar-tracking-assignments -g2 -fPIC -I/usr/include/python2.7 -c lib/sqlalchemy/cextension/processors.c -o build-2/temp.linux-i686-2.7/lib/sqlalchemy/cextension/processors.o i686-pld-linux-gcc -pthread -shared -Wl,--as-needed -Wl,--no-copy-dt-needed-entries -Wl,-z,relro -Wl,-z,combreloc -Wl,--as-needed -Wl,--no-copy-dt-needed-entries -Wl,-z,relro -Wl,-z,combreloc -O2 -fwrapv -pipe -Wformat -Werror=format-security -gdwarf-4 -fno-debug-types-section -fvar-tracking-assignments -g2 -Wp,-D_FORTIFY_SOURCE=2 -fstack-protector-strong --param=ssp-buffer-size=4 -fomit-frame-pointer -march=i686 -fasynchronous-unwind-tables -mtune=pentium4 -gdwarf-4 -fno-debug-types-section -fvar-tracking-assignments -g2 build-2/temp.linux-i686-2.7/lib/sqlalchemy/cextension/processors.o -L/usr/lib -lpython2.7 -o build-2/lib.linux-i686-2.7/sqlalchemy/cprocessors.so building 'sqlalchemy.cresultproxy' extension i686-pld-linux-gcc -DNDEBUG -O2 -fwrapv -pipe -Wformat -Werror=format-security -gdwarf-4 -fno-debug-types-section -fvar-tracking-assignments -g2 -Wp,-D_FORTIFY_SOURCE=2 -fstack-protector-strong --param=ssp-buffer-size=4 -fomit-frame-pointer -march=i686 -fasynchronous-unwind-tables -mtune=pentium4 -gdwarf-4 -fno-debug-types-section -fvar-tracking-assignments -g2 -O2 -fwrapv -pipe -Wformat -Werror=format-security -gdwarf-4 -fno-debug-types-section -fvar-tracking-assignments -g2 -Wp,-D_FORTIFY_SOURCE=2 -fstack-protector-strong --param=ssp-buffer-size=4 -fomit-frame-pointer -march=i686 -fasynchronous-unwind-tables -mtune=pentium4 -gdwarf-4 -fno-debug-types-section -fvar-tracking-assignments -g2 -fPIC -I/usr/include/python2.7 -c lib/sqlalchemy/cextension/resultproxy.c -o build-2/temp.linux-i686-2.7/lib/sqlalchemy/cextension/resultproxy.o i686-pld-linux-gcc -pthread -shared -Wl,--as-needed -Wl,--no-copy-dt-needed-entries -Wl,-z,relro -Wl,-z,combreloc -Wl,--as-needed -Wl,--no-copy-dt-needed-entries -Wl,-z,relro -Wl,-z,combreloc -O2 -fwrapv -pipe -Wformat -Werror=format-security -gdwarf-4 -fno-debug-types-section -fvar-tracking-assignments -g2 -Wp,-D_FORTIFY_SOURCE=2 -fstack-protector-strong --param=ssp-buffer-size=4 -fomit-frame-pointer -march=i686 -fasynchronous-unwind-tables -mtune=pentium4 -gdwarf-4 -fno-debug-types-section -fvar-tracking-assignments -g2 build-2/temp.linux-i686-2.7/lib/sqlalchemy/cextension/resultproxy.o -L/usr/lib -lpython2.7 -o build-2/lib.linux-i686-2.7/sqlalchemy/cresultproxy.so building 'sqlalchemy.cutils' extension i686-pld-linux-gcc -DNDEBUG -O2 -fwrapv -pipe -Wformat -Werror=format-security -gdwarf-4 -fno-debug-types-section -fvar-tracking-assignments -g2 -Wp,-D_FORTIFY_SOURCE=2 -fstack-protector-strong --param=ssp-buffer-size=4 -fomit-frame-pointer -march=i686 -fasynchronous-unwind-tables -mtune=pentium4 -gdwarf-4 -fno-debug-types-section -fvar-tracking-assignments -g2 -O2 -fwrapv -pipe -Wformat -Werror=format-security -gdwarf-4 -fno-debug-types-section -fvar-tracking-assignments -g2 -Wp,-D_FORTIFY_SOURCE=2 -fstack-protector-strong --param=ssp-buffer-size=4 -fomit-frame-pointer -march=i686 -fasynchronous-unwind-tables -mtune=pentium4 -gdwarf-4 -fno-debug-types-section -fvar-tracking-assignments -g2 -fPIC -I/usr/include/python2.7 -c lib/sqlalchemy/cextension/utils.c -o build-2/temp.linux-i686-2.7/lib/sqlalchemy/cextension/utils.o i686-pld-linux-gcc -pthread -shared -Wl,--as-needed -Wl,--no-copy-dt-needed-entries -Wl,-z,relro -Wl,-z,combreloc -Wl,--as-needed -Wl,--no-copy-dt-needed-entries -Wl,-z,relro -Wl,-z,combreloc -O2 -fwrapv -pipe -Wformat -Werror=format-security -gdwarf-4 -fno-debug-types-section -fvar-tracking-assignments -g2 -Wp,-D_FORTIFY_SOURCE=2 -fstack-protector-strong --param=ssp-buffer-size=4 -fomit-frame-pointer -march=i686 -fasynchronous-unwind-tables -mtune=pentium4 -gdwarf-4 -fno-debug-types-section -fvar-tracking-assignments -g2 build-2/temp.linux-i686-2.7/lib/sqlalchemy/cextension/utils.o -L/usr/lib -lpython2.7 -o build-2/lib.linux-i686-2.7/sqlalchemy/cutils.so running test running egg_info writing requirements to lib/SQLAlchemy.egg-info/requires.txt writing lib/SQLAlchemy.egg-info/PKG-INFO writing top-level names to lib/SQLAlchemy.egg-info/top_level.txt writing dependency_links to lib/SQLAlchemy.egg-info/dependency_links.txt reading manifest file 'lib/SQLAlchemy.egg-info/SOURCES.txt' reading manifest template 'MANIFEST.in' warning: no files found matching '*.jpg' under directory 'doc' warning: no files found matching '*.mako' under directory 'doc' warning: no files found matching 'distribute_setup.py' warning: no files found matching 'sa2to3.py' warning: no files found matching 'ez_setup.py' no previously-included directories found matching 'doc/build/output' writing manifest file 'lib/SQLAlchemy.egg-info/SOURCES.txt' running build_ext building 'sqlalchemy.cprocessors' extension i686-pld-linux-gcc -DNDEBUG -O2 -fwrapv -pipe -Wformat -Werror=format-security -gdwarf-4 -fno-debug-types-section -fvar-tracking-assignments -g2 -Wp,-D_FORTIFY_SOURCE=2 -fstack-protector-strong --param=ssp-buffer-size=4 -fomit-frame-pointer -march=i686 -fasynchronous-unwind-tables -mtune=pentium4 -gdwarf-4 -fno-debug-types-section -fvar-tracking-assignments -g2 -O2 -fwrapv -pipe -Wformat -Werror=format-security -gdwarf-4 -fno-debug-types-section -fvar-tracking-assignments -g2 -Wp,-D_FORTIFY_SOURCE=2 -fstack-protector-strong --param=ssp-buffer-size=4 -fomit-frame-pointer -march=i686 -fasynchronous-unwind-tables -mtune=pentium4 -gdwarf-4 -fno-debug-types-section -fvar-tracking-assignments -g2 -fPIC -I/usr/include/python2.7 -c lib/sqlalchemy/cextension/processors.c -o build-2/temp.linux-i686-2.7/lib/sqlalchemy/cextension/processors.o i686-pld-linux-gcc -pthread -shared -Wl,--as-needed -Wl,--no-copy-dt-needed-entries -Wl,-z,relro -Wl,-z,combreloc -Wl,--as-needed -Wl,--no-copy-dt-needed-entries -Wl,-z,relro -Wl,-z,combreloc -O2 -fwrapv -pipe -Wformat -Werror=format-security -gdwarf-4 -fno-debug-types-section -fvar-tracking-assignments -g2 -Wp,-D_FORTIFY_SOURCE=2 -fstack-protector-strong --param=ssp-buffer-size=4 -fomit-frame-pointer -march=i686 -fasynchronous-unwind-tables -mtune=pentium4 -gdwarf-4 -fno-debug-types-section -fvar-tracking-assignments -g2 build-2/temp.linux-i686-2.7/lib/sqlalchemy/cextension/processors.o -L/usr/lib -lpython2.7 -o /tmp/B.VpBclu/BUILD/SQLAlchemy-1.2.13/lib/sqlalchemy/cprocessors.so building 'sqlalchemy.cresultproxy' extension i686-pld-linux-gcc -DNDEBUG -O2 -fwrapv -pipe -Wformat -Werror=format-security -gdwarf-4 -fno-debug-types-section -fvar-tracking-assignments -g2 -Wp,-D_FORTIFY_SOURCE=2 -fstack-protector-strong --param=ssp-buffer-size=4 -fomit-frame-pointer -march=i686 -fasynchronous-unwind-tables -mtune=pentium4 -gdwarf-4 -fno-debug-types-section -fvar-tracking-assignments -g2 -O2 -fwrapv -pipe -Wformat -Werror=format-security -gdwarf-4 -fno-debug-types-section -fvar-tracking-assignments -g2 -Wp,-D_FORTIFY_SOURCE=2 -fstack-protector-strong --param=ssp-buffer-size=4 -fomit-frame-pointer -march=i686 -fasynchronous-unwind-tables -mtune=pentium4 -gdwarf-4 -fno-debug-types-section -fvar-tracking-assignments -g2 -fPIC -I/usr/include/python2.7 -c lib/sqlalchemy/cextension/resultproxy.c -o build-2/temp.linux-i686-2.7/lib/sqlalchemy/cextension/resultproxy.o i686-pld-linux-gcc -pthread -shared -Wl,--as-needed -Wl,--no-copy-dt-needed-entries -Wl,-z,relro -Wl,-z,combreloc -Wl,--as-needed -Wl,--no-copy-dt-needed-entries -Wl,-z,relro -Wl,-z,combreloc -O2 -fwrapv -pipe -Wformat -Werror=format-security -gdwarf-4 -fno-debug-types-section -fvar-tracking-assignments -g2 -Wp,-D_FORTIFY_SOURCE=2 -fstack-protector-strong --param=ssp-buffer-size=4 -fomit-frame-pointer -march=i686 -fasynchronous-unwind-tables -mtune=pentium4 -gdwarf-4 -fno-debug-types-section -fvar-tracking-assignments -g2 build-2/temp.linux-i686-2.7/lib/sqlalchemy/cextension/resultproxy.o -L/usr/lib -lpython2.7 -o /tmp/B.VpBclu/BUILD/SQLAlchemy-1.2.13/lib/sqlalchemy/cresultproxy.so building 'sqlalchemy.cutils' extension i686-pld-linux-gcc -DNDEBUG -O2 -fwrapv -pipe -Wformat -Werror=format-security -gdwarf-4 -fno-debug-types-section -fvar-tracking-assignments -g2 -Wp,-D_FORTIFY_SOURCE=2 -fstack-protector-strong --param=ssp-buffer-size=4 -fomit-frame-pointer -march=i686 -fasynchronous-unwind-tables -mtune=pentium4 -gdwarf-4 -fno-debug-types-section -fvar-tracking-assignments -g2 -O2 -fwrapv -pipe -Wformat -Werror=format-security -gdwarf-4 -fno-debug-types-section -fvar-tracking-assignments -g2 -Wp,-D_FORTIFY_SOURCE=2 -fstack-protector-strong --param=ssp-buffer-size=4 -fomit-frame-pointer -march=i686 -fasynchronous-unwind-tables -mtune=pentium4 -gdwarf-4 -fno-debug-types-section -fvar-tracking-assignments -g2 -fPIC -I/usr/include/python2.7 -c lib/sqlalchemy/cextension/utils.c -o build-2/temp.linux-i686-2.7/lib/sqlalchemy/cextension/utils.o i686-pld-linux-gcc -pthread -shared -Wl,--as-needed -Wl,--no-copy-dt-needed-entries -Wl,-z,relro -Wl,-z,combreloc -Wl,--as-needed -Wl,--no-copy-dt-needed-entries -Wl,-z,relro -Wl,-z,combreloc -O2 -fwrapv -pipe -Wformat -Werror=format-security -gdwarf-4 -fno-debug-types-section -fvar-tracking-assignments -g2 -Wp,-D_FORTIFY_SOURCE=2 -fstack-protector-strong --param=ssp-buffer-size=4 -fomit-frame-pointer -march=i686 -fasynchronous-unwind-tables -mtune=pentium4 -gdwarf-4 -fno-debug-types-section -fvar-tracking-assignments -g2 build-2/temp.linux-i686-2.7/lib/sqlalchemy/cextension/utils.o -L/usr/lib -lpython2.7 -o /tmp/B.VpBclu/BUILD/SQLAlchemy-1.2.13/lib/sqlalchemy/cutils.so ============================= test session starts ============================== platform linux2 -- Python 2.7.15, pytest-3.6.3, py-1.5.4, pluggy-0.6.0 rootdir: /tmp/B.VpBclu/BUILD/SQLAlchemy-1.2.13, inifile: setup.cfg plugins: xdist-1.22.5, timeout-1.2.0, forked-0.2, flake8-1.0.1, expect-1.1.0, cov-2.4.0, pyfakefs-3.4.3, hypothesis-3.66.1 collected 8808 items test/aaa_profiling/test_compiler.py sssss [ 0%] test/aaa_profiling/test_orm.py ssssssssssssssssss [ 0%] test/aaa_profiling/test_pool.py sss [ 0%] test/aaa_profiling/test_resultset.py sssssss.. [ 0%] test/aaa_profiling/test_zoomark.py s [ 0%] test/aaa_profiling/test_zoomark_orm.py s [ 0%] test/base/test_dependency.py ............... [ 0%] test/base/test_events.py ............................................... [ 1%] ............ [ 1%] test/base/test_except.py .............. [ 1%] test/base/test_inspect.py .... [ 1%] test/base/test_tutorials.py F. [ 1%] test/base/test_utils.py ................................................ [ 2%] ...............................................................s........ [ 2%] ...................... [ 3%] test/dialect/mssql/test_compiler.py .................................... [ 3%] ............................ [ 3%] test/dialect/mssql/test_engine.py .....s................... [ 4%] test/dialect/mssql/test_query.py sss.......ssssssssssssssssss [ 4%] test/dialect/mssql/test_reflection.py ...sssssssssssss [ 4%] test/dialect/mssql/test_types.py ssssssssssssssssssssssssss..........sss [ 5%] ssss [ 5%] test/dialect/mysql/test_compiler.py .................................... [ 5%] .............. [ 5%] test/dialect/mysql/test_dialect.py ssssssssssssssssssss..sssssss [ 5%] test/dialect/mysql/test_on_duplicate.py sss [ 6%] test/dialect/mysql/test_query.py sssssssssss [ 6%] test/dialect/mysql/test_reflection.py ...sssssssssssssssss [ 6%] test/dialect/mysql/test_types.py ssssssssssssssssssssssssssssssssssss [ 6%] test/dialect/oracle/test_compiler.py ................................ [ 7%] test/dialect/oracle/test_dialect.py .....sssssssssss [ 7%] test/dialect/oracle/test_reflection.py sssssssssssssssssssssss [ 7%] test/dialect/oracle/test_types.py .......sssssssssssssssssssssssssssssss [ 8%] sssssssss [ 8%] test/dialect/postgresql/test_compiler.py ............................... [ 8%] ......................................................................s [ 9%] test/dialect/postgresql/test_dialect.py sssssssssssssss.s.ssssssssssss [ 9%] test/dialect/postgresql/test_on_conflict.py ssssssssssssssssss [ 9%] test/dialect/postgresql/test_query.py ssssssssssssssssssssssssssssssssss [ 10%] [ 10%] test/dialect/postgresql/test_reflection.py ..sssssssssssssssssssssssssss [ 10%] ssssssssssssssssssssssss [ 10%] test/dialect/postgresql/test_types.py ....................ssssssssssssss [ 11%] ssssss...................sssssss...................sssssss.............. [ 12%] .....ssssssssssssssssssssssssssssssssssssssssss......................... [ 12%] .......ssss...................sssssss...................ssssssssssssssss [ 13%] sssssssssssss..............ssssssssssssssssssssss....................... [ 14%] .....sssssssssssssssssssssssssssssssssssssss.ssssssss.sssssssssss [ 15%] test/dialect/test_all.py . [ 15%] test/dialect/test_firebird.py ......sss........ssssss [ 15%] test/dialect/test_mxodbc.py . [ 15%] test/dialect/test_pyodbc.py . [ 15%] test/dialect/test_sqlite.py ............................................ [ 16%] ................................................... [ 16%] test/dialect/test_suite.py ss....ssssss........ss.......s........ss..... [ 17%] .........................................sssssss..s.......ssssssssssssss [ 17%] ........................ss........................ssss.....sssssssssssss [ 18%] ssssss.....................sss........ [ 19%] test/dialect/test_sybase.py .... [ 19%] test/engine/test_bind.py ......... [ 19%] test/engine/test_ddlevents.py .............................. [ 19%] test/engine/test_execute.py ..........................................s. [ 20%] ...........s.................................ss......................... [ 20%] ..s.... [ 21%] test/engine/test_logging.py ......................... [ 21%] test/engine/test_parseconnect.py ......................... [ 21%] test/engine/test_pool.py ............................................... [ 22%] .............................................. [ 22%] test/engine/test_processors.py ......................................... [ 23%] .. [ 23%] test/engine/test_reconnect.py ....................................ss.. [ 23%] test/engine/test_reflection.py ...........................s.....s....... [ 24%] ...................s.s.s..s.s.... [ 24%] test/engine/test_transaction.py .sssssss.............sss...s.sss........ [ 24%] ..ss.......s.s.....ss...ss.ss..s..ss.ss. [ 25%] test/ext/declarative/test_basic.py ..................................... [ 25%] .......................................... [ 26%] test/ext/declarative/test_clsregistry.py ............. [ 26%] test/ext/declarative/test_inheritance.py ............................... [ 26%] ................ [ 26%] test/ext/declarative/test_mixin.py ..................................... [ 27%] ......................................... [ 27%] test/ext/declarative/test_reflection.py .................. [ 28%] test/ext/test_associationproxy.py ...................................... [ 28%] ............................................ [ 28%] test/ext/test_automap.py ............... [ 29%] test/ext/test_baked.py ................................................ [ 29%] test/ext/test_compiler.py .................. [ 29%] test/ext/test_extendedattr.py ...................... [ 30%] test/ext/test_horizontal_shard.py ................... [ 30%] test/ext/test_hybrid.py ................................................ [ 30%] ......... [ 30%] test/ext/test_indexable.py ssssssssss........ [ 31%] test/ext/test_mutable.py ............................................... [ 31%] ........................ssssssssssssssss................................ [ 32%] ........................................................................ [ 33%] .. [ 33%] test/ext/test_orderinglist.py ........ [ 33%] test/ext/test_serializer.py ............. [ 33%] test/orm/inheritance/test_abc_inheritance.py .................. [ 33%] test/orm/inheritance/test_abc_polymorphic.py .. [ 33%] test/orm/inheritance/test_assorted_poly.py ............................. [ 34%] .... [ 34%] test/orm/inheritance/test_basic.py ..................................... [ 34%] ............ssss..................................... [ 35%] test/orm/inheritance/test_concrete.py .............. [ 35%] test/orm/inheritance/test_magazine.py ... [ 35%] test/orm/inheritance/test_manytomany.py ..... [ 35%] test/orm/inheritance/test_poly_linked_list.py .... [ 35%] test/orm/inheritance/test_poly_loading.py .......... [ 35%] test/orm/inheritance/test_poly_persistence.py ..................... [ 35%] test/orm/inheritance/test_polymorphic_rel.py ........................... [ 36%] ........................................................................ [ 37%] ........................................................................ [ 37%] ........................................................................ [ 38%] ........................................................................ [ 39%] ........................................................................ [ 40%] ........................................................................ [ 41%] ........................................................................ [ 41%] ...................................................................... [ 42%] test/orm/inheritance/test_productspec.py ..... [ 42%] test/orm/inheritance/test_relationship.py .............................. [ 43%] ..................... [ 43%] test/orm/inheritance/test_selects.py .. [ 43%] test/orm/inheritance/test_single.py .................................... [ 43%] .. [ 43%] test/orm/inheritance/test_with_poly.py .................... [ 44%] test/orm/test_association.py .... [ 44%] test/orm/test_assorted_eager.py .............. [ 44%] test/orm/test_attributes.py ............................................ [ 44%] ........................................................................ [ 45%] .............. [ 45%] test/orm/test_backref_mutations.py ............................... [ 46%] test/orm/test_bind.py ..................... [ 46%] test/orm/test_bulk.py ................... [ 46%] test/orm/test_bundle.py ................. [ 46%] test/orm/test_cascade.py ............................................... [ 47%] ........................................................................ [ 48%] ....... [ 48%] test/orm/test_collection.py .......................................... [ 48%] test/orm/test_compile.py ..... [ 48%] test/orm/test_composites.py ......................................... [ 49%] test/orm/test_cycles.py ............................ [ 49%] test/orm/test_default_strategies.py .................. [ 49%] test/orm/test_defaults.py ... [ 49%] test/orm/test_deferred.py .............................................. [ 50%] . [ 50%] test/orm/test_deprecations.py ......................... [ 50%] test/orm/test_descriptor.py ..... [ 50%] test/orm/test_dynamic.py ............................................... [ 51%] ... [ 51%] test/orm/test_eager_relations.py ....................................... [ 51%] .............................................................s.......... [ 52%] ..... [ 52%] test/orm/test_evaluator.py ......... [ 52%] test/orm/test_events.py ................................................ [ 53%] ............................................. [ 53%] test/orm/test_expire.py ................................................ [ 54%] ......... [ 54%] test/orm/test_froms.py ................................................. [ 54%] .............................. [ 55%] test/orm/test_generative.py ............... [ 55%] test/orm/test_hasparent.py ....... [ 55%] test/orm/test_immediate_load.py .. [ 55%] test/orm/test_inspect.py ....................................... [ 55%] test/orm/test_instrumentation.py ............................sssss [ 56%] test/orm/test_joins.py ................................................. [ 56%] ................................................................. [ 57%] test/orm/test_lazy_relations.py ........................................ [ 58%] [ 58%] test/orm/test_load_on_fks.py ................. [ 58%] test/orm/test_loading.py ....... [ 58%] test/orm/test_lockmode.py ......................... [ 58%] test/orm/test_manytomany.py ........ [ 58%] test/orm/test_mapper.py ................................................ [ 59%] ........................................................................ [ 60%] .............. [ 60%] test/orm/test_merge.py ............................................... [ 60%] test/orm/test_naturalpks.py .s.......s..s.s.sssssssssssssssssss.sssss. [ 61%] test/orm/test_of_type.py ............................................... [ 61%] ......................................................... [ 62%] test/orm/test_onetoone.py . [ 62%] test/orm/test_options.py ............................................... [ 62%] ................................................................. [ 63%] test/orm/test_pickled.py ...................... [ 63%] test/orm/test_query.py ................................................. [ 64%] ........................................................................ [ 65%] ........................................................................ [ 66%] ........................................................................ [ 66%] ........... [ 67%] test/orm/test_rel_fn.py ................................................ [ 67%] .................. [ 67%] test/orm/test_relationships.py ......................................... [ 68%] ........................................................................ [ 69%] ............. [ 69%] test/orm/test_scoping.py ... [ 69%] test/orm/test_selectable.py .... [ 69%] test/orm/test_selectin_relations.py .................................... [ 69%] ................ [ 69%] test/orm/test_session.py ........s..................................s..s [ 70%] ...............................s...... [ 70%] test/orm/test_subquery_relations.py .................................... [ 71%] ..................... [ 71%] test/orm/test_sync.py ................. [ 71%] test/orm/test_transaction.py ..................sss.s......s....sssssssss [ 72%] .....s...s..sssssssss.......s..ss....s [ 72%] test/orm/test_unitofwork.py s....................ssss................... [ 73%] ..........sss................... [ 73%] test/orm/test_unitofworkv2.py .......................................... [ 73%] ........................................ [ 74%] test/orm/test_update_delete.py ..s.ss.s.ss.............................. [ 74%] ............. [ 75%] test/orm/test_utils.py .......................................... [ 75%] test/orm/test_validators.py .......... [ 75%] test/orm/test_versioning.py ............................s............... [ 76%] ..........ss.. [ 76%] test/sql/test_case_statement.py ..... [ 76%] test/sql/test_compiler.py .............................................. [ 76%] ........................................................................ [ 77%] ...................................................... [ 78%] test/sql/test_constraints.py ........................................... [ 78%] ........ [ 78%] test/sql/test_cte.py ................................... [ 79%] test/sql/test_ddlemit.py ............... [ 79%] test/sql/test_defaults.py .......sssss...............................s.. [ 79%] sssss.sssssssssssssssssss...s.s....s....s.ss... [ 80%] test/sql/test_delete.py ....ssss..... [ 80%] test/sql/test_functions.py ............................................. [ 81%] ................ [ 81%] test/sql/test_generative.py ............................................ [ 81%] ...................................................... [ 82%] test/sql/test_insert.py ................................................ [ 82%] ................ [ 83%] test/sql/test_insert_exec.py ....sss.s...s.ss.....s... [ 83%] test/sql/test_inspect.py .... [ 83%] test/sql/test_join_rewriting.py ........................................ [ 83%] ......... [ 84%] test/sql/test_labels.py ....................... [ 84%] test/sql/test_lateral.py ..... [ 84%] test/sql/test_metadata.py .............................................. [ 84%] ........................................................................ [ 85%] ........................................................................ [ 86%] ........................................................................ [ 87%] ....................................... [ 87%] test/sql/test_operators.py ............................................. [ 88%] ........................................................................ [ 89%] ........................................................................ [ 89%] ........................................................................ [ 90%] ........................................................................ [ 91%] .................................... [ 91%] test/sql/test_query.py ................................s.......s........ [ 92%] ........... [ 92%] test/sql/test_quote.py ........................................... [ 93%] test/sql/test_resultset.py ............................................. [ 93%] .............s.............................. [ 94%] test/sql/test_returning.py ss..sssssssssssssssssssss [ 94%] test/sql/test_rowcount.py ......... [ 94%] test/sql/test_selectable.py ............................................ [ 95%] ........................................................................ [ 95%] ............................................... [ 96%] test/sql/test_tablesample.py .. [ 96%] test/sql/test_text.py .................................................. [ 96%] ............. [ 97%] test/sql/test_type_expressions.py ...s................ [ 97%] test/sql/test_types.py ................................................. [ 97%] ........................................................................ [ 98%] .......................................................... [ 99%] test/sql/test_unicode.py .... [ 99%] test/sql/test_update.py ............sssssssss........................ [ 99%] test/sql/test_utils.py ...... [100%] =================================== FAILURES =================================== ______________________________ DocTest.test_core _______________________________ Traceback (most recent call last): File "/tmp/B.VpBclu/BUILD/SQLAlchemy-1.2.13/test/base/test_tutorials.py", line 86, in test_core self._run_doctest("core/tutorial.rst") File "/tmp/B.VpBclu/BUILD/SQLAlchemy-1.2.13/test/base/test_tutorials.py", line 80, in _run_doctest self._run_doctest_for_content(fname, content) File "/tmp/B.VpBclu/BUILD/SQLAlchemy-1.2.13/test/base/test_tutorials.py", line 69, in _run_doctest_for_content assert not runner.failures AssertionError: assert not 2 + where 2 = <doctest.DocTestRunner instance at 0xeff7258c>.failures ----------------------------- Captured stdout call ----------------------------- ********************************************************************** File "core/tutorial.rst", line 1037, in core/tutorial.rst Failed example: conn.execute(stmt).fetchall() Expected: SELECT addresses.user_id, count(addresses.id) AS num_addresses FROM addresses ORDER BY num_addresses () [(2, 4)] Got: SELECT addresses.user_id, count(addresses.id) AS num_addresses FROM addresses ORDER BY num_addresses () [(1, 4)] ********************************************************************** File "core/tutorial.rst", line 1054, in core/tutorial.rst Failed example: conn.execute(stmt).fetchall() Expected: SELECT addresses.user_id, count(addresses.id) AS num_addresses FROM addresses ORDER BY num_addresses DESC () [(2, 4)] Got: SELECT addresses.user_id, count(addresses.id) AS num_addresses FROM addresses ORDER BY num_addresses DESC () [(1, 4)] ********************************************************************** 1 items had failures: 2 of 175 in core/tutorial.rst ***Test Failed*** 2 failures. =========================== short test summary info ============================ SKIP [1] /tmp/B.VpBclu/BUILD/SQLAlchemy-1.2.13/test/../lib/sqlalchemy/testing/config.py:101: 'test_reset_via_agent_begin_twophase' : no SA implementation or two-phase xact not supported by drivers or two-phase xact not implemented in SQLA/oracle or two-phase xact not supported by database or two-phase xact not supported by database or two-phase xact not supported by drivers/SQLA or FIXME: JDBC driver confuses the transaction state, may need separate XA implementation or recent MySQL communiity editions have too many issues (late 2016), disabling for now SKIP [1] /tmp/B.VpBclu/BUILD/SQLAlchemy-1.2.13/test/../lib/sqlalchemy/testing/config.py:101: 'test_nested_accounting_deleted_items_restored' : savepoints not supported SKIP [1] /tmp/B.VpBclu/BUILD/SQLAlchemy-1.2.13/test/../lib/sqlalchemy/testing/config.py:101: 'test_unknown_types' : sqlite SKIP [1] /tmp/B.VpBclu/BUILD/SQLAlchemy-1.2.13/test/../lib/sqlalchemy/testing/config.py:101: 'test_pg_dialect_use_native_unicode_from_config' : not postgresql+psycopg2 and not postgresql+psycopg2cffi SKIP [3] /tmp/B.VpBclu/BUILD/SQLAlchemy-1.2.13/test/../lib/sqlalchemy/testing/config.py:101: 'AnyAllTest' unsupported on any DB implementation 'sqlite(3.25.3)+pysqlite' SKIP [1] /tmp/B.VpBclu/BUILD/SQLAlchemy-1.2.13/test/../lib/sqlalchemy/testing/config.py:101: 'CompositeStatementTest' unsupported on any DB implementation 'sqlite(3.25.3)+pysqlite'sqlite doesn't support 'returning' SKIP [1] /tmp/B.VpBclu/BUILD/SQLAlchemy-1.2.13/test/../lib/sqlalchemy/testing/config.py:101: 'test_autoflush' : independent connections disabled when :memory: connections are used or SQL Server 2005+ is required for independent connections SKIP [1] /tmp/B.VpBclu/BUILD/SQLAlchemy-1.2.13/test/../lib/sqlalchemy/testing/config.py:101: 'test_explicit_sequence' : no sequence support SKIP [14] /tmp/B.VpBclu/BUILD/SQLAlchemy-1.2.13/test/../lib/sqlalchemy/testing/config.py:101: 'BinaryTest' unsupported on any DB implementation 'sqlite(3.25.3)+pysqlite' SKIP [2] /tmp/B.VpBclu/BUILD/SQLAlchemy-1.2.13/test/../lib/sqlalchemy/testing/config.py:101: 'TimezoneTest' unsupported on any DB implementation 'sqlite(3.25.3)+pysqlite' SKIP [1] /tmp/B.VpBclu/BUILD/SQLAlchemy-1.2.13/test/../lib/sqlalchemy/testing/config.py:101: 'test_nested_accounting_new_items_removed' : savepoints not supported SKIP [7] /tmp/B.VpBclu/BUILD/SQLAlchemy-1.2.13/test/../lib/sqlalchemy/testing/config.py:101: 'Int8RangeRoundTripTest' unsupported on any DB implementation 'sqlite(3.25.3)+pysqlite'custom function SKIP [1] /tmp/B.VpBclu/BUILD/SQLAlchemy-1.2.13/test/../lib/sqlalchemy/testing/config.py:101: 'test_has_schema' : not postgresql and not mysql and not mssql SKIP [7] /tmp/B.VpBclu/BUILD/SQLAlchemy-1.2.13/test/../lib/sqlalchemy/testing/config.py:101: 'Int4RangeRoundTripTest' unsupported on any DB implementation 'sqlite(3.25.3)+pysqlite'custom function SKIP [1] /tmp/B.VpBclu/BUILD/SQLAlchemy-1.2.13/test/../lib/sqlalchemy/testing/config.py:101: 'test_lastrow_accessor_two' : sqlite SKIP [3] /tmp/B.VpBclu/BUILD/SQLAlchemy-1.2.13/test/../lib/sqlalchemy/testing/config.py:101: 'SQLModeDetectionTest' unsupported on any DB implementation 'sqlite(3.25.3)+pysqlite' SKIP [22] /tmp/B.VpBclu/BUILD/SQLAlchemy-1.2.13/test/../lib/sqlalchemy/testing/config.py:101: 'JSONBRoundTripTest' unsupported on any DB implementation 'sqlite(3.25.3)+pysqlite' SKIP [3] /tmp/B.VpBclu/BUILD/SQLAlchemy-1.2.13/test/../lib/sqlalchemy/testing/config.py:101: 'FloatCoercionTest' unsupported on any DB implementation 'sqlite(3.25.3)+pysqlite' SKIP [2] /tmp/B.VpBclu/BUILD/SQLAlchemy-1.2.13/test/../lib/sqlalchemy/testing/config.py:101: 'TableReflectionTest' unsupported on any DB implementation 'sqlite(3.25.3)+pysqlite' SKIP [37] /tmp/B.VpBclu/BUILD/SQLAlchemy-1.2.13/test/../lib/sqlalchemy/testing/config.py:101: 'TypesTest' unsupported on any DB implementation 'sqlite(3.25.3)+pysqlite' SKIP [1] /tmp/B.VpBclu/BUILD/SQLAlchemy-1.2.13/test/../lib/sqlalchemy/testing/config.py:101: 'IdiosyncrasyTest' unsupported on any DB implementation 'sqlite(3.25.3)+pysqlite' SKIP [1] /tmp/B.VpBclu/BUILD/SQLAlchemy-1.2.13/test/../lib/sqlalchemy/testing/config.py:101: 'test_int_default_on_insert_with_returning' : sqlite doesn't support 'returning' SKIP [7] /tmp/B.VpBclu/BUILD/SQLAlchemy-1.2.13/test/../lib/sqlalchemy/testing/config.py:101: 'TypeRoundTripTest' unsupported on any DB implementation 'sqlite(3.25.3)+pysqlite' SKIP [1] /tmp/B.VpBclu/BUILD/SQLAlchemy-1.2.13/test/../lib/sqlalchemy/testing/config.py:101: 'test_branch_twophase_rollback' : no SA implementation or two-phase xact not supported by drivers or two-phase xact not implemented in SQLA/oracle or two-phase xact not supported by database or two-phase xact not supported by database or two-phase xact not supported by drivers/SQLA or FIXME: JDBC driver confuses the transaction state, may need separate XA implementation or recent MySQL communiity editions have too many issues (late 2016), disabling for now SKIP [1] /tmp/B.VpBclu/BUILD/SQLAlchemy-1.2.13/test/../lib/sqlalchemy/testing/config.py:101: 'test_bad_freetds_warning' : not mssql+pymssql SKIP [7] /tmp/B.VpBclu/BUILD/SQLAlchemy-1.2.13/test/../lib/sqlalchemy/testing/config.py:101: 'LOBFetchTest' unsupported on any DB implementation 'sqlite(3.25.3)+pysqlite' SKIP [5] /tmp/B.VpBclu/BUILD/SQLAlchemy-1.2.13/test/../lib/sqlalchemy/testing/config.py:101: 'SequenceAsServerDefaultTest' unsupported on any DB implementation 'sqlite(3.25.3)+pysqlite'doesn't support sequences as a server side default. SKIP [1] /tmp/B.VpBclu/BUILD/SQLAlchemy-1.2.13/test/../lib/sqlalchemy/testing/config.py:101: 'KeyReturningTest' unsupported on any DB implementation 'sqlite(3.25.3)+pysqlite'sqlite doesn't support 'returning' SKIP [1] /tmp/B.VpBclu/BUILD/SQLAlchemy-1.2.13/test/../lib/sqlalchemy/testing/config.py:101: 'test_string_default_on_insert_with_returning' : sqlite doesn't support 'returning' SKIP [5] /tmp/B.VpBclu/BUILD/SQLAlchemy-1.2.13/test/../lib/sqlalchemy/testing/config.py:101: 'UUIDTest' unsupported on any DB implementation 'sqlite(3.25.3)+pysqlite' SKIP [1] /tmp/B.VpBclu/BUILD/SQLAlchemy-1.2.13/test/../lib/sqlalchemy/testing/config.py:101: 'DBLinkReflectionTest' unsupported on any DB implementation 'sqlite(3.25.3)+pysqlite' SKIP [16] /tmp/B.VpBclu/BUILD/SQLAlchemy-1.2.13/test/../lib/sqlalchemy/testing/config.py:101: 'MutableColumnCopyArrayTest' unsupported on any DB implementation 'sqlite(3.25.3)+pysqlite'custom function SKIP [7] /tmp/B.VpBclu/BUILD/SQLAlchemy-1.2.13/test/../lib/sqlalchemy/testing/config.py:101: 'NumRangeRoundTripTest' unsupported on any DB implementation 'sqlite(3.25.3)+pysqlite'custom function SKIP [1] /tmp/B.VpBclu/BUILD/SQLAlchemy-1.2.13/test/../lib/sqlalchemy/testing/config.py:101: 'test_cursor_execute' : no sequence support SKIP [3] /tmp/B.VpBclu/BUILD/SQLAlchemy-1.2.13/test/../lib/sqlalchemy/testing/config.py:101: 'TimestampMicrosecondsTest' unsupported on any DB implementation 'sqlite(3.25.3)+pysqlite'not oracle SKIP [4] /tmp/B.VpBclu/BUILD/SQLAlchemy-1.2.13/test/../lib/sqlalchemy/testing/config.py:101: 'RegClassTest' unsupported on any DB implementation 'sqlite(3.25.3)+pysqlite' SKIP [1] /tmp/B.VpBclu/BUILD/SQLAlchemy-1.2.13/test/../lib/sqlalchemy/testing/config.py:101: 'OIDTest' unsupported on any DB implementation 'sqlite(3.25.3)+pysqlite' SKIP [1] /tmp/B.VpBclu/BUILD/SQLAlchemy-1.2.13/test/../lib/sqlalchemy/testing/config.py:101: 'test_comment_reflection' : not postgresql and not mysql and not oracle SKIP [1] /tmp/B.VpBclu/BUILD/SQLAlchemy-1.2.13/test/../lib/sqlalchemy/testing/config.py:101: 'test_rollback_on_invalid_twophase' : no SA implementation or two-phase xact not supported by drivers or two-phase xact not implemented in SQLA/oracle or two-phase xact not supported by database or two-phase xact not supported by database or two-phase xact not supported by drivers/SQLA or FIXME: JDBC driver confuses the transaction state, may need separate XA implementation or recent MySQL communiity editions have too many issues (late 2016), disabling for now SKIP [9] /tmp/B.VpBclu/BUILD/SQLAlchemy-1.2.13/test/../lib/sqlalchemy/testing/config.py:101: 'TypeReflectionTest' unsupported on any DB implementation 'sqlite(3.25.3)+pysqlite' SKIP [1] /tmp/B.VpBclu/BUILD/SQLAlchemy-1.2.13/test/../lib/sqlalchemy/testing/config.py:101: 'BatchDeleteIgnoresRowcountTest' unsupported on any DB implementation 'sqlite(3.25.3)+pysqlite'not supported by database SKIP [14] /tmp/B.VpBclu/BUILD/SQLAlchemy-1.2.13/test/../lib/sqlalchemy/testing/config.py:101: 'ServerSideCursorsTest' unsupported on any DB implementation 'sqlite(3.25.3)+pysqlite'no server side cursors support SKIP [1] /tmp/B.VpBclu/BUILD/SQLAlchemy-1.2.13/test/../lib/sqlalchemy/testing/config.py:101: 'test_two_phase_recover' : no SA implementation or two-phase xact not supported by drivers or two-phase xact not implemented in SQLA/oracle or two-phase xact not supported by database or two-phase xact not supported by database or two-phase xact not supported by drivers/SQLA or FIXME: JDBC driver confuses the transaction state, may need separate XA implementation or recent MySQL communiity editions have too many issues (late 2016), disabling for now SKIP [1] /tmp/B.VpBclu/BUILD/SQLAlchemy-1.2.13/test/../lib/sqlalchemy/testing/config.py:101: 'test_delete_from' : Backend does not support DELETE..FROM and Backend does not support DELETE..FROM and Backend does not support DELETE..FROM and Backend does not support DELETE..FROM SKIP [13] /tmp/B.VpBclu/BUILD/SQLAlchemy-1.2.13/test/../lib/sqlalchemy/testing/config.py:101: 'SetInputSizesTest' unsupported on any DB implementation 'sqlite(3.25.3)+pysqlite' SKIP [3] /tmp/B.VpBclu/BUILD/SQLAlchemy-1.2.13/test/../lib/sqlalchemy/testing/config.py:101: 'ExecuteTest' unsupported on any DB implementation 'sqlite(3.25.3)+pysqlite' SKIP [7] /tmp/B.VpBclu/BUILD/SQLAlchemy-1.2.13/test/../lib/sqlalchemy/testing/config.py:101: 'DateRangeRoundTripTest' unsupported on any DB implementation 'sqlite(3.25.3)+pysqlite'custom function SKIP [13] /tmp/B.VpBclu/BUILD/SQLAlchemy-1.2.13/test/../lib/sqlalchemy/testing/config.py:101: 'HStoreRoundTripTest' unsupported on any DB implementation 'sqlite(3.25.3)+pysqlite'needs hstore extension SKIP [1] /tmp/B.VpBclu/BUILD/SQLAlchemy-1.2.13/test/../lib/sqlalchemy/testing/config.py:101: 'test_exec_two_table_plus_alias' : Backend does not support UPDATE..FROM and Backend does not support UPDATE..FROM and Backend does not support UPDATE..FROM SKIP [3] /tmp/B.VpBclu/BUILD/SQLAlchemy-1.2.13/test/../lib/sqlalchemy/testing/config.py:101: 'ForeignTableReflectionTest' unsupported on any DB implementation 'sqlite(3.25.3)+pysqlite' SKIP [1] /tmp/B.VpBclu/BUILD/SQLAlchemy-1.2.13/test/../lib/sqlalchemy/testing/config.py:101: 'test_expanding_in_composite' : not mysql and not postgresql SKIP [4] /tmp/B.VpBclu/BUILD/SQLAlchemy-1.2.13/test/../lib/sqlalchemy/testing/config.py:101: 'SpecialTypesTest' unsupported on any DB implementation 'sqlite(3.25.3)+pysqlite' SKIP [1] /tmp/B.VpBclu/BUILD/SQLAlchemy-1.2.13/test/../lib/sqlalchemy/testing/config.py:101: 'test_begin_begin_nested_close' : savepoints not supported SKIP [1] /tmp/B.VpBclu/BUILD/SQLAlchemy-1.2.13/test/../lib/sqlalchemy/testing/config.py:101: 'test_reset_via_agent_begin_twophase_commit' : no SA implementation or two-phase xact not supported by drivers or two-phase xact not implemented in SQLA/oracle or two-phase xact not supported by database or two-phase xact not supported by database or two-phase xact not supported by drivers/SQLA or FIXME: JDBC driver confuses the transaction state, may need separate XA implementation or recent MySQL communiity editions have too many issues (late 2016), disabling for now SKIP [1] /tmp/B.VpBclu/BUILD/SQLAlchemy-1.2.13/test/../lib/sqlalchemy/testing/config.py:101: 'test_get_inter_schema_foreign_keys' : not postgresql and not mysql and not mssql SKIP [1] /tmp/B.VpBclu/BUILD/SQLAlchemy-1.2.13/test/../lib/sqlalchemy/testing/config.py:101: 'test_change_m2o_passive' : target backend doesn't support ON UPDATE CASCADE SKIP [1] /tmp/B.VpBclu/BUILD/SQLAlchemy-1.2.13/test/../lib/sqlalchemy/testing/config.py:101: 'ReflectHugeViewTest' unsupported on any DB implementation 'sqlite(3.25.3)+pysqlite' SKIP [1] /tmp/B.VpBclu/BUILD/SQLAlchemy-1.2.13/test/../lib/sqlalchemy/testing/config.py:101: 'test_twophase' : no SA implementation or two-phase xact not supported by drivers or two-phase xact not implemented in SQLA/oracle or two-phase xact not supported by database or two-phase xact not supported by database or two-phase xact not supported by drivers/SQLA or FIXME: JDBC driver confuses the transaction state, may need separate XA implementation or recent MySQL communiity editions have too many issues (late 2016), disabling for now SKIP [2] /tmp/B.VpBclu/BUILD/SQLAlchemy-1.2.13/test/../lib/sqlalchemy/testing/config.py:101: 'test_rollback_to_subtransaction' : savepoints not supported SKIP [1] /tmp/B.VpBclu/BUILD/SQLAlchemy-1.2.13/test/../lib/sqlalchemy/testing/config.py:101: 'test_external_nested_transaction' : savepoints not supported SKIP [9] /tmp/B.VpBclu/BUILD/SQLAlchemy-1.2.13/test/../lib/sqlalchemy/testing/config.py:101: 'InsertTest' unsupported on any DB implementation 'sqlite(3.25.3)+pysqlite' SKIP [16] /tmp/B.VpBclu/BUILD/SQLAlchemy-1.2.13/test/../lib/sqlalchemy/testing/config.py:101: 'EnumSetTest' unsupported on any DB implementation 'sqlite(3.25.3)+pysqlite' SKIP [1] /tmp/B.VpBclu/BUILD/SQLAlchemy-1.2.13/test/../lib/sqlalchemy/testing/config.py:101: 'test_nested_transaction_connection_add' : savepoints not supported SKIP [1] /tmp/B.VpBclu/BUILD/SQLAlchemy-1.2.13/test/../lib/sqlalchemy/testing/config.py:101: 'test_transaction' : independent connections disabled when :memory: connections are used or SQL Server 2005+ is required for independent connections SKIP [1] /tmp/B.VpBclu/BUILD/SQLAlchemy-1.2.13/test/../lib/sqlalchemy/testing/config.py:101: 'test_update_from_multitable' : Multi table update SKIP [1] /tmp/B.VpBclu/BUILD/SQLAlchemy-1.2.13/test/../lib/sqlalchemy/testing/config.py:101: 'test_lastrow_accessor_one' : sqlite SKIP [1] /tmp/B.VpBclu/BUILD/SQLAlchemy-1.2.13/test/../lib/sqlalchemy/testing/config.py:101: 'test_server_default_no_implicit_returning' : sqlite doesn't support 'returning' SKIP [1] /tmp/B.VpBclu/BUILD/SQLAlchemy-1.2.13/test/../lib/sqlalchemy/testing/config.py:101: 'QueryUnicodeTest' unsupported on any DB implementation 'sqlite(3.25.3)+pysqlite' SKIP [1] /tmp/B.VpBclu/BUILD/SQLAlchemy-1.2.13/test/../lib/sqlalchemy/testing/config.py:101: 'test_mixed_transaction_close' : savepoints not supported SKIP [1] /tmp/B.VpBclu/BUILD/SQLAlchemy-1.2.13/test/../lib/sqlalchemy/testing/config.py:101: 'TupleTest' unsupported on any DB implementation 'sqlite(3.25.3)+pysqlite' SKIP [1] /tmp/B.VpBclu/BUILD/SQLAlchemy-1.2.13/test/../lib/sqlalchemy/testing/config.py:101: 'test_reset_via_agent_begin_twophase_rollback' : no SA implementation or two-phase xact not supported by drivers or two-phase xact not implemented in SQLA/oracle or two-phase xact not supported by database or two-phase xact not supported by database or two-phase xact not supported by drivers/SQLA or FIXME: JDBC driver confuses the transaction state, may need separate XA implementation or recent MySQL communiity editions have too many issues (late 2016), disabling for now SKIP [1] /tmp/B.VpBclu/BUILD/SQLAlchemy-1.2.13/test/../lib/sqlalchemy/testing/config.py:101: 'test_exec_multitable' : Multi table update SKIP [1] /tmp/B.VpBclu/BUILD/SQLAlchemy-1.2.13/test/../lib/sqlalchemy/testing/config.py:101: 'test_exec_alias_plus_table' : Backend does not support DELETE..FROM and Backend does not support DELETE..FROM and Backend does not support DELETE..FROM and Backend does not support DELETE..FROM SKIP [3] /tmp/B.VpBclu/BUILD/SQLAlchemy-1.2.13/test/../lib/sqlalchemy/testing/config.py:101: 'IdentityInsertTest' unsupported on any DB implementation 'sqlite(3.25.3)+pysqlite' SKIP [14] /tmp/B.VpBclu/BUILD/SQLAlchemy-1.2.13/test/../lib/sqlalchemy/testing/config.py:101: 'JSONTest' unsupported on any DB implementation 'sqlite(3.25.3)+pysqlite'custom function and not postgresql >= (9, 3) SKIP [1] /tmp/B.VpBclu/BUILD/SQLAlchemy-1.2.13/test/../lib/sqlalchemy/testing/config.py:101: 'test_fk_options' : not postgresql and not mysql SKIP [4] /tmp/B.VpBclu/BUILD/SQLAlchemy-1.2.13/test/../lib/sqlalchemy/testing/config.py:101: 'RemoveUTCTimestampTest' unsupported on any DB implementation 'sqlite(3.25.3)+pysqlite' SKIP [1] /tmp/B.VpBclu/BUILD/SQLAlchemy-1.2.13/test/../lib/sqlalchemy/testing/config.py:101: 'test_over' : Backend does not support window functions SKIP [1] /tmp/B.VpBclu/BUILD/SQLAlchemy-1.2.13/test/../lib/sqlalchemy/testing/config.py:101: 'test_begin_begin_nested_rollback_commit' : savepoints not supported SKIP [2] /tmp/B.VpBclu/BUILD/SQLAlchemy-1.2.13/test/../lib/sqlalchemy/testing/config.py:101: 'ServiceNameTest' unsupported on any DB implementation 'sqlite(3.25.3)+pysqlite' SKIP [1] /tmp/B.VpBclu/BUILD/SQLAlchemy-1.2.13/test/../lib/sqlalchemy/testing/config.py:101: 'UnsupportedIndexReflectTest' unsupported on any DB implementation 'sqlite(3.25.3)+pysqlite' SKIP [2] /tmp/B.VpBclu/BUILD/SQLAlchemy-1.2.13/test/../lib/sqlalchemy/testing/config.py:101: 'test_nested_subtransaction_commit' : savepoints not supported SKIP [2] /tmp/B.VpBclu/BUILD/SQLAlchemy-1.2.13/test/../lib/sqlalchemy/testing/config.py:101: 'UnicodeSchemaTest' unsupported on any DB implementation 'sqlite(3.25.3)+pysqlite' SKIP [7] /tmp/B.VpBclu/BUILD/SQLAlchemy-1.2.13/test/../lib/sqlalchemy/testing/config.py:101: 'IndexPropertyJsonTest' unsupported on any DB implementation 'sqlite(3.25.3)+pysqlite' SKIP [1] /tmp/B.VpBclu/BUILD/SQLAlchemy-1.2.13/test/../lib/sqlalchemy/testing/config.py:101: 'test_savepoint_commit_collections' : savepoints not supported SKIP [7] /tmp/B.VpBclu/BUILD/SQLAlchemy-1.2.13/test/../lib/sqlalchemy/testing/config.py:101: 'DateTimeRangeRoundTripTest' unsupported on any DB implementation 'sqlite(3.25.3)+pysqlite'custom function SKIP [11] /tmp/B.VpBclu/BUILD/SQLAlchemy-1.2.13/test/../lib/sqlalchemy/testing/config.py:101: 'SequenceExecTest' unsupported on any DB implementation 'sqlite(3.25.3)+pysqlite'no sequence support SKIP [16] /tmp/B.VpBclu/BUILD/SQLAlchemy-1.2.13/test/../lib/sqlalchemy/testing/config.py:101: 'NaturalPKTest' unsupported on any DB implementation 'sqlite(3.25.3)+pysqlite'custom function SKIP [8] /tmp/B.VpBclu/BUILD/SQLAlchemy-1.2.13/test/../lib/sqlalchemy/testing/config.py:101: 'MatchTest' skipped by full_text_search_missing SKIP [6] /tmp/B.VpBclu/BUILD/SQLAlchemy-1.2.13/test/../lib/sqlalchemy/testing/config.py:101: 'HasSequenceTest' unsupported on any DB implementation 'sqlite(3.25.3)+pysqlite'no sequence support SKIP [1] /tmp/B.VpBclu/BUILD/SQLAlchemy-1.2.13/test/../lib/sqlalchemy/testing/config.py:101: 'test_rollback_ignores_clean_on_savepoint_agg_upd_fetch' : savepoints not supported SKIP [2] /tmp/B.VpBclu/BUILD/SQLAlchemy-1.2.13/test/../lib/sqlalchemy/testing/config.py:101: 'EuroNumericTest' unsupported on any DB implementation 'sqlite(3.25.3)+pysqlite' SKIP [2] /tmp/B.VpBclu/BUILD/SQLAlchemy-1.2.13/test/../lib/sqlalchemy/testing/config.py:101: 'test_transactional_advanced' : savepoints not supported SKIP [1] /tmp/B.VpBclu/BUILD/SQLAlchemy-1.2.13/test/../lib/sqlalchemy/testing/config.py:101: 'test_sequence_execute' : no sequence support SKIP [1] /tmp/B.VpBclu/BUILD/SQLAlchemy-1.2.13/test/../lib/sqlalchemy/testing/config.py:101: 'test_reverse_eng_name' : foo SKIP [1] /tmp/B.VpBclu/BUILD/SQLAlchemy-1.2.13/test/../lib/sqlalchemy/testing/config.py:101: 'test_get_comments_with_schema' : not postgresql and not mysql and not oracle SKIP [1] /tmp/B.VpBclu/BUILD/SQLAlchemy-1.2.13/test/../lib/sqlalchemy/testing/config.py:101: 'test_delete_from_joined_subq_test' : Backend does not support DELETE..FROM and Backend does not support DELETE..FROM and Backend does not support DELETE..FROM and Backend does not support DELETE..FROM SKIP [1] /tmp/B.VpBclu/BUILD/SQLAlchemy-1.2.13/test/../lib/sqlalchemy/testing/config.py:101: 'test_savepoint_release_fails_warning' : savepoints not supported SKIP [2] /tmp/B.VpBclu/BUILD/SQLAlchemy-1.2.13/test/../lib/sqlalchemy/testing/config.py:101: 'test_nested_subtransaction_rollback' : savepoints not supported SKIP [1] /tmp/B.VpBclu/BUILD/SQLAlchemy-1.2.13/test/../lib/sqlalchemy/testing/config.py:101: 'test_lastrow_accessor_four' : no sequence support SKIP [18] /tmp/B.VpBclu/BUILD/SQLAlchemy-1.2.13/test/../lib/sqlalchemy/testing/config.py:101: 'OnConflictTest' unsupported on any DB implementation 'sqlite(3.25.3)+pysqlite' SKIP [7] /tmp/B.VpBclu/BUILD/SQLAlchemy-1.2.13/test/../lib/sqlalchemy/testing/config.py:101: 'ExplicitAutoCommitTest' unsupported on any DB implementation 'sqlite(3.25.3)+pysqlite' SKIP [4] /tmp/B.VpBclu/BUILD/SQLAlchemy-1.2.13/test/../lib/sqlalchemy/testing/config.py:101: 'HashableFlagORMTest' unsupported on any DB implementation 'sqlite(3.25.3)+pysqlite' SKIP [1] /tmp/B.VpBclu/BUILD/SQLAlchemy-1.2.13/test/../lib/sqlalchemy/testing/config.py:101: 'SequenceCompilerTest' unsupported on any DB implementation 'sqlite(3.25.3)+pysqlite'no sequence support SKIP [2] /tmp/B.VpBclu/BUILD/SQLAlchemy-1.2.13/test/../lib/sqlalchemy/testing/config.py:101: 'IntervalReflectionTest' unsupported on any DB implementation 'sqlite(3.25.3)+pysqlite' SKIP [1] /tmp/B.VpBclu/BUILD/SQLAlchemy-1.2.13/test/../lib/sqlalchemy/testing/config.py:101: 'test_update_deleted_on_rollback' : savepoints not supported SKIP [4] /tmp/B.VpBclu/BUILD/SQLAlchemy-1.2.13/test/../lib/sqlalchemy/testing/config.py:101: 'ExtraPassiveDeletesTest' unsupported on any DB implementation 'sqlite(3.25.3)+pysqlite'not supported by database SKIP [2] /tmp/B.VpBclu/BUILD/SQLAlchemy-1.2.13/test/../lib/sqlalchemy/testing/config.py:101: 'ZooMarkTest' unsupported on any DB implementation 'sqlite(3.25.3)+pysqlite' SKIP [1] /tmp/B.VpBclu/BUILD/SQLAlchemy-1.2.13/test/../lib/sqlalchemy/testing/config.py:101: 'test_raise_from_cause_same_cause' : Python version 3.xx is required. SKIP [1] /tmp/B.VpBclu/BUILD/SQLAlchemy-1.2.13/test/../lib/sqlalchemy/testing/config.py:101: 'test_reflection' : DB specific feature SKIP [1] /tmp/B.VpBclu/BUILD/SQLAlchemy-1.2.13/test/../lib/sqlalchemy/testing/config.py:101: 'DontReflectIOTTest' unsupported on any DB implementation 'sqlite(3.25.3)+pysqlite' SKIP [1] /tmp/B.VpBclu/BUILD/SQLAlchemy-1.2.13/test/../lib/sqlalchemy/testing/config.py:101: 'test_versioncheck_for_update' : no FOR UPDATE NOWAIT support SKIP [3] /tmp/B.VpBclu/BUILD/SQLAlchemy-1.2.13/test/../lib/sqlalchemy/testing/config.py:101: 'BatchInsertsTest' unsupported on any DB implementation 'sqlite(3.25.3)+pysqlite' SKIP [1] /tmp/B.VpBclu/BUILD/SQLAlchemy-1.2.13/test/../lib/sqlalchemy/testing/config.py:101: 'test_no_defaults_second_table' : Multi table update SKIP [1] /tmp/B.VpBclu/BUILD/SQLAlchemy-1.2.13/test/../lib/sqlalchemy/testing/config.py:101: 'test_sql_expr_w_mods_bump' : sqlite doesn't support 'returning' SKIP [1] /tmp/B.VpBclu/BUILD/SQLAlchemy-1.2.13/test/../lib/sqlalchemy/testing/config.py:101: 'test_invalidate' : independent connections disabled when :memory: connections are used or SQL Server 2005+ is required for independent connections SKIP [1] /tmp/B.VpBclu/BUILD/SQLAlchemy-1.2.13/test/../lib/sqlalchemy/testing/config.py:101: 'test_autoflush_unbound' : independent connections disabled when :memory: connections are used or SQL Server 2005+ is required for independent connections SKIP [9] /tmp/B.VpBclu/BUILD/SQLAlchemy-1.2.13/test/../lib/sqlalchemy/testing/config.py:101: 'DialectTest' unsupported on any DB implementation 'sqlite(3.25.3)+pysqlite' SKIP [1] /tmp/B.VpBclu/BUILD/SQLAlchemy-1.2.13/test/../lib/sqlalchemy/testing/config.py:101: 'test_pk_violation_with_savepoint' : savepoints not supported SKIP [3] /tmp/B.VpBclu/BUILD/SQLAlchemy-1.2.13/test/../lib/sqlalchemy/testing/config.py:101: 'SystemTableTablenamesTest' unsupported on any DB implementation 'sqlite(3.25.3)+pysqlite' SKIP [2] /tmp/B.VpBclu/BUILD/SQLAlchemy-1.2.13/test/../lib/sqlalchemy/testing/config.py:101: '_test_get_table_oid' : PG specific feature SKIP [1] /tmp/B.VpBclu/BUILD/SQLAlchemy-1.2.13/test/../lib/sqlalchemy/testing/config.py:101: 'test_begin_nested_close' : savepoints not supported SKIP [1] /tmp/B.VpBclu/BUILD/SQLAlchemy-1.2.13/test/../lib/sqlalchemy/testing/config.py:101: 'test_direct_params_returning' : sqlite doesn't support 'returning' SKIP [8] /tmp/B.VpBclu/BUILD/SQLAlchemy-1.2.13/test/../lib/sqlalchemy/testing/config.py:101: 'MaterializedViewReflectionTest' unsupported on any DB implementation 'sqlite(3.25.3)+pysqlite' SKIP [2] /tmp/B.VpBclu/BUILD/SQLAlchemy-1.2.13/test/../lib/sqlalchemy/testing/config.py:101: 'JSONTest' unsupported on any DB implementation 'sqlite(3.25.3)+pysqlite' SKIP [2] /tmp/B.VpBclu/BUILD/SQLAlchemy-1.2.13/test/../lib/sqlalchemy/testing/config.py:101: '_test_alter_invalidate_pool_to_false' : independent connections disabled when :memory: connections are used or SQL Server 2005+ is required for independent connections SKIP [3] /tmp/B.VpBclu/BUILD/SQLAlchemy-1.2.13/test/../lib/sqlalchemy/testing/config.py:101: 'TimestampTest' unsupported on any DB implementation 'sqlite(3.25.3)+pysqlite' SKIP [1] /tmp/B.VpBclu/BUILD/SQLAlchemy-1.2.13/test/../lib/sqlalchemy/testing/config.py:101: 'test_savepoint_lost_still_runs' : savepoints not supported SKIP [1] /tmp/B.VpBclu/BUILD/SQLAlchemy-1.2.13/test/../lib/sqlalchemy/testing/config.py:101: 'test_get_comments' : not postgresql and not mysql and not oracle SKIP [2] /tmp/B.VpBclu/BUILD/SQLAlchemy-1.2.13/test/../lib/sqlalchemy/testing/config.py:101: 'test_two_phase_transaction' : no SA implementation or two-phase xact not supported by drivers or two-phase xact not implemented in SQLA/oracle or two-phase xact not supported by database or two-phase xact not supported by database or two-phase xact not supported by drivers/SQLA or FIXME: JDBC driver confuses the transaction state, may need separate XA implementation or recent MySQL communiity editions have too many issues (late 2016), disabling for now SKIP [1] /tmp/B.VpBclu/BUILD/SQLAlchemy-1.2.13/test/../lib/sqlalchemy/testing/config.py:101: 'test_update_from_joined_subq_test' : Backend does not support UPDATE..FROM and Backend does not support UPDATE..FROM and Backend does not support UPDATE..FROM SKIP [10] /tmp/B.VpBclu/BUILD/SQLAlchemy-1.2.13/test/../lib/sqlalchemy/testing/config.py:101: 'ReturnDefaultsTest' unsupported on any DB implementation 'sqlite(3.25.3)+pysqlite'sqlite doesn't support 'returning' SKIP [6] /tmp/B.VpBclu/BUILD/SQLAlchemy-1.2.13/test/../lib/sqlalchemy/testing/config.py:101: 'CTETest' unsupported on any DB implementation 'sqlite(3.25.3)+pysqlite'custom function and not postgresql and not mssql and not oracle SKIP [1] /tmp/B.VpBclu/BUILD/SQLAlchemy-1.2.13/test/../lib/sqlalchemy/testing/config.py:101: 'go' : sqlite doesn't support 'returning' SKIP [9] /tmp/B.VpBclu/BUILD/SQLAlchemy-1.2.13/test/../lib/sqlalchemy/testing/config.py:101: 'MultiSchemaTest' unsupported on any DB implementation 'sqlite(3.25.3)+pysqlite' SKIP [1] /tmp/B.VpBclu/BUILD/SQLAlchemy-1.2.13/test/../lib/sqlalchemy/testing/config.py:101: 'test_rollback_on_invalid_savepoint' : savepoints not supported SKIP [2] /tmp/B.VpBclu/BUILD/SQLAlchemy-1.2.13/test/../lib/sqlalchemy/testing/config.py:101: 'AutocommitTest' unsupported on any DB implementation 'sqlite(3.25.3)+pysqlite'dialect does not support AUTOCOMMIT isolation mode and dialect does not support AUTOCOMMIT isolation mode and dialect does not support AUTOCOMMIT isolation mode and dialect does not support AUTOCOMMIT isolation mode SKIP [8] /tmp/B.VpBclu/BUILD/SQLAlchemy-1.2.13/test/../lib/sqlalchemy/testing/config.py:101: 'DomainReflectionTest' unsupported on any DB implementation 'sqlite(3.25.3)+pysqlite' SKIP [1] /tmp/B.VpBclu/BUILD/SQLAlchemy-1.2.13/test/../lib/sqlalchemy/testing/config.py:101: 'test_two_entities_with_joins' : sqlite flat out blows it on the multiple JOINs SKIP [1] /tmp/B.VpBclu/BUILD/SQLAlchemy-1.2.13/test/../lib/sqlalchemy/testing/config.py:101: 'test_exec_two_table' : Backend does not support DELETE..FROM and Backend does not support DELETE..FROM and Backend does not support DELETE..FROM and Backend does not support DELETE..FROM SKIP [1] /tmp/B.VpBclu/BUILD/SQLAlchemy-1.2.13/test/../lib/sqlalchemy/testing/config.py:101: 'test_with_implicit_returning' : sqlite doesn't support 'returning' SKIP [7] /tmp/B.VpBclu/BUILD/SQLAlchemy-1.2.13/test/../lib/sqlalchemy/testing/config.py:101: 'DateTimeTZRangeRoundTripTest' unsupported on any DB implementation 'sqlite(3.25.3)+pysqlite'custom function SKIP [2] /tmp/B.VpBclu/BUILD/SQLAlchemy-1.2.13/test/../lib/sqlalchemy/testing/config.py:101: 'ExecutionTest' unsupported on any DB implementation 'sqlite(3.25.3)+pysqlite' SKIP [1] /tmp/B.VpBclu/BUILD/SQLAlchemy-1.2.13/test/../lib/sqlalchemy/testing/config.py:101: 'test_contextmanager_nested_rollback' : savepoints not supported SKIP [1] /tmp/B.VpBclu/BUILD/SQLAlchemy-1.2.13/test/../lib/sqlalchemy/testing/config.py:101: 'test_branch_savepoint_rollback' : savepoints not supported SKIP [1] /tmp/B.VpBclu/BUILD/SQLAlchemy-1.2.13/test/../lib/sqlalchemy/testing/config.py:101: 'test_rollback_on_prepare' : no SA implementation or two-phase xact not supported by drivers or two-phase xact not implemented in SQLA/oracle or two-phase xact not supported by database or two-phase xact not supported by database or two-phase xact not supported by drivers/SQLA or FIXME: JDBC driver confuses the transaction state, may need separate XA implementation or recent MySQL communiity editions have too many issues (late 2016), disabling for now SKIP [12] /tmp/B.VpBclu/BUILD/SQLAlchemy-1.2.13/test/../lib/sqlalchemy/testing/config.py:101: 'MiscBackendTest' unsupported on any DB implementation 'sqlite(3.25.3)+pysqlite' SKIP [1] /tmp/B.VpBclu/BUILD/SQLAlchemy-1.2.13/test/../lib/sqlalchemy/testing/config.py:101: 'test_exec_three_table' : Backend does not support DELETE..FROM and Backend does not support DELETE..FROM and Backend does not support DELETE..FROM and Backend does not support DELETE..FROM SKIP [1] /tmp/B.VpBclu/BUILD/SQLAlchemy-1.2.13/test/../lib/sqlalchemy/testing/config.py:101: 'test_exec_two_table' : Backend does not support UPDATE..FROM and Backend does not support UPDATE..FROM and Backend does not support UPDATE..FROM SKIP [15] /tmp/B.VpBclu/BUILD/SQLAlchemy-1.2.13/test/../lib/sqlalchemy/testing/config.py:101: 'ExtractTest' unsupported on any DB implementation 'sqlite(3.25.3)+pysqlite' SKIP [1] /tmp/B.VpBclu/BUILD/SQLAlchemy-1.2.13/test/../lib/sqlalchemy/testing/config.py:101: 'test_begin_begin_nested_rollback_rollback' : savepoints not supported SKIP [1] /tmp/B.VpBclu/BUILD/SQLAlchemy-1.2.13/test/../lib/sqlalchemy/testing/config.py:101: 'test_defaults_second_table_same_name' : Multi table update SKIP [1] /tmp/B.VpBclu/BUILD/SQLAlchemy-1.2.13/test/../lib/sqlalchemy/testing/config.py:101: 'test_savepoint_rollback' : savepoints not supported SKIP [1] /tmp/B.VpBclu/BUILD/SQLAlchemy-1.2.13/test/../lib/sqlalchemy/testing/config.py:101: 'test_dirty_state_transferred_deep_nesting' : savepoints not supported SKIP [1] /tmp/B.VpBclu/BUILD/SQLAlchemy-1.2.13/test/../lib/sqlalchemy/testing/config.py:101: 'test_exec_three_table' : Backend does not support UPDATE..FROM and Backend does not support UPDATE..FROM and Backend does not support UPDATE..FROM SKIP [1] /tmp/B.VpBclu/BUILD/SQLAlchemy-1.2.13/test/../lib/sqlalchemy/testing/config.py:101: 'test_expunge_pending_on_rollback' : savepoints not supported SKIP [1] /tmp/B.VpBclu/BUILD/SQLAlchemy-1.2.13/test/../lib/sqlalchemy/testing/config.py:101: 'test_savepoint_delete' : savepoints not supported SKIP [1] /tmp/B.VpBclu/BUILD/SQLAlchemy-1.2.13/test/../lib/sqlalchemy/testing/config.py:101: 'test_lastrow_accessor_six' : sqlite SKIP [54] /tmp/B.VpBclu/BUILD/SQLAlchemy-1.2.13/test/../lib/sqlalchemy/testing/config.py:101: 'ReflectionTest' unsupported on any DB implementation 'sqlite(3.25.3)+pysqlite' SKIP [22] /tmp/B.VpBclu/BUILD/SQLAlchemy-1.2.13/test/../lib/sqlalchemy/testing/config.py:101: 'JSONRoundTripTest' unsupported on any DB implementation 'sqlite(3.25.3)+pysqlite' SKIP [19] /tmp/B.VpBclu/BUILD/SQLAlchemy-1.2.13/test/../lib/sqlalchemy/testing/config.py:101: 'EnumTest' unsupported on any DB implementation 'sqlite(3.25.3)+pysqlite' SKIP [1] /tmp/B.VpBclu/BUILD/SQLAlchemy-1.2.13/test/../lib/sqlalchemy/testing/config.py:101: 'test_versioncheck_for_update_legacy' : no FOR UPDATE NOWAIT support SKIP [1] /tmp/B.VpBclu/BUILD/SQLAlchemy-1.2.13/test/../lib/sqlalchemy/testing/config.py:101: 'test_autoclose_on_insert_implicit_returning' : sqlite doesn't support 'returning' SKIP [1] /tmp/B.VpBclu/BUILD/SQLAlchemy-1.2.13/test/../lib/sqlalchemy/testing/config.py:101: 'test_update_from' : Backend does not support UPDATE..FROM and Backend does not support UPDATE..FROM and Backend does not support UPDATE..FROM SKIP [21] /tmp/B.VpBclu/BUILD/SQLAlchemy-1.2.13/test/../lib/sqlalchemy/testing/config.py:101: 'AutocommitTextTest' unsupported on any DB implementation 'sqlite(3.25.3)+pysqlite' SKIP [2] /tmp/B.VpBclu/BUILD/SQLAlchemy-1.2.13/test/../lib/sqlalchemy/testing/config.py:101: 'NonPKCascadeTest' unsupported on any DB implementation 'sqlite(3.25.3)+pysqlite'custom function SKIP [1] /tmp/B.VpBclu/BUILD/SQLAlchemy-1.2.13/test/../lib/sqlalchemy/testing/config.py:101: 'test_defaults_second_table' : Multi table update SKIP [2] /tmp/B.VpBclu/BUILD/SQLAlchemy-1.2.13/test/../lib/sqlalchemy/testing/config.py:101: 'TableBoundSequenceTest' unsupported on any DB implementation 'sqlite(3.25.3)+pysqlite'no sequence support SKIP [3] /tmp/B.VpBclu/BUILD/SQLAlchemy-1.2.13/test/../lib/sqlalchemy/testing/config.py:101: 'MSDateTypeTest' unsupported on any DB implementation 'sqlite(3.25.3)+pysqlite' SKIP [16] /tmp/B.VpBclu/BUILD/SQLAlchemy-1.2.13/test/../lib/sqlalchemy/testing/config.py:101: 'MatchTest' unsupported on any DB implementation 'sqlite(3.25.3)+pysqlite' SKIP [33] /tmp/B.VpBclu/BUILD/SQLAlchemy-1.2.13/test/../lib/sqlalchemy/testing/config.py:101: No profiling stats available on this platform for this function. Run tests with --write-profiles to add statistics to profiles.txt for this platform. SKIP [9] /tmp/B.VpBclu/BUILD/SQLAlchemy-1.2.13/test/../lib/sqlalchemy/testing/config.py:101: 'RowVersionTest' unsupported on any DB implementation 'sqlite(3.25.3)+pysqlite' SKIP [1] /tmp/B.VpBclu/BUILD/SQLAlchemy-1.2.13/test/../lib/sqlalchemy/testing/config.py:101: 'test_blank_schema_arg' : not postgresql and not mysql and not mssql SKIP [1] /tmp/B.VpBclu/BUILD/SQLAlchemy-1.2.13/test/../lib/sqlalchemy/testing/config.py:101: 'test_connectionless_autoclose_crud_rows_exhausted' : sqlite doesn't support 'returning' SKIP [4] /tmp/B.VpBclu/BUILD/SQLAlchemy-1.2.13/test/../lib/sqlalchemy/testing/config.py:101: 'SelfReferentialTest' unsupported on any DB implementation 'sqlite(3.25.3)+pysqlite'custom function SKIP [1] /tmp/B.VpBclu/BUILD/SQLAlchemy-1.2.13/test/../lib/sqlalchemy/testing/config.py:101: 'test_mixed_two_phase_transaction' : savepoints not supported SKIP [1] /tmp/B.VpBclu/BUILD/SQLAlchemy-1.2.13/test/../lib/sqlalchemy/testing/config.py:101: 'test_savepoint_commit' : savepoints not supported SKIP [2] /tmp/B.VpBclu/BUILD/SQLAlchemy-1.2.13/test/../lib/sqlalchemy/testing/config.py:101: 'NumericInterpretationTest' unsupported on any DB implementation 'sqlite(3.25.3)+pysqlite' SKIP [1] /tmp/B.VpBclu/BUILD/SQLAlchemy-1.2.13/test/../lib/sqlalchemy/testing/config.py:101: 'SequenceReturningTest' unsupported on any DB implementation 'sqlite(3.25.3)+pysqlite'sqlite doesn't support 'returning' SKIP [1] /tmp/B.VpBclu/BUILD/SQLAlchemy-1.2.13/test/../lib/sqlalchemy/testing/config.py:101: 'test_multiple_two_phase' : no SA implementation or two-phase xact not supported by drivers or two-phase xact not implemented in SQLA/oracle or two-phase xact not supported by database or two-phase xact not supported by database or two-phase xact not supported by drivers/SQLA or FIXME: JDBC driver confuses the transaction state, may need separate XA implementation or recent MySQL communiity editions have too many issues (late 2016), disabling for now SKIP [1] /tmp/B.VpBclu/BUILD/SQLAlchemy-1.2.13/test/../lib/sqlalchemy/testing/config.py:101: 'RoundTripIndexTest' unsupported on any DB implementation 'sqlite(3.25.3)+pysqlite' SKIP [3] /tmp/B.VpBclu/BUILD/SQLAlchemy-1.2.13/test/../lib/sqlalchemy/testing/config.py:101: 'IndexPropertyArrayTest' unsupported on any DB implementation 'sqlite(3.25.3)+pysqlite'custom function SKIP [1] /tmp/B.VpBclu/BUILD/SQLAlchemy-1.2.13/test/../lib/sqlalchemy/testing/config.py:101: 'test_onetomany_passive' : target backend doesn't support ON UPDATE CASCADE SKIP [1] /tmp/B.VpBclu/BUILD/SQLAlchemy-1.2.13/test/../lib/sqlalchemy/testing/config.py:101: 'test_rollback_ignores_clean_on_savepoint' : savepoints not supported SKIP [1] /tmp/B.VpBclu/BUILD/SQLAlchemy-1.2.13/test/../lib/sqlalchemy/testing/config.py:101: 'test_reflect_all_schemas_default_overlap' : not postgresql and not mysql and not mssql SKIP [1] /tmp/B.VpBclu/BUILD/SQLAlchemy-1.2.13/test/../lib/sqlalchemy/testing/config.py:101: 'test_exec_join_multitable' : Multi table update SKIP [1] /tmp/B.VpBclu/BUILD/SQLAlchemy-1.2.13/test/../lib/sqlalchemy/testing/config.py:101: 'test_no_implicit_returning' : sqlite doesn't support 'returning' SKIP [4] /tmp/B.VpBclu/BUILD/SQLAlchemy-1.2.13/test/../lib/sqlalchemy/testing/config.py:101: 'MiscTest' unsupported on any DB implementation 'sqlite(3.25.3)+pysqlite' SKIP [1] /tmp/B.VpBclu/BUILD/SQLAlchemy-1.2.13/test/../lib/sqlalchemy/testing/config.py:101: 'test_key_replaced_by_update_nested' : savepoints not supported SKIP [1] /tmp/B.VpBclu/BUILD/SQLAlchemy-1.2.13/test/../lib/sqlalchemy/testing/config.py:101: 'test_fk_passive' : target backend doesn't support ON UPDATE CASCADE SKIP [20] /tmp/B.VpBclu/BUILD/SQLAlchemy-1.2.13/test/../lib/sqlalchemy/testing/config.py:101: 'CoreArrayRoundTripTest' unsupported on any DB implementation 'sqlite(3.25.3)+pysqlite' SKIP [2] /tmp/B.VpBclu/BUILD/SQLAlchemy-1.2.13/test/../lib/sqlalchemy/testing/config.py:101: 'NormalizedNameTest' unsupported on any DB implementation 'sqlite(3.25.3)+pysqlite'Backend does not require denormalized names. SKIP [5] /tmp/B.VpBclu/BUILD/SQLAlchemy-1.2.13/test/../lib/sqlalchemy/testing/config.py:101: 'CTEDefaultTest' unsupported on any DB implementation 'sqlite(3.25.3)+pysqlite'custom function and not postgresql and not mssql and not oracle SKIP [1] /tmp/B.VpBclu/BUILD/SQLAlchemy-1.2.13/test/../lib/sqlalchemy/testing/config.py:101: 'test_heavy_nesting' : savepoints not supported SKIP [7] /tmp/B.VpBclu/BUILD/SQLAlchemy-1.2.13/test/../lib/sqlalchemy/testing/config.py:101: 'PassiveDeletesTest' unsupported on any DB implementation 'sqlite(3.25.3)+pysqlite'not supported by database SKIP [5] /tmp/B.VpBclu/BUILD/SQLAlchemy-1.2.13/test/../lib/sqlalchemy/testing/config.py:101: 'Py3KFunctionInstTest' unsupported on any DB implementation 'sqlite(3.25.3)+pysqlite'Python version 3.xx is required. SKIP [3] /tmp/B.VpBclu/BUILD/SQLAlchemy-1.2.13/test/../lib/sqlalchemy/testing/config.py:101: 'QuotedBindRoundTripTest' unsupported on any DB implementation 'sqlite(3.25.3)+pysqlite' SKIP [1] /tmp/B.VpBclu/BUILD/SQLAlchemy-1.2.13/test/../lib/sqlalchemy/testing/config.py:101: 'test_nested_transaction' : savepoints not supported SKIP [1] /tmp/B.VpBclu/BUILD/SQLAlchemy-1.2.13/test/../lib/sqlalchemy/testing/config.py:101: 'setup' : Backend does not require denormalized names. SKIP [29] /tmp/B.VpBclu/BUILD/SQLAlchemy-1.2.13/test/../lib/sqlalchemy/testing/config.py:101: 'PGArrayRoundTripTest' unsupported on any DB implementation 'sqlite(3.25.3)+pysqlite' SKIP [3] /tmp/B.VpBclu/BUILD/SQLAlchemy-1.2.13/test/../lib/sqlalchemy/testing/config.py:101: 'BuggyDomainReflectionTest' unsupported on any DB implementation 'sqlite(3.25.3)+pysqlite' SKIP [1] /tmp/B.VpBclu/BUILD/SQLAlchemy-1.2.13/test/../lib/sqlalchemy/testing/config.py:101: 'test_reverse_savepoint' : savepoints not supported SKIP [1] /tmp/B.VpBclu/BUILD/SQLAlchemy-1.2.13/test/../lib/sqlalchemy/testing/config.py:101: 'test_savepoint_rollback_collections' : savepoints not supported SKIP [1] /tmp/B.VpBclu/BUILD/SQLAlchemy-1.2.13/test/../lib/sqlalchemy/testing/config.py:101: 'test_exec_two_table_plus_alias' : Backend does not support DELETE..FROM and Backend does not support DELETE..FROM and Backend does not support DELETE..FROM and Backend does not support DELETE..FROM SKIP [1] /tmp/B.VpBclu/BUILD/SQLAlchemy-1.2.13/test/../lib/sqlalchemy/testing/config.py:101: 'OutParamTest' unsupported on any DB implementation 'sqlite(3.25.3)+pysqlite' SKIP [1] /tmp/B.VpBclu/BUILD/SQLAlchemy-1.2.13/test/../lib/sqlalchemy/testing/config.py:101: 'test_report_primary_error_when_rollback_fails' : savepoints not supported SKIP [1] /tmp/B.VpBclu/BUILD/SQLAlchemy-1.2.13/test/../lib/sqlalchemy/testing/config.py:101: 'test_rollback_ignores_clean_on_savepoint_agg_upd_eval' : savepoints not supported SKIP [3] /tmp/B.VpBclu/BUILD/SQLAlchemy-1.2.13/test/../lib/sqlalchemy/testing/config.py:101: 'OnDuplicateTest' unsupported on any DB implementation 'sqlite(3.25.3)+pysqlite' SKIP [1] /tmp/B.VpBclu/BUILD/SQLAlchemy-1.2.13/test/../lib/sqlalchemy/testing/config.py:101: 'test_bound_in_two_tuple' : not mysql and not postgresql SKIP [1] /tmp/B.VpBclu/BUILD/SQLAlchemy-1.2.13/test/../lib/sqlalchemy/testing/config.py:101: 'test_exec_multitable_same_name' : Multi table update SKIP [1] /tmp/B.VpBclu/BUILD/SQLAlchemy-1.2.13/test/../lib/sqlalchemy/testing/config.py:101: 'test_no_inserted_pk_on_returning' : sqlite doesn't support 'returning' SKIP [1] /tmp/B.VpBclu/BUILD/SQLAlchemy-1.2.13/test/../lib/sqlalchemy/testing/config.py:101: 'test_reset_rollback_two_phase_no_rollback' : no SA implementation or two-phase xact not supported by drivers or two-phase xact not implemented in SQLA/oracle or two-phase xact not supported by database or two-phase xact not supported by database or two-phase xact not supported by drivers/SQLA or FIXME: JDBC driver confuses the transaction state, may need separate XA implementation or recent MySQL communiity editions have too many issues (late 2016), disabling for now SKIP [14] /tmp/B.VpBclu/BUILD/SQLAlchemy-1.2.13/test/../lib/sqlalchemy/testing/config.py:101: 'ReturningTest' unsupported on any DB implementation 'sqlite(3.25.3)+pysqlite'sqlite doesn't support 'returning' SKIP [1] /tmp/B.VpBclu/BUILD/SQLAlchemy-1.2.13/test/../lib/sqlalchemy/testing/config.py:101: 'test_uppercase_direct_params_returning' : sqlite doesn't support 'returning' SKIP [1] /tmp/B.VpBclu/BUILD/SQLAlchemy-1.2.13/test/../lib/sqlalchemy/testing/config.py:101: 'test_update_from_multitable_same_names' : Multi table update SKIP [12] /tmp/B.VpBclu/BUILD/SQLAlchemy-1.2.13/test/../lib/sqlalchemy/testing/config.py:101: 'SequenceTest' unsupported on any DB implementation 'sqlite(3.25.3)+pysqlite'no sequence support SKIP [1] /tmp/B.VpBclu/BUILD/SQLAlchemy-1.2.13/test/../lib/sqlalchemy/testing/config.py:101: 'test_transactions_isolated' : independent connections disabled when :memory: connections are used or SQL Server 2005+ is required for independent connections SKIP [1] /tmp/B.VpBclu/BUILD/SQLAlchemy-1.2.13/test/../lib/sqlalchemy/testing/config.py:101: 'test_nested_autotrans' : savepoints not supported SKIP [2] /tmp/B.VpBclu/BUILD/SQLAlchemy-1.2.13/test/../lib/sqlalchemy/testing/config.py:101: 'test_pk_passive' : target backend doesn't support ON UPDATE CASCADE SKIP [9] /tmp/B.VpBclu/BUILD/SQLAlchemy-1.2.13/test/../lib/sqlalchemy/testing/config.py:101: 'QueryTest' unsupported on any DB implementation 'sqlite(3.25.3)+pysqlite' SKIP [1] /tmp/B.VpBclu/BUILD/SQLAlchemy-1.2.13/test/../lib/sqlalchemy/testing/config.py:101: 'test_mixed_transaction_control' : savepoints not supported SKIP [2] /tmp/B.VpBclu/BUILD/SQLAlchemy-1.2.13/test/../lib/sqlalchemy/testing/config.py:101: 'ConstraintTest' unsupported on any DB implementation 'sqlite(3.25.3)+pysqlite' FAIL test/base/test_tutorials.py::DocTest::()::test_core ============= 1 failed, 7894 passed, 913 skipped in 262.03 seconds ============= error: Bad exit status from /tmp/B.VpBclu/BUILD/tmp/rpm-tmp.24295 (%build) RPM build errors: Bad exit status from /tmp/B.VpBclu/BUILD/tmp/rpm-tmp.24295 (%build) ended at: Thu Nov 8 10:25:13 2018, done in 0:04:28.636818 error: No files produced. + chmod -R u+rwX /tmp/B.VpBclu/BUILD + rm -rf /tmp/B.VpBclu/tmp /tmp/B.VpBclu/BUILD + rm -rf /tmp/B.VpBclu Begin-PLD-Builder-Info Build-Time: user:244.01s sys:9.65s real:307.50s (faults io:2 non-io:427492) End-PLD-Builder-Info
[Back to list of logs] [View rpm -qa of builder]