FailedOk

th/SRPMS[OK]
th/x32[OK]
th/i686[OK]
th/x86_64[OK]

ac/SRPMS[OK]
ac/i386[OK]
ac/i586[OK]
ac/i686[OK]
ac/alpha[OK]
ac/amd64[OK]
ac/athlon[OK]
ac/ppc[OK]
ac/sparc[OK]
ac/sparc64[OK]

Advanced Search
main()
Powered by PLD Linux
(c) 2002-2018 PLD Team
$Revision: 1.37 $
Powered by Linux.
Your IP: 54.90.109.231

python-testtools c46ef104-9e40-4827-b7e2-fb07229f8672

Status:Failed
Source URL:ftp://buildlogs.pld-linux.org/th/i686/FAIL/python-testtools,c46ef104-9e40-4827-b7e2-fb07229f8672.bz2
text/plain URL:View!
full text:View!
rpm -qa of builder:View!
Date:2018/11/26 00:27:38
Runtime:0:00:09.444566

Toc:

  • error 1
  • FAIL: testtools.tests.test_run.TestRun.test_run_list_failed_import
  • error 2
  • testtools.matchers._impl.MismatchError: Expected:
  • error 3
  • SyntaxError: invalid syntax
  • error 4
  • SyntaxError: invalid syntax
  • error 5
  • error: testr failed (1)
  • error 6
  • error: Bad exit status from /tmp/B.TyGu5y/BUILD/tmp/rpm-tmp.3274 (%build)
  • error 7
  • RPM build errors:
  • error 8
  • error: No files produced.

Content:

creating build-2
creating build-2/lib
creating build-2/lib/testtools
creating build-2/lib/testtools/tests
copying testtools/tests/test_with_with.py -> build-2/lib/testtools/tests
copying testtools/tests/__init__.py -> build-2/lib/testtools/tests
copying testtools/tests/test_testcase.py -> build-2/lib/testtools/tests
copying testtools/tests/test_testsuite.py -> build-2/lib/testtools/tests
copying testtools/tests/test_content_type.py -> build-2/lib/testtools/tests
copying testtools/tests/test_assert_that.py -> build-2/lib/testtools/tests
copying testtools/tests/test_monkey.py -> build-2/lib/testtools/tests
copying testtools/tests/test_runtest.py -> build-2/lib/testtools/tests
copying testtools/tests/test_compat.py -> build-2/lib/testtools/tests
copying testtools/tests/samplecases.py -> build-2/lib/testtools/tests
copying testtools/tests/test_fixturesupport.py -> build-2/lib/testtools/tests
copying testtools/tests/test_content.py -> build-2/lib/testtools/tests
copying testtools/tests/test_run.py -> build-2/lib/testtools/tests
copying testtools/tests/test_distutilscmd.py -> build-2/lib/testtools/tests
copying testtools/tests/helpers.py -> build-2/lib/testtools/tests
copying testtools/tests/test_tags.py -> build-2/lib/testtools/tests
copying testtools/tests/test_helpers.py -> build-2/lib/testtools/tests
copying testtools/tests/test_testresult.py -> build-2/lib/testtools/tests
copying testtools/compat.py -> build-2/lib/testtools
copying testtools/__init__.py -> build-2/lib/testtools
copying testtools/content_type.py -> build-2/lib/testtools
copying testtools/tags.py -> build-2/lib/testtools
copying testtools/content.py -> build-2/lib/testtools
copying testtools/testsuite.py -> build-2/lib/testtools
copying testtools/run.py -> build-2/lib/testtools
copying testtools/assertions.py -> build-2/lib/testtools
copying testtools/helpers.py -> build-2/lib/testtools
copying testtools/_compat3x.py -> build-2/lib/testtools
copying testtools/distutilscmd.py -> build-2/lib/testtools
copying testtools/testcase.py -> build-2/lib/testtools
copying testtools/_compat2x.py -> build-2/lib/testtools
copying testtools/utils.py -> build-2/lib/testtools
copying testtools/runtest.py -> build-2/lib/testtools
copying testtools/deferredruntest.py -> build-2/lib/testtools
copying testtools/monkey.py -> build-2/lib/testtools
creating build-2/lib/testtools/matchers
copying testtools/matchers/_dict.py -> build-2/lib/testtools/matchers
copying testtools/matchers/_const.py -> build-2/lib/testtools/matchers
copying testtools/matchers/__init__.py -> build-2/lib/testtools/matchers
copying testtools/matchers/_warnings.py -> build-2/lib/testtools/matchers
copying testtools/matchers/_datastructures.py -> build-2/lib/testtools/matchers
copying testtools/matchers/_higherorder.py -> build-2/lib/testtools/matchers
copying testtools/matchers/_basic.py -> build-2/lib/testtools/matchers
copying testtools/matchers/_impl.py -> build-2/lib/testtools/matchers
copying testtools/matchers/_exception.py -> build-2/lib/testtools/matchers
copying testtools/matchers/_doctest.py -> build-2/lib/testtools/matchers
copying testtools/matchers/_filesystem.py -> build-2/lib/testtools/matchers
creating build-2/lib/testtools/twistedsupport
copying testtools/twistedsupport/__init__.py -> build-2/lib/testtools/twistedsupport
copying testtools/twistedsupport/_deferred.py -> build-2/lib/testtools/twistedsupport
copying testtools/twistedsupport/_matchers.py -> build-2/lib/testtools/twistedsupport
copying testtools/twistedsupport/_runtest.py -> build-2/lib/testtools/twistedsupport
copying testtools/twistedsupport/_spinner.py -> build-2/lib/testtools/twistedsupport
copying testtools/twistedsupport/_deferreddebug.py -> build-2/lib/testtools/twistedsupport
creating build-2/lib/testtools/testresult
copying testtools/testresult/__init__.py -> build-2/lib/testtools/testresult
copying testtools/testresult/doubles.py -> build-2/lib/testtools/testresult
copying testtools/testresult/real.py -> build-2/lib/testtools/testresult
creating build-2/lib/testtools/tests/matchers
copying testtools/tests/matchers/__init__.py -> build-2/lib/testtools/tests/matchers
copying testtools/tests/matchers/test_doctest.py -> build-2/lib/testtools/tests/matchers
copying testtools/tests/matchers/test_datastructures.py -> build-2/lib/testtools/tests/matchers
copying testtools/tests/matchers/test_basic.py -> build-2/lib/testtools/tests/matchers
copying testtools/tests/matchers/test_higherorder.py -> build-2/lib/testtools/tests/matchers
copying testtools/tests/matchers/test_exception.py -> build-2/lib/testtools/tests/matchers
copying testtools/tests/matchers/test_const.py -> build-2/lib/testtools/tests/matchers
copying testtools/tests/matchers/test_impl.py -> build-2/lib/testtools/tests/matchers
copying testtools/tests/matchers/test_filesystem.py -> build-2/lib/testtools/tests/matchers
copying testtools/tests/matchers/test_warnings.py -> build-2/lib/testtools/tests/matchers
copying testtools/tests/matchers/helpers.py -> build-2/lib/testtools/tests/matchers
copying testtools/tests/matchers/test_dict.py -> build-2/lib/testtools/tests/matchers
creating build-2/lib/testtools/tests/twistedsupport
copying testtools/tests/twistedsupport/__init__.py -> build-2/lib/testtools/tests/twistedsupport
copying testtools/tests/twistedsupport/test_deferred.py -> build-2/lib/testtools/tests/twistedsupport
copying testtools/tests/twistedsupport/test_runtest.py -> build-2/lib/testtools/tests/twistedsupport
copying testtools/tests/twistedsupport/_helpers.py -> build-2/lib/testtools/tests/twistedsupport
copying testtools/tests/twistedsupport/test_spinner.py -> build-2/lib/testtools/tests/twistedsupport
copying testtools/tests/twistedsupport/test_matchers.py -> build-2/lib/testtools/tests/twistedsupport
running egg_info
writing requirements to testtools.egg-info/requires.txt
writing testtools.egg-info/PKG-INFO
writing top-level names to testtools.egg-info/top_level.txt
writing dependency_links to testtools.egg-info/dependency_links.txt
[pbr] Reusing existing SOURCES.txt
running test
running=${PYTHON:-python} -m subunit.run --list  testtools.tests.test_suite
running=${PYTHON:-python} -m subunit.run  --load-list /tmp/B.TyGu5y/BUILD/tmp/tmpYSYiHN testtools.tests.test_suite
running=${PYTHON:-python} -m subunit.run  --load-list /tmp/B.TyGu5y/BUILD/tmp/tmp09ZYd2 testtools.tests.test_suite
running=${PYTHON:-python} -m subunit.run  --load-list /tmp/B.TyGu5y/BUILD/tmp/tmp5ByM0c testtools.tests.test_suite
running=${PYTHON:-python} -m subunit.run  --load-list /tmp/B.TyGu5y/BUILD/tmp/tmpj5MVzA testtools.tests.test_suite
running=${PYTHON:-python} -m subunit.run  --load-list /tmp/B.TyGu5y/BUILD/tmp/tmp_JNqah testtools.tests.test_suite
running=${PYTHON:-python} -m subunit.run  --load-list /tmp/B.TyGu5y/BUILD/tmp/tmp3SwyYe testtools.tests.test_suite
running=${PYTHON:-python} -m subunit.run  --load-list /tmp/B.TyGu5y/BUILD/tmp/tmpAt9jOP testtools.tests.test_suite
running=${PYTHON:-python} -m subunit.run  --load-list /tmp/B.TyGu5y/BUILD/tmp/tmpgeqvAr testtools.tests.test_suite
======================================================================
FAIL: testtools.tests.test_run.TestRun.test_run_list_failed_import
tags: worker-4
----------------------------------------------------------------------
Traceback (most recent call last):
  File "testtools/tests/test_run.py", line 216, in test_run_list_failed_import
    """, doctest.ELLIPSIS))
  File "testtools/testcase.py", line 498, in assertThat
    raise mismatch_error
testtools.matchers._impl.MismatchError: Expected:
    unittest2.loader._FailedTest.runexample
    Failed to import test module: runexample
    Traceback (most recent call last):
      File ".../loader.py", line ..., in _find_test_path
        package = self._get_module_from_name(name)
      File ".../loader.py", line ..., in _get_module_from_name
        __import__(name)
      File ".../runexample/__init__.py", line 1
        class not in
    ...^...
    SyntaxError: invalid syntax

Got:
    unittest2.loader._FailedTest.runexample
    Failed to import test module: runexample
    Traceback (most recent call last):
      File "/usr/share/python2.7/site-packages/unittest2/loader.py", line 490, in _find_test_path
      File "/usr/share/python2.7/site-packages/unittest2/loader.py", line 395, in _get_module_from_name
      File "/tmp/B.TyGu5y/BUILD/tmp/tmpjanK1n/runexample/__init__.py", line 1
        class not in
                ^
    SyntaxError: invalid syntax
    <BLANKLINE>
Ran 2625 tests in 2.617s
FAILED (id=0, failures=1, skips=15)
error: testr failed (1)
error: Bad exit status from /tmp/B.TyGu5y/BUILD/tmp/rpm-tmp.3274 (%build)


RPM build errors:
    Bad exit status from /tmp/B.TyGu5y/BUILD/tmp/rpm-tmp.3274 (%build)
ended at: Mon Nov 26 00:27:38 2018, done in 0:00:09.444566
error: No files produced.
+ chmod -R u+rwX /tmp/B.TyGu5y/BUILD
+ rm -rf /tmp/B.TyGu5y/tmp /tmp/B.TyGu5y/BUILD
+ rm -rf /tmp/B.TyGu5y
Begin-PLD-Builder-Info
Build-Time: user:23.97s sys:3.82s real:12.33s (faults io:8 non-io:198767)

End-PLD-Builder-Info
[Back to list of logs] [View rpm -qa of builder]