FailedOk

th/SRPMS[OK]
th/x32[OK]
th/i686[OK]
th/x86_64[OK]

ac/SRPMS[OK]
ac/i386[OK]
ac/i586[OK]
ac/i686[OK]
ac/alpha[OK]
ac/amd64[OK]
ac/athlon[OK]
ac/ppc[OK]
ac/sparc[OK]
ac/sparc64[OK]

Advanced Search
main()
Powered by PLD Linux
(c) 2002-2017 PLD Team
$Revision: 1.37 $
Powered by /dev/null.
Your IP: 54.166.232.243

python3 1cb60215-d801-4f5f-870e-e9124fe550ff

Status:Failed
Source URL:ftp://buildlogs.pld-linux.org/th/i686/FAIL/python3,1cb60215-d801-4f5f-870e-e9124fe550ff.bz2
text/plain URL:View!
full text:View!
rpm -qa of builder:View!
Date:2017/10/04 10:02:10
Runtime:0:03:44.519154

Toc:

  • error 1
  • socket.gaierror: [Errno -3] Temporary failure in name resolution
  • error 2
  • urllib.error.URLError: <urlopen error [Errno -3] Temporary failure in name resolution>
  • error 3
  • AssertionError: Could not retrieve http://www.pythontest.net/unicode/9.0.0/NormalizationTest.txt
  • prep
  • Executing(%prep): /bin/sh -e /tmp/B.SpRmKI/BUILD/tmp/rpm-tmp.27315
  • build
  • Executing(%build): /bin/sh -e /tmp/B.SpRmKI/BUILD/tmp/rpm-tmp.27315
  • install
  • Executing(%install): /bin/sh -e /tmp/B.SpRmKI/BUILD/tmp/rpm-tmp.27315
  • files foo
  • Processing files: foo-0.1-1.noarch
  • clean
  • Executing(%clean): /bin/sh -e /tmp/B.SpRmKI/BUILD/tmp/rpm-tmp.56527
  • prep
  • Executing(%prep): /bin/sh -e /tmp/B.SpRmKI/BUILD/tmp/rpm-tmp.8237
  • build
  • Executing(%build): /bin/sh -e /tmp/B.SpRmKI/BUILD/tmp/rpm-tmp.8237
  • install
  • Executing(%install): /bin/sh -e /tmp/B.SpRmKI/BUILD/tmp/rpm-tmp.8237
  • files foo
  • Processing files: foo-0.1-1.noarch
  • clean
  • Executing(%clean): /bin/sh -e /tmp/B.SpRmKI/BUILD/tmp/rpm-tmp.8237
  • error 4
  • FAIL: test_main (test.test_normalization.NormalizationTest)
  • error 5
  • socket.gaierror: [Errno -3] Temporary failure in name resolution
  • error 6
  • urllib.error.URLError: <urlopen error [Errno -3] Temporary failure in name resolution>
  • error 7
  • AssertionError: Could not retrieve http://www.pythontest.net/unicode/9.0.0/NormalizationTest.txt
  • error 8
  • error: Bad exit status from /tmp/B.SpRmKI/BUILD/tmp/rpm-tmp.12947 (%build)
  • error 9
  • RPM build errors:
  • error 10
  • error: open of /tmp/B.SpRmKI/BUILD/tmp/tmpq37srwtj/foo/build/bdist.linux-i686/rpm/RPMS/foo-0.1-1.noarch.rpm failed: No such file or directory

Content:

i686-pld-linux-gcc -pthread -fPIC -Wno-unused-result -Wsign-compare -DNDEBUG -O2 -fwrapv -pipe -Wformat -Werror=format-security -gdwarf-4 -fno-debug-types-section -fvar-tracking-assignments -g2 -Wp,-D_FORTIFY_SOURCE=2 -fstack-protector-strong --param=ssp-buffer-size=4 -fomit-frame-pointer -march=i686 -fasynchronous-unwind-tables -mtune=pentium4 -gdwarf-4 -fno-debug-types-section -fvar-tracking-assignments -g2 -fno-caller-saves -O2 -fwrapv -pipe -Wformat -Werror=format-security -gdwarf-4 -fno-debug-types-section -fvar-tracking-assignments -g2 -Wp,-D_FORTIFY_SOURCE=2 -fstack-protector-strong --param=ssp-buffer-size=4 -fomit-frame-pointer -march=i686 -fasynchronous-unwind-tables -mtune=pentium4 -gdwarf-4 -fno-debug-types-section -fvar-tracking-assignments -g2 -std=c99 -Wextra -Wno-unused-result -Wno-unused-parameter -Wno-missing-field-initializers -I./Include -I. -I/usr/local/include -I/tmp/B.SpRmKI/BUILD/Python-3.6.3/Include -I/tmp/B.SpRmKI/BUILD/Python-3.6.3 -c /tmp/B.SpRmKI/BUILD/Python-3.6.3/Modules/cjkcodecs/_codecs_iso2022.c -o build/temp.linux-i686-3.6/tmp/B.SpRmKI/BUILD/Python-3.6.3/Modules/cjkcodecs/_codecs_iso2022.o
i686-pld-linux-gcc -pthread -shared -Wl,--as-needed -Wl,--no-copy-dt-needed-entries -Wl,-z,relro -Wl,-z,combreloc build/temp.linux-i686-3.6/tmp/B.SpRmKI/BUILD/Python-3.6.3/Modules/cjkcodecs/_codecs_cn.o -L. -L/usr/local/lib -lpython3.6m -o build/lib.linux-i686-3.6/_codecs_cn.cpython-36m-i386-linux-gnu.so
building '_decimal' extension
creating build/temp.linux-i686-3.6/tmp/B.SpRmKI/BUILD/Python-3.6.3/Modules/_decimal
i686-pld-linux-gcc -pthread -fPIC -Wno-unused-result -Wsign-compare -DNDEBUG -O2 -fwrapv -pipe -Wformat -Werror=format-security -gdwarf-4 -fno-debug-types-section -fvar-tracking-assignments -g2 -Wp,-D_FORTIFY_SOURCE=2 -fstack-protector-strong --param=ssp-buffer-size=4 -fomit-frame-pointer -march=i686 -fasynchronous-unwind-tables -mtune=pentium4 -gdwarf-4 -fno-debug-types-section -fvar-tracking-assignments -g2 -fno-caller-saves -O2 -fwrapv -pipe -Wformat -Werror=format-security -gdwarf-4 -fno-debug-types-section -fvar-tracking-assignments -g2 -Wp,-D_FORTIFY_SOURCE=2 -fstack-protector-strong --param=ssp-buffer-size=4 -fomit-frame-pointer -march=i686 -fasynchronous-unwind-tables -mtune=pentium4 -gdwarf-4 -fno-debug-types-section -fvar-tracking-assignments -g2 -std=c99 -Wextra -Wno-unused-result -Wno-unused-parameter -Wno-missing-field-initializers -DCONFIG_32=1 -DPPRO=1 -DASM=1 -I./Include -I. -I/usr/local/include -I/tmp/B.SpRmKI/BUILD/Python-3.6.3/Include -I/tmp/B.SpRmKI/BUILD/Python-3.6.3 -c /tmp/B.SpRmKI/BUILD/Python-3.6.3/Modules/_decimal/_decimal.c -o build/temp.linux-i686-3.6/tmp/B.SpRmKI/BUILD/Python-3.6.3/Modules/_decimal/_decimal.o -Wno-unknown-pragmas
building '_multiprocessing' extension
creating build/temp.linux-i686-3.6/tmp/B.SpRmKI/BUILD/Python-3.6.3/Modules/_multiprocessing
i686-pld-linux-gcc -pthread -fPIC -Wno-unused-result -Wsign-compare -DNDEBUG -O2 -fwrapv -pipe -Wformat -Werror=format-security -gdwarf-4 -fno-debug-types-section -fvar-tracking-assignments -g2 -Wp,-D_FORTIFY_SOURCE=2 -fstack-protector-strong --param=ssp-buffer-size=4 -fomit-frame-pointer -march=i686 -fasynchronous-unwind-tables -mtune=pentium4 -gdwarf-4 -fno-debug-types-section -fvar-tracking-assignments -g2 -fno-caller-saves -O2 -fwrapv -pipe -Wformat -Werror=format-security -gdwarf-4 -fno-debug-types-section -fvar-tracking-assignments -g2 -Wp,-D_FORTIFY_SOURCE=2 -fstack-protector-strong --param=ssp-buffer-size=4 -fomit-frame-pointer -march=i686 -fasynchronous-unwind-tables -mtune=pentium4 -gdwarf-4 -fno-debug-types-section -fvar-tracking-assignments -g2 -std=c99 -Wextra -Wno-unused-result -Wno-unused-parameter -Wno-missing-field-initializers -IModules/_multiprocessing -I./Include -I. -I/usr/local/include -I/tmp/B.SpRmKI/BUILD/Python-3.6.3/Include -I/tmp/B.SpRmKI/BUILD/Python-3.6.3 -c /tmp/B.SpRmKI/BUILD/Python-3.6.3/Modules/_multiprocessing/multiprocessing.c -o build/temp.linux-i686-3.6/tmp/B.SpRmKI/BUILD/Python-3.6.3/Modules/_multiprocessing/multiprocessing.o
building 'ossaudiodev' extension
i686-pld-linux-gcc -pthread -fPIC -Wno-unused-result -Wsign-compare -DNDEBUG -O2 -fwrapv -pipe -Wformat -Werror=format-security -gdwarf-4 -fno-debug-types-section -fvar-tracking-assignments -g2 -Wp,-D_FORTIFY_SOURCE=2 -fstack-protector-strong --param=ssp-buffer-size=4 -fomit-frame-pointer -march=i686 -fasynchronous-unwind-tables -mtune=pentium4 -gdwarf-4 -fno-debug-types-section -fvar-tracking-assignments -g2 -fno-caller-saves -O2 -fwrapv -pipe -Wformat -Werror=format-security -gdwarf-4 -fno-debug-types-section -fvar-tracking-assignments -g2 -Wp,-D_FORTIFY_SOURCE=2 -fstack-protector-strong --param=ssp-buffer-size=4 -fomit-frame-pointer -march=i686 -fasynchronous-unwind-tables -mtune=pentium4 -gdwarf-4 -fno-debug-types-section -fvar-tracking-assignments -g2 -std=c99 -Wextra -Wno-unused-result -Wno-unused-parameter -Wno-missing-field-initializers -I./Include -I. -I/usr/local/include -I/tmp/B.SpRmKI/BUILD/Python-3.6.3/Include -I/tmp/B.SpRmKI/BUILD/Python-3.6.3 -c /tmp/B.SpRmKI/BUILD/Python-3.6.3/Modules/ossaudiodev.c -o build/temp.linux-i686-3.6/tmp/B.SpRmKI/BUILD/Python-3.6.3/Modules/ossaudiodev.o
i686-pld-linux-gcc -pthread -shared -Wl,--as-needed -Wl,--no-copy-dt-needed-entries -Wl,-z,relro -Wl,-z,combreloc build/temp.linux-i686-3.6/tmp/B.SpRmKI/BUILD/Python-3.6.3/Modules/cjkcodecs/_codecs_tw.o -L. -L/usr/local/lib -lpython3.6m -o build/lib.linux-i686-3.6/_codecs_tw.cpython-36m-i386-linux-gnu.so
building '_tkinter' extension
i686-pld-linux-gcc -pthread -fPIC -Wno-unused-result -Wsign-compare -DNDEBUG -O2 -fwrapv -pipe -Wformat -Werror=format-security -gdwarf-4 -fno-debug-types-section -fvar-tracking-assignments -g2 -Wp,-D_FORTIFY_SOURCE=2 -fstack-protector-strong --param=ssp-buffer-size=4 -fomit-frame-pointer -march=i686 -fasynchronous-unwind-tables -mtune=pentium4 -gdwarf-4 -fno-debug-types-section -fvar-tracking-assignments -g2 -fno-caller-saves -O2 -fwrapv -pipe -Wformat -Werror=format-security -gdwarf-4 -fno-debug-types-section -fvar-tracking-assignments -g2 -Wp,-D_FORTIFY_SOURCE=2 -fstack-protector-strong --param=ssp-buffer-size=4 -fomit-frame-pointer -march=i686 -fasynchronous-unwind-tables -mtune=pentium4 -gdwarf-4 -fno-debug-types-section -fvar-tracking-assignments -g2 -std=c99 -Wextra -Wno-unused-result -Wno-unused-parameter -Wno-missing-field-initializers -DWITH_APPINIT=1 -I/usr/X11/include -I./Include -I. -I/usr/local/include -I/tmp/B.SpRmKI/BUILD/Python-3.6.3/Include -I/tmp/B.SpRmKI/BUILD/Python-3.6.3 -c /tmp/B.SpRmKI/BUILD/Python-3.6.3/Modules/_tkinter.c -o build/temp.linux-i686-3.6/tmp/B.SpRmKI/BUILD/Python-3.6.3/Modules/_tkinter.o
i686-pld-linux-gcc -pthread -fPIC -Wno-unused-result -Wsign-compare -DNDEBUG -O2 -fwrapv -pipe -Wformat -Werror=format-security -gdwarf-4 -fno-debug-types-section -fvar-tracking-assignments -g2 -Wp,-D_FORTIFY_SOURCE=2 -fstack-protector-strong --param=ssp-buffer-size=4 -fomit-frame-pointer -march=i686 -fasynchronous-unwind-tables -mtune=pentium4 -gdwarf-4 -fno-debug-types-section -fvar-tracking-assignments -g2 -fno-caller-saves -O2 -fwrapv -pipe -Wformat -Werror=format-security -gdwarf-4 -fno-debug-types-section -fvar-tracking-assignments -g2 -Wp,-D_FORTIFY_SOURCE=2 -fstack-protector-strong --param=ssp-buffer-size=4 -fomit-frame-pointer -march=i686 -fasynchronous-unwind-tables -mtune=pentium4 -gdwarf-4 -fno-debug-types-section -fvar-tracking-assignments -g2 -std=c99 -Wextra -Wno-unused-result -Wno-unused-parameter -Wno-missing-field-initializers -IModules/_multiprocessing -I./Include -I. -I/usr/local/include -I/tmp/B.SpRmKI/BUILD/Python-3.6.3/Include -I/tmp/B.SpRmKI/BUILD/Python-3.6.3 -c /tmp/B.SpRmKI/BUILD/Python-3.6.3/Modules/_multiprocessing/semaphore.c -o build/temp.linux-i686-3.6/tmp/B.SpRmKI/BUILD/Python-3.6.3/Modules/_multiprocessing/semaphore.o
i686-pld-linux-gcc -pthread -shared -Wl,--as-needed -Wl,--no-copy-dt-needed-entries -Wl,-z,relro -Wl,-z,combreloc build/temp.linux-i686-3.6/tmp/B.SpRmKI/BUILD/Python-3.6.3/Modules/cjkcodecs/_codecs_jp.o -L. -L/usr/local/lib -lpython3.6m -o build/lib.linux-i686-3.6/_codecs_jp.cpython-36m-i386-linux-gnu.so
building 'xxlimited' extension
i686-pld-linux-gcc -pthread -fPIC -Wno-unused-result -Wsign-compare -DNDEBUG -O2 -fwrapv -pipe -Wformat -Werror=format-security -gdwarf-4 -fno-debug-types-section -fvar-tracking-assignments -g2 -Wp,-D_FORTIFY_SOURCE=2 -fstack-protector-strong --param=ssp-buffer-size=4 -fomit-frame-pointer -march=i686 -fasynchronous-unwind-tables -mtune=pentium4 -gdwarf-4 -fno-debug-types-section -fvar-tracking-assignments -g2 -fno-caller-saves -O2 -fwrapv -pipe -Wformat -Werror=format-security -gdwarf-4 -fno-debug-types-section -fvar-tracking-assignments -g2 -Wp,-D_FORTIFY_SOURCE=2 -fstack-protector-strong --param=ssp-buffer-size=4 -fomit-frame-pointer -march=i686 -fasynchronous-unwind-tables -mtune=pentium4 -gdwarf-4 -fno-debug-types-section -fvar-tracking-assignments -g2 -std=c99 -Wextra -Wno-unused-result -Wno-unused-parameter -Wno-missing-field-initializers -DPy_LIMITED_API=0x03050000 -I./Include -I. -I/usr/local/include -I/tmp/B.SpRmKI/BUILD/Python-3.6.3/Include -I/tmp/B.SpRmKI/BUILD/Python-3.6.3 -c /tmp/B.SpRmKI/BUILD/Python-3.6.3/Modules/xxlimited.c -o build/temp.linux-i686-3.6/tmp/B.SpRmKI/BUILD/Python-3.6.3/Modules/xxlimited.o
i686-pld-linux-gcc -pthread -shared -Wl,--as-needed -Wl,--no-copy-dt-needed-entries -Wl,-z,relro -Wl,-z,combreloc build/temp.linux-i686-3.6/tmp/B.SpRmKI/BUILD/Python-3.6.3/Modules/_elementtree.o -L. -L/usr/local/lib -lexpat -lpython3.6m -o build/lib.linux-i686-3.6/_elementtree.cpython-36m-i386-linux-gnu.so
i686-pld-linux-gcc -pthread -shared -Wl,--as-needed -Wl,--no-copy-dt-needed-entries -Wl,-z,relro -Wl,-z,combreloc build/temp.linux-i686-3.6/tmp/B.SpRmKI/BUILD/Python-3.6.3/Modules/_multiprocessing/multiprocessing.o build/temp.linux-i686-3.6/tmp/B.SpRmKI/BUILD/Python-3.6.3/Modules/_multiprocessing/semaphore.o -L. -L/usr/local/lib -lpython3.6m -o build/lib.linux-i686-3.6/_multiprocessing.cpython-36m-i386-linux-gnu.so
i686-pld-linux-gcc -pthread -shared -Wl,--as-needed -Wl,--no-copy-dt-needed-entries -Wl,-z,relro -Wl,-z,combreloc build/temp.linux-i686-3.6/tmp/B.SpRmKI/BUILD/Python-3.6.3/Modules/xxlimited.o -L. -L/usr/local/lib -lpython3.6m -o build/lib.linux-i686-3.6/xxlimited.cpython-36m-i386-linux-gnu.so
i686-pld-linux-gcc -pthread -shared -Wl,--as-needed -Wl,--no-copy-dt-needed-entries -Wl,-z,relro -Wl,-z,combreloc build/temp.linux-i686-3.6/tmp/B.SpRmKI/BUILD/Python-3.6.3/Modules/cjkcodecs/_codecs_hk.o -L. -L/usr/local/lib -lpython3.6m -o build/lib.linux-i686-3.6/_codecs_hk.cpython-36m-i386-linux-gnu.so
i686-pld-linux-gcc -pthread -shared -Wl,--as-needed -Wl,--no-copy-dt-needed-entries -Wl,-z,relro -Wl,-z,combreloc build/temp.linux-i686-3.6/tmp/B.SpRmKI/BUILD/Python-3.6.3/Modules/cjkcodecs/_codecs_iso2022.o -L. -L/usr/local/lib -lpython3.6m -o build/lib.linux-i686-3.6/_codecs_iso2022.cpython-36m-i386-linux-gnu.so
i686-pld-linux-gcc -pthread -shared -Wl,--as-needed -Wl,--no-copy-dt-needed-entries -Wl,-z,relro -Wl,-z,combreloc build/temp.linux-i686-3.6/tmp/B.SpRmKI/BUILD/Python-3.6.3/Modules/ossaudiodev.o -L. -L/usr/local/lib -lpython3.6m -o build/lib.linux-i686-3.6/ossaudiodev.cpython-36m-i386-linux-gnu.so
building '_ctypes' extension
i686-pld-linux-gcc -pthread -fPIC -Wno-unused-result -Wsign-compare -DNDEBUG -O2 -fwrapv -pipe -Wformat -Werror=format-security -gdwarf-4 -fno-debug-types-section -fvar-tracking-assignments -g2 -Wp,-D_FORTIFY_SOURCE=2 -fstack-protector-strong --param=ssp-buffer-size=4 -fomit-frame-pointer -march=i686 -fasynchronous-unwind-tables -mtune=pentium4 -gdwarf-4 -fno-debug-types-section -fvar-tracking-assignments -g2 -fno-caller-saves -O2 -fwrapv -pipe -Wformat -Werror=format-security -gdwarf-4 -fno-debug-types-section -fvar-tracking-assignments -g2 -Wp,-D_FORTIFY_SOURCE=2 -fstack-protector-strong --param=ssp-buffer-size=4 -fomit-frame-pointer -march=i686 -fasynchronous-unwind-tables -mtune=pentium4 -gdwarf-4 -fno-debug-types-section -fvar-tracking-assignments -g2 -std=c99 -Wextra -Wno-unused-result -Wno-unused-parameter -Wno-missing-field-initializers -I/usr/lib/libffi-3.2.1/include -I./Include -I. -I/usr/local/include -I/tmp/B.SpRmKI/BUILD/Python-3.6.3/Include -I/tmp/B.SpRmKI/BUILD/Python-3.6.3 -c /tmp/B.SpRmKI/BUILD/Python-3.6.3/Modules/_ctypes/_ctypes.c -o build/temp.linux-i686-3.6/tmp/B.SpRmKI/BUILD/Python-3.6.3/Modules/_ctypes/_ctypes.o
i686-pld-linux-gcc -pthread -fPIC -Wno-unused-result -Wsign-compare -DNDEBUG -O2 -fwrapv -pipe -Wformat -Werror=format-security -gdwarf-4 -fno-debug-types-section -fvar-tracking-assignments -g2 -Wp,-D_FORTIFY_SOURCE=2 -fstack-protector-strong --param=ssp-buffer-size=4 -fomit-frame-pointer -march=i686 -fasynchronous-unwind-tables -mtune=pentium4 -gdwarf-4 -fno-debug-types-section -fvar-tracking-assignments -g2 -fno-caller-saves -O2 -fwrapv -pipe -Wformat -Werror=format-security -gdwarf-4 -fno-debug-types-section -fvar-tracking-assignments -g2 -Wp,-D_FORTIFY_SOURCE=2 -fstack-protector-strong --param=ssp-buffer-size=4 -fomit-frame-pointer -march=i686 -fasynchronous-unwind-tables -mtune=pentium4 -gdwarf-4 -fno-debug-types-section -fvar-tracking-assignments -g2 -std=c99 -Wextra -Wno-unused-result -Wno-unused-parameter -Wno-missing-field-initializers -DWITH_APPINIT=1 -I/usr/X11/include -I./Include -I. -I/usr/local/include -I/tmp/B.SpRmKI/BUILD/Python-3.6.3/Include -I/tmp/B.SpRmKI/BUILD/Python-3.6.3 -c /tmp/B.SpRmKI/BUILD/Python-3.6.3/Modules/tkappinit.c -o build/temp.linux-i686-3.6/tmp/B.SpRmKI/BUILD/Python-3.6.3/Modules/tkappinit.o
i686-pld-linux-gcc -pthread -shared -Wl,--as-needed -Wl,--no-copy-dt-needed-entries -Wl,-z,relro -Wl,-z,combreloc build/temp.linux-i686-3.6/tmp/B.SpRmKI/BUILD/Python-3.6.3/Modules/_tkinter.o build/temp.linux-i686-3.6/tmp/B.SpRmKI/BUILD/Python-3.6.3/Modules/tkappinit.o -L/usr/X11/lib -L. -L/usr/local/lib -ltk8.6 -ltcl8.6 -lX11 -lpython3.6m -o build/lib.linux-i686-3.6/_tkinter.cpython-36m-i386-linux-gnu.so
i686-pld-linux-gcc -pthread -fPIC -Wno-unused-result -Wsign-compare -DNDEBUG -O2 -fwrapv -pipe -Wformat -Werror=format-security -gdwarf-4 -fno-debug-types-section -fvar-tracking-assignments -g2 -Wp,-D_FORTIFY_SOURCE=2 -fstack-protector-strong --param=ssp-buffer-size=4 -fomit-frame-pointer -march=i686 -fasynchronous-unwind-tables -mtune=pentium4 -gdwarf-4 -fno-debug-types-section -fvar-tracking-assignments -g2 -fno-caller-saves -O2 -fwrapv -pipe -Wformat -Werror=format-security -gdwarf-4 -fno-debug-types-section -fvar-tracking-assignments -g2 -Wp,-D_FORTIFY_SOURCE=2 -fstack-protector-strong --param=ssp-buffer-size=4 -fomit-frame-pointer -march=i686 -fasynchronous-unwind-tables -mtune=pentium4 -gdwarf-4 -fno-debug-types-section -fvar-tracking-assignments -g2 -std=c99 -Wextra -Wno-unused-result -Wno-unused-parameter -Wno-missing-field-initializers -I/usr/lib/libffi-3.2.1/include -I./Include -I. -I/usr/local/include -I/tmp/B.SpRmKI/BUILD/Python-3.6.3/Include -I/tmp/B.SpRmKI/BUILD/Python-3.6.3 -c /tmp/B.SpRmKI/BUILD/Python-3.6.3/Modules/_ctypes/callbacks.c -o build/temp.linux-i686-3.6/tmp/B.SpRmKI/BUILD/Python-3.6.3/Modules/_ctypes/callbacks.o
i686-pld-linux-gcc -pthread -fPIC -Wno-unused-result -Wsign-compare -DNDEBUG -O2 -fwrapv -pipe -Wformat -Werror=format-security -gdwarf-4 -fno-debug-types-section -fvar-tracking-assignments -g2 -Wp,-D_FORTIFY_SOURCE=2 -fstack-protector-strong --param=ssp-buffer-size=4 -fomit-frame-pointer -march=i686 -fasynchronous-unwind-tables -mtune=pentium4 -gdwarf-4 -fno-debug-types-section -fvar-tracking-assignments -g2 -fno-caller-saves -O2 -fwrapv -pipe -Wformat -Werror=format-security -gdwarf-4 -fno-debug-types-section -fvar-tracking-assignments -g2 -Wp,-D_FORTIFY_SOURCE=2 -fstack-protector-strong --param=ssp-buffer-size=4 -fomit-frame-pointer -march=i686 -fasynchronous-unwind-tables -mtune=pentium4 -gdwarf-4 -fno-debug-types-section -fvar-tracking-assignments -g2 -std=c99 -Wextra -Wno-unused-result -Wno-unused-parameter -Wno-missing-field-initializers -I/usr/lib/libffi-3.2.1/include -I./Include -I. -I/usr/local/include -I/tmp/B.SpRmKI/BUILD/Python-3.6.3/Include -I/tmp/B.SpRmKI/BUILD/Python-3.6.3 -c /tmp/B.SpRmKI/BUILD/Python-3.6.3/Modules/_ctypes/callproc.c -o build/temp.linux-i686-3.6/tmp/B.SpRmKI/BUILD/Python-3.6.3/Modules/_ctypes/callproc.o
i686-pld-linux-gcc -pthread -fPIC -Wno-unused-result -Wsign-compare -DNDEBUG -O2 -fwrapv -pipe -Wformat -Werror=format-security -gdwarf-4 -fno-debug-types-section -fvar-tracking-assignments -g2 -Wp,-D_FORTIFY_SOURCE=2 -fstack-protector-strong --param=ssp-buffer-size=4 -fomit-frame-pointer -march=i686 -fasynchronous-unwind-tables -mtune=pentium4 -gdwarf-4 -fno-debug-types-section -fvar-tracking-assignments -g2 -fno-caller-saves -O2 -fwrapv -pipe -Wformat -Werror=format-security -gdwarf-4 -fno-debug-types-section -fvar-tracking-assignments -g2 -Wp,-D_FORTIFY_SOURCE=2 -fstack-protector-strong --param=ssp-buffer-size=4 -fomit-frame-pointer -march=i686 -fasynchronous-unwind-tables -mtune=pentium4 -gdwarf-4 -fno-debug-types-section -fvar-tracking-assignments -g2 -std=c99 -Wextra -Wno-unused-result -Wno-unused-parameter -Wno-missing-field-initializers -I/usr/lib/libffi-3.2.1/include -I./Include -I. -I/usr/local/include -I/tmp/B.SpRmKI/BUILD/Python-3.6.3/Include -I/tmp/B.SpRmKI/BUILD/Python-3.6.3 -c /tmp/B.SpRmKI/BUILD/Python-3.6.3/Modules/_ctypes/stgdict.c -o build/temp.linux-i686-3.6/tmp/B.SpRmKI/BUILD/Python-3.6.3/Modules/_ctypes/stgdict.o
i686-pld-linux-gcc -pthread -fPIC -Wno-unused-result -Wsign-compare -DNDEBUG -O2 -fwrapv -pipe -Wformat -Werror=format-security -gdwarf-4 -fno-debug-types-section -fvar-tracking-assignments -g2 -Wp,-D_FORTIFY_SOURCE=2 -fstack-protector-strong --param=ssp-buffer-size=4 -fomit-frame-pointer -march=i686 -fasynchronous-unwind-tables -mtune=pentium4 -gdwarf-4 -fno-debug-types-section -fvar-tracking-assignments -g2 -fno-caller-saves -O2 -fwrapv -pipe -Wformat -Werror=format-security -gdwarf-4 -fno-debug-types-section -fvar-tracking-assignments -g2 -Wp,-D_FORTIFY_SOURCE=2 -fstack-protector-strong --param=ssp-buffer-size=4 -fomit-frame-pointer -march=i686 -fasynchronous-unwind-tables -mtune=pentium4 -gdwarf-4 -fno-debug-types-section -fvar-tracking-assignments -g2 -std=c99 -Wextra -Wno-unused-result -Wno-unused-parameter -Wno-missing-field-initializers -I/usr/lib/libffi-3.2.1/include -I./Include -I. -I/usr/local/include -I/tmp/B.SpRmKI/BUILD/Python-3.6.3/Include -I/tmp/B.SpRmKI/BUILD/Python-3.6.3 -c /tmp/B.SpRmKI/BUILD/Python-3.6.3/Modules/_ctypes/cfield.c -o build/temp.linux-i686-3.6/tmp/B.SpRmKI/BUILD/Python-3.6.3/Modules/_ctypes/cfield.o
i686-pld-linux-gcc -pthread -shared -Wl,--as-needed -Wl,--no-copy-dt-needed-entries -Wl,-z,relro -Wl,-z,combreloc build/temp.linux-i686-3.6/tmp/B.SpRmKI/BUILD/Python-3.6.3/Modules/_decimal/_decimal.o -L. -L/usr/local/lib -l:libmpdec.so.2 -lpython3.6m -o build/lib.linux-i686-3.6/_decimal.cpython-36m-i386-linux-gnu.so
i686-pld-linux-gcc -pthread -shared -Wl,--as-needed -Wl,--no-copy-dt-needed-entries -Wl,-z,relro -Wl,-z,combreloc build/temp.linux-i686-3.6/tmp/B.SpRmKI/BUILD/Python-3.6.3/Modules/_ctypes/_ctypes.o build/temp.linux-i686-3.6/tmp/B.SpRmKI/BUILD/Python-3.6.3/Modules/_ctypes/callbacks.o build/temp.linux-i686-3.6/tmp/B.SpRmKI/BUILD/Python-3.6.3/Modules/_ctypes/callproc.o build/temp.linux-i686-3.6/tmp/B.SpRmKI/BUILD/Python-3.6.3/Modules/_ctypes/stgdict.o build/temp.linux-i686-3.6/tmp/B.SpRmKI/BUILD/Python-3.6.3/Modules/_ctypes/cfield.o -L. -L/usr/local/lib -lffi -lpython3.6m -o build/lib.linux-i686-3.6/_ctypes.cpython-36m-i386-linux-gnu.so
The following modules found by detect_modules() in setup.py, have been
built by the Makefile instead, as configured by the Setup files:
atexit                pwd                   time               
running build_scripts
creating build/scripts-3.6
copying and adjusting /tmp/B.SpRmKI/BUILD/Python-3.6.3/Tools/scripts/pydoc3 -> build/scripts-3.6
copying and adjusting /tmp/B.SpRmKI/BUILD/Python-3.6.3/Tools/scripts/idle3 -> build/scripts-3.6
copying and adjusting /tmp/B.SpRmKI/BUILD/Python-3.6.3/Tools/scripts/2to3 -> build/scripts-3.6
copying and adjusting /tmp/B.SpRmKI/BUILD/Python-3.6.3/Tools/scripts/pyvenv -> build/scripts-3.6
changing mode of build/scripts-3.6/pydoc3 from 644 to 755
changing mode of build/scripts-3.6/idle3 from 644 to 755
changing mode of build/scripts-3.6/2to3 from 644 to 755
changing mode of build/scripts-3.6/pyvenv from 644 to 755
renaming build/scripts-3.6/pydoc3 to build/scripts-3.6/pydoc3.6
renaming build/scripts-3.6/idle3 to build/scripts-3.6/idle3.6
renaming build/scripts-3.6/2to3 to build/scripts-3.6/2to3-3.6
renaming build/scripts-3.6/pyvenv to build/scripts-3.6/pyvenv-3.6
+ LC_ALL=C 
+ export LC_ALL
+ echo build/lib.linux-i686-3.6
+ binlibdir=build/lib.linux-i686-3.6 
+ pwd
+ pwd
+ pwd
+ pwd
+ WITHIN_PYTHON_RPM_BUILD=1 /usr/bin/make -Otarget -j9 test 'TESTOPTS=-w -x test_resource test_openpty test_socket test_nis test_posix test_locale test_pty test_asyncio test_os test_readline test_nntplib test_gdb test_site test_ssl ' 'TESTPYTHON=LD_LIBRARY_PATH=/tmp/B.SpRmKI/BUILD/Python-3.6.3 PYTHONHOME=/tmp/B.SpRmKI/BUILD/Python-3.6.3 PYTHONPATH=/tmp/B.SpRmKI/BUILD/Python-3.6.3/Lib:/tmp/B.SpRmKI/BUILD/Python-3.6.3/build/lib.linux-i686-3.6 ./python -tt'
LD_LIBRARY_PATH=/tmp/B.SpRmKI/BUILD/Python-3.6.3:/home/users/builder/GNUstep/Library/Libraries:/usr/local/lib:/usr/lib ./python -E -c 'import sys ; from sysconfig import get_platform ; print("%s-%d.%d" % (get_platform(), *sys.version_info[:2]))' >platform
running build
running build_ext
The following modules found by detect_modules() in setup.py, have been
built by the Makefile instead, as configured by the Setup files:
atexit                pwd                   time               
running build_scripts
copying and adjusting /tmp/B.SpRmKI/BUILD/Python-3.6.3/Tools/scripts/pydoc3 -> build/scripts-3.6
copying and adjusting /tmp/B.SpRmKI/BUILD/Python-3.6.3/Tools/scripts/idle3 -> build/scripts-3.6
copying and adjusting /tmp/B.SpRmKI/BUILD/Python-3.6.3/Tools/scripts/2to3 -> build/scripts-3.6
copying and adjusting /tmp/B.SpRmKI/BUILD/Python-3.6.3/Tools/scripts/pyvenv -> build/scripts-3.6
changing mode of build/scripts-3.6/pydoc3 from 644 to 755
changing mode of build/scripts-3.6/idle3 from 644 to 755
changing mode of build/scripts-3.6/2to3 from 644 to 755
changing mode of build/scripts-3.6/pyvenv from 644 to 755
renaming build/scripts-3.6/pydoc3 to build/scripts-3.6/pydoc3.6
renaming build/scripts-3.6/idle3 to build/scripts-3.6/idle3.6
renaming build/scripts-3.6/2to3 to build/scripts-3.6/2to3-3.6
renaming build/scripts-3.6/pyvenv to build/scripts-3.6/pyvenv-3.6
LD_LIBRARY_PATH=/tmp/B.SpRmKI/BUILD/Python-3.6.3 PYTHONHOME=/tmp/B.SpRmKI/BUILD/Python-3.6.3 PYTHONPATH=/tmp/B.SpRmKI/BUILD/Python-3.6.3/Lib:/tmp/B.SpRmKI/BUILD/Python-3.6.3/build/lib.linux-i686-3.6 ./python -tt ./Tools/scripts/run_tests.py -w -x test_resource test_openpty test_socket test_nis test_posix test_locale test_pty test_asyncio test_os test_readline test_nntplib test_gdb test_site test_ssl 
== CPython 3.6.3 (default, Oct 4 2017, 09:59:15) [GCC 7.2.0 20170814 (release)]
== Linux-4.1.39-2-i686-Intel-R-_Xeon-R-_CPU___________X5470__@_3.33GHz-with-pld-3.0 little-endian
== cwd: /tmp/B.SpRmKI/BUILD/Python-3.6.3/build/test_python_6494
== CPU count: 8
== encodings: locale=ANSI_X3.4-1968, FS=ascii
Using random seed 7030921
Run tests in parallel using 10 child processes
0:00:00 load avg: 4.14 [  1/391] test_secrets passed
0:00:00 load avg: 4.14 [  2/391] test_flufl passed
0:00:00 load avg: 4.14 [  3/391] test___future__ passed
0:00:00 load avg: 4.14 [  4/391] test_unpack_ex passed
0:00:00 load avg: 4.14 [  5/391] test_coroutines passed
0:00:00 load avg: 4.14 [  6/391] test_hmac passed
0:00:00 load avg: 4.14 [  7/391] test_ossaudiodev skipped (resource denied)
test_ossaudiodev skipped -- Use of the 'audio' resource not enabled
0:00:00 load avg: 4.61 [  8/391] test_pkgutil passed
0:00:00 load avg: 4.61 [  9/391/1] test_normalization failed
test test_normalization failed -- Traceback (most recent call last):
  File "/tmp/B.SpRmKI/BUILD/Python-3.6.3/Lib/urllib/request.py", line 1318, in do_open
    encode_chunked=req.has_header('Transfer-encoding'))
socket.gaierror: [Errno -3] Temporary failure in name resolution

During handling of the above exception, another exception occurred:

Traceback (most recent call last):
  File "/tmp/B.SpRmKI/BUILD/Python-3.6.3/Lib/test/test_normalization.py", line 42, in test_main
    check=check_version)
urllib.error.URLError: <urlopen error [Errno -3] Temporary failure in name resolution>

During handling of the above exception, another exception occurred:

Traceback (most recent call last):
  File "/tmp/B.SpRmKI/BUILD/Python-3.6.3/Lib/test/test_normalization.py", line 47, in test_main
    self.fail(f"Could not retrieve {TESTDATAURL}")
AssertionError: Could not retrieve http://www.pythontest.net/unicode/9.0.0/NormalizationTest.txt
0:00:00 load avg: 4.61 [ 10/391/1] test_cgitb passed
0:00:00 load avg: 4.61 [ 11/391/1] test_abc passed
0:00:00 load avg: 4.61 [ 12/391/1] test_winsound skipped (resource denied)
test_winsound skipped -- Use of the 'audio' resource not enabled
0:00:00 load avg: 4.61 [ 13/391/1] test_structmembers passed
0:00:01 load avg: 4.61 [ 14/391/1] test_winreg skipped
test_winreg skipped -- No module named 'winreg'
0:00:01 load avg: 4.61 [ 15/391/1] test_glob passed
0:00:01 load avg: 4.61 [ 16/391/1] test_sys_settrace passed
0:00:01 load avg: 4.61 [ 17/391/1] test_module passed
0:00:01 load avg: 4.61 [ 18/391/1] test_errno passed
0:00:01 load avg: 4.61 [ 19/391/1] test_msilib skipped
test_msilib skipped -- No module named '_msi'
0:00:01 load avg: 4.61 [ 20/391/1] test_difflib passed
0:00:01 load avg: 4.61 [ 21/391/1] test_textwrap passed
0:00:01 load avg: 4.61 [ 22/391/1] test_unicode_file_functions skipped
test_unicode_file_functions skipped -- only NT+ and systems with Unicode-friendly filesystem encoding
0:00:01 load avg: 4.61 [ 23/391/1] test_strftime passed
0:00:02 load avg: 4.61 [ 24/391/1] test_pwd passed
0:00:02 load avg: 4.61 [ 25/391/1] test_shlex passed
0:00:02 load avg: 4.61 [ 26/391/1] test_fractions passed
0:00:02 load avg: 4.61 [ 27/391/1] test_finalization passed
0:00:03 load avg: 4.61 [ 28/391/1] test_int passed
0:00:03 load avg: 4.61 [ 29/391/1] test_operator passed
0:00:04 load avg: 4.61 [ 30/391/1] test_queue passed
0:00:04 load avg: 4.61 [ 31/391/1] test_ftplib passed
0:00:05 load avg: 4.96 [ 32/391/1] test_codecencodings_jp passed
0:00:06 load avg: 4.96 [ 33/391/1] test_distutils passed
Executing(%prep): /bin/sh -e /tmp/B.SpRmKI/BUILD/tmp/rpm-tmp.27315
drwxr-xr-x builder/users     0 2017-10-04 09:59 foo-0.1/
-rw-r--r-- builder/users     0 2017-10-04 09:59 foo-0.1/README
-rw-r--r-- builder/users     1 2017-10-04 09:59 foo-0.1/foo.py
-rw-r--r-- builder/users   150 2017-10-04 09:59 foo-0.1/setup.py
-rw-r--r-- builder/users   163 2017-10-04 09:59 foo-0.1/PKG-INFO
Executing(%build): /bin/sh -e /tmp/B.SpRmKI/BUILD/tmp/rpm-tmp.27315
TMP=/home/users/builder/tmp
HOME=/tmp/B.SpRmKI/BUILD/tmp/tmpspg18vgj
PATH=/home/users/builder/GNUstep/Tools:/usr/local/bin:/usr/bin:/bin:/home/users/builder/bin
TMPDIR=/tmp/B.SpRmKI/BUILD/tmp
running build
running build_py
creating build
creating build/lib
copying foo.py -> build/lib
Executing(%install): /bin/sh -e /tmp/B.SpRmKI/BUILD/tmp/rpm-tmp.27315
TMP=/home/users/builder/tmp
HOME=/tmp/B.SpRmKI/BUILD/tmp/tmpspg18vgj
PATH=/home/users/builder/GNUstep/Tools:/usr/local/bin:/usr/bin:/bin:/home/users/builder/bin
TMPDIR=/tmp/B.SpRmKI/BUILD/tmp
running install
running build
running build_py
running install_lib
creating /tmp/B.SpRmKI/BUILD/tmp/foo-0.1-root-builder/tmp
creating /tmp/B.SpRmKI/BUILD/tmp/foo-0.1-root-builder/tmp/B.SpRmKI
creating /tmp/B.SpRmKI/BUILD/tmp/foo-0.1-root-builder/tmp/B.SpRmKI/BUILD
creating /tmp/B.SpRmKI/BUILD/tmp/foo-0.1-root-builder/tmp/B.SpRmKI/BUILD/Python-3.6.3
creating /tmp/B.SpRmKI/BUILD/tmp/foo-0.1-root-builder/tmp/B.SpRmKI/BUILD/Python-3.6.3/lib
creating /tmp/B.SpRmKI/BUILD/tmp/foo-0.1-root-builder/tmp/B.SpRmKI/BUILD/Python-3.6.3/lib/python3.6
creating /tmp/B.SpRmKI/BUILD/tmp/foo-0.1-root-builder/tmp/B.SpRmKI/BUILD/Python-3.6.3/lib/python3.6/site-packages
copying build/lib/foo.py -> /tmp/B.SpRmKI/BUILD/tmp/foo-0.1-root-builder/tmp/B.SpRmKI/BUILD/Python-3.6.3/lib/python3.6/site-packages
byte-compiling /tmp/B.SpRmKI/BUILD/tmp/foo-0.1-root-builder/tmp/B.SpRmKI/BUILD/Python-3.6.3/lib/python3.6/site-packages/foo.py to foo.cpython-36.pyc
writing byte-compilation script '/tmp/B.SpRmKI/BUILD/tmp/tmpwn941mml.py'
/tmp/B.SpRmKI/BUILD/Python-3.6.3/python /tmp/B.SpRmKI/BUILD/tmp/tmpwn941mml.py
removing /tmp/B.SpRmKI/BUILD/tmp/tmpwn941mml.py
running install_egg_info
Writing /tmp/B.SpRmKI/BUILD/tmp/foo-0.1-root-builder/tmp/B.SpRmKI/BUILD/Python-3.6.3/lib/python3.6/site-packages/foo-0.1-py3.6.egg-info
writing list of installed files to 'INSTALLED_FILES'
RPM_BUILD_DIR=/tmp/B.SpRmKI/BUILD/tmp/tmpspg18vgj/foo/build/bdist.linux-i686/rpm/BUILD

Searching for shared objects with unresolved symbols... DONE
Checking /var/run <-> tmpfiles.d completeness...
 DONE
Checking script shebangs...
 DONE
Hardlink Python files: 0/2 files hardlinked
Processing files: foo-0.1-1.noarch
Checking for unpackaged file(s): /usr/lib/rpm/check-files /tmp/B.SpRmKI/BUILD/tmp/foo-0.1-root-builder
Wrote: /tmp/B.SpRmKI/BUILD/tmp/tmpspg18vgj/foo/build/bdist.linux-i686/rpm/SRPMS/foo-0.1-1.src.rpm
Wrote: /tmp/B.SpRmKI/BUILD/tmp/tmpspg18vgj/foo/build/bdist.linux-i686/rpm/RPMS/foo-0.1-1.noarch.rpm
Executing(%clean): /bin/sh -e /tmp/B.SpRmKI/BUILD/tmp/rpm-tmp.56527
Executing(--clean): /bin/sh -e /tmp/B.SpRmKI/BUILD/tmp/rpm-tmp.56527
Executing(%prep): /bin/sh -e /tmp/B.SpRmKI/BUILD/tmp/rpm-tmp.8237
drwxr-xr-x builder/users     0 2017-10-04 09:59 foo-0.1/
-rw-r--r-- builder/users     0 2017-10-04 09:59 foo-0.1/README
-rw-r--r-- builder/users     1 2017-10-04 09:59 foo-0.1/foo.py
-rw-r--r-- builder/users   150 2017-10-04 09:59 foo-0.1/setup.py
-rw-r--r-- builder/users   163 2017-10-04 09:59 foo-0.1/PKG-INFO
Executing(%build): /bin/sh -e /tmp/B.SpRmKI/BUILD/tmp/rpm-tmp.8237
TMP=/home/users/builder/tmp
HOME=/tmp/B.SpRmKI/BUILD/tmp/tmpq37srwtj
PATH=/home/users/builder/GNUstep/Tools:/usr/local/bin:/usr/bin:/bin:/home/users/builder/bin
TMPDIR=/tmp/B.SpRmKI/BUILD/tmp
running build
running build_py
creating build
creating build/lib
copying foo.py -> build/lib
Executing(%install): /bin/sh -e /tmp/B.SpRmKI/BUILD/tmp/rpm-tmp.8237
TMP=/home/users/builder/tmp
HOME=/tmp/B.SpRmKI/BUILD/tmp/tmpq37srwtj
PATH=/home/users/builder/GNUstep/Tools:/usr/local/bin:/usr/bin:/bin:/home/users/builder/bin
TMPDIR=/tmp/B.SpRmKI/BUILD/tmp
running install
running build
running build_py
running install_lib
creating /tmp/B.SpRmKI/BUILD/tmp/foo-0.1-root-builder/tmp
creating /tmp/B.SpRmKI/BUILD/tmp/foo-0.1-root-builder/tmp/B.SpRmKI
creating /tmp/B.SpRmKI/BUILD/tmp/foo-0.1-root-builder/tmp/B.SpRmKI/BUILD
creating /tmp/B.SpRmKI/BUILD/tmp/foo-0.1-root-builder/tmp/B.SpRmKI/BUILD/Python-3.6.3
creating /tmp/B.SpRmKI/BUILD/tmp/foo-0.1-root-builder/tmp/B.SpRmKI/BUILD/Python-3.6.3/lib
creating /tmp/B.SpRmKI/BUILD/tmp/foo-0.1-root-builder/tmp/B.SpRmKI/BUILD/Python-3.6.3/lib/python3.6
creating /tmp/B.SpRmKI/BUILD/tmp/foo-0.1-root-builder/tmp/B.SpRmKI/BUILD/Python-3.6.3/lib/python3.6/site-packages
copying build/lib/foo.py -> /tmp/B.SpRmKI/BUILD/tmp/foo-0.1-root-builder/tmp/B.SpRmKI/BUILD/Python-3.6.3/lib/python3.6/site-packages
byte-compiling /tmp/B.SpRmKI/BUILD/tmp/foo-0.1-root-builder/tmp/B.SpRmKI/BUILD/Python-3.6.3/lib/python3.6/site-packages/foo.py to foo.cpython-36.pyc
writing byte-compilation script '/tmp/B.SpRmKI/BUILD/tmp/tmp59brpw52.py'
/tmp/B.SpRmKI/BUILD/Python-3.6.3/python /tmp/B.SpRmKI/BUILD/tmp/tmp59brpw52.py
removing /tmp/B.SpRmKI/BUILD/tmp/tmp59brpw52.py
running install_egg_info
Writing /tmp/B.SpRmKI/BUILD/tmp/foo-0.1-root-builder/tmp/B.SpRmKI/BUILD/Python-3.6.3/lib/python3.6/site-packages/foo-0.1-py3.6.egg-info
writing list of installed files to 'INSTALLED_FILES'
RPM_BUILD_DIR=/tmp/B.SpRmKI/BUILD/tmp/tmpq37srwtj/foo/build/bdist.linux-i686/rpm/BUILD

Searching for shared objects with unresolved symbols... DONE
Checking /var/run <-> tmpfiles.d completeness...
 DONE
Checking script shebangs...
 DONE
Hardlink Python files: 0/2 files hardlinked
Processing files: foo-0.1-1.noarch
Checking for unpackaged file(s): /usr/lib/rpm/check-files /tmp/B.SpRmKI/BUILD/tmp/foo-0.1-root-builder
Wrote: /tmp/B.SpRmKI/BUILD/tmp/tmpq37srwtj/foo/build/bdist.linux-i686/rpm/SRPMS/foo-0.1-1.src.rpm
Wrote: /tmp/B.SpRmKI/BUILD/tmp/tmpq37srwtj/foo/build/bdist.linux-i686/rpm/RPMS/foo-0.1-1.noarch.rpm
Executing(%clean): /bin/sh -e /tmp/B.SpRmKI/BUILD/tmp/rpm-tmp.8237
Executing(--clean): /bin/sh -e /tmp/B.SpRmKI/BUILD/tmp/rpm-tmp.8237
+ umask 022
+ cd /tmp/B.SpRmKI/BUILD/tmp/tmpspg18vgj/foo/build/bdist.linux-i686/rpm/BUILD
+ cd /tmp/B.SpRmKI/BUILD/tmp/tmpspg18vgj/foo/build/bdist.linux-i686/rpm/BUILD
+ rm -rf foo-0.1
+ /usr/bin/gzip -dc /tmp/B.SpRmKI/BUILD/tmp/tmpspg18vgj/foo/build/bdist.linux-i686/rpm/SOURCES/foo-0.1.tar.gz
+ /bin/tar -xvvf -
+ STATUS=0 
+ '[' 0 -ne 0 ']'
+ cd foo-0.1
+ /bin/id -u
+ '[' 1001 '=' 0 ']'
+ /bin/id -u
+ '[' 1001 '=' 0 ']'
+ /bin/chmod -Rf a+rX,u+w,g-w,o-w .
+ exit 0
+ umask 022
+ cd /tmp/B.SpRmKI/BUILD/tmp/tmpspg18vgj/foo/build/bdist.linux-i686/rpm/BUILD
+ cd foo-0.1
+ /tmp/B.SpRmKI/BUILD/Python-3.6.3/python setup.py build
+ exit 0
+ umask 022
+ cd /tmp/B.SpRmKI/BUILD/tmp/tmpspg18vgj/foo/build/bdist.linux-i686/rpm/BUILD
+ /bin/rm '--interactive=never' -rf /tmp/B.SpRmKI/BUILD/tmp/foo-0.1-root-builder
+ /bin/mkdir -p /tmp/B.SpRmKI/BUILD/tmp/foo-0.1-root-builder
+ cd foo-0.1
+ /tmp/B.SpRmKI/BUILD/Python-3.6.3/python setup.py install -O1 '--root=/tmp/B.SpRmKI/BUILD/tmp/foo-0.1-root-builder' '--record=INSTALLED_FILES'
+ /usr/lib/rpm/find-debuginfo.sh /tmp/B.SpRmKI/BUILD/tmp/tmpspg18vgj/foo/build/bdist.linux-i686/rpm/BUILD/foo-0.1
+ __spec_install_post_strip
+ set +x
+ __spec_install_post_chrpath
+ set +x
+ __spec_install_post_compress_modules
+ set +x
+ __spec_install_post_check_so
+ set +x
+ __spec_install_post_check_tmpfiles
+ set +x
+ __spec_install_post_check_shebangs
+ set +x
+ __spec_install_post_compress_docs
+ set +x
+ __spec_install_post_py_hardlink
+ set +x
warning: Could not canonicalize hostname: nereid-builder
+ umask 022
+ cd /tmp/B.SpRmKI/BUILD/tmp/tmpspg18vgj/foo/build/bdist.linux-i686/rpm/BUILD
+ cd foo-0.1
+ /bin/rm '--interactive=never' -rf /tmp/B.SpRmKI/BUILD/tmp/foo-0.1-root-builder
+ rm -rf /tmp/B.SpRmKI/BUILD/tmp/foo-0.1-root-builder
+ umask 022
+ cd /tmp/B.SpRmKI/BUILD/tmp/tmpspg18vgj/foo/build/bdist.linux-i686/rpm/BUILD
+ rm -rf foo-0.1
+ umask 022
+ cd /tmp/B.SpRmKI/BUILD/tmp/tmpq37srwtj/foo/build/bdist.linux-i686/rpm/BUILD
+ cd /tmp/B.SpRmKI/BUILD/tmp/tmpq37srwtj/foo/build/bdist.linux-i686/rpm/BUILD
+ rm -rf foo-0.1
+ /bin/tar -xvvf -
+ /usr/bin/gzip -dc /tmp/B.SpRmKI/BUILD/tmp/tmpq37srwtj/foo/build/bdist.linux-i686/rpm/SOURCES/foo-0.1.tar.gz
+ STATUS=0 
+ '[' 0 -ne 0 ']'
+ cd foo-0.1
+ /bin/id -u
+ '[' 1001 '=' 0 ']'
+ /bin/id -u
+ '[' 1001 '=' 0 ']'
+ /bin/chmod -Rf a+rX,u+w,g-w,o-w .
+ exit 0
+ umask 022
+ cd /tmp/B.SpRmKI/BUILD/tmp/tmpq37srwtj/foo/build/bdist.linux-i686/rpm/BUILD
+ cd foo-0.1
+ /tmp/B.SpRmKI/BUILD/Python-3.6.3/python setup.py build
+ exit 0
+ umask 022
+ cd /tmp/B.SpRmKI/BUILD/tmp/tmpq37srwtj/foo/build/bdist.linux-i686/rpm/BUILD
+ /bin/rm '--interactive=never' -rf /tmp/B.SpRmKI/BUILD/tmp/foo-0.1-root-builder
+ /bin/mkdir -p /tmp/B.SpRmKI/BUILD/tmp/foo-0.1-root-builder
+ cd foo-0.1
+ /tmp/B.SpRmKI/BUILD/Python-3.6.3/python setup.py install -O1 '--root=/tmp/B.SpRmKI/BUILD/tmp/foo-0.1-root-builder' '--record=INSTALLED_FILES'
+ /usr/lib/rpm/find-debuginfo.sh /tmp/B.SpRmKI/BUILD/tmp/tmpq37srwtj/foo/build/bdist.linux-i686/rpm/BUILD/foo-0.1
+ __spec_install_post_strip
+ set +x
+ __spec_install_post_chrpath
+ set +x
+ __spec_install_post_compress_modules
+ set +x
+ __spec_install_post_check_so
+ set +x
+ __spec_install_post_check_tmpfiles
+ set +x
+ __spec_install_post_check_shebangs
+ set +x
+ __spec_install_post_compress_docs
+ set +x
+ __spec_install_post_py_hardlink
+ set +x
warning: Could not canonicalize hostname: nereid-builder
+ umask 022
+ cd /tmp/B.SpRmKI/BUILD/tmp/tmpq37srwtj/foo/build/bdist.linux-i686/rpm/BUILD
+ cd foo-0.1
+ /bin/rm '--interactive=never' -rf /tmp/B.SpRmKI/BUILD/tmp/foo-0.1-root-builder
+ rm -rf /tmp/B.SpRmKI/BUILD/tmp/foo-0.1-root-builder
+ umask 022
+ cd /tmp/B.SpRmKI/BUILD/tmp/tmpq37srwtj/foo/build/bdist.linux-i686/rpm/BUILD
+ rm -rf foo-0.1
0:00:06 load avg: 4.96 [ 34/391/1] test_sys_setprofile passed
0:00:06 load avg: 4.96 [ 35/391/1] test_genexps passed
0:00:06 load avg: 4.96 [ 36/391/1] test_string passed
0:00:06 load avg: 4.96 [ 37/391/1] test_pkgimport passed
0:00:07 load avg: 4.96 [ 38/391/1] test_imp passed
0:00:07 load avg: 4.96 [ 39/391/1] test_datetime passed
0:00:07 load avg: 4.96 [ 40/391/1] test_bufio passed
0:00:08 load avg: 4.96 [ 41/391/1] test_curses passed
0:00:08 load avg: 4.96 [ 42/391/1] test_contextlib passed
0:00:08 load avg: 4.96 [ 43/391/1] test_raise passed
0:00:08 load avg: 4.96 [ 44/391/1] test__osx_support passed
0:00:09 load avg: 4.96 [ 45/391/1] test_stringprep passed
0:00:09 load avg: 4.96 [ 46/391/1] test_runpy passed
0:00:09 load avg: 4.96 [ 47/391/1] test_dummy_thread passed
0:00:10 load avg: 4.96 [ 48/391/1] test_sax passed
0:00:10 load avg: 4.96 [ 49/391/1] test_import passed
0:00:10 load avg: 4.96 [ 50/391/1] test_urllib_response passed
0:00:10 load avg: 4.96 [ 51/391/1] test_iterlen passed
0:00:10 load avg: 4.96 [ 52/391/1] test_pulldom passed
0:00:10 load avg: 5.20 [ 53/391/1] test_property passed
0:00:10 load avg: 5.20 [ 54/391/1] test_pickle passed
0:00:11 load avg: 5.20 [ 55/391/1] test_inspect passed
0:00:11 load avg: 5.20 [ 56/391/1] test_configparser passed
0:00:12 load avg: 5.20 [ 57/391/1] test_threading_local passed
0:00:12 load avg: 5.20 [ 58/391/1] test_reprlib passed
0:00:12 load avg: 5.20 [ 59/391/1] test_http_cookiejar passed
0:00:12 load avg: 5.20 [ 60/391/1] test_call passed
0:00:12 load avg: 5.20 [ 61/391/1] test_ttk_textonly passed
0:00:12 load avg: 5.20 [ 62/391/1] test_dictviews passed
0:00:12 load avg: 5.20 [ 63/391/1] test_epoll passed
0:00:12 load avg: 5.20 [ 64/391/1] test_largefile passed
0:00:13 load avg: 5.20 [ 65/391/1] test_complex passed
0:00:13 load avg: 5.20 [ 66/391/1] test_syslog passed
0:00:14 load avg: 5.20 [ 67/391/1] test_longexp passed
0:00:14 load avg: 5.20 [ 68/391/1] test_tarfile passed
0:00:14 load avg: 5.20 [ 69/391/1] test_copy passed
0:00:14 load avg: 5.20 [ 70/391/1] test_asynchat passed
0:00:14 load avg: 5.20 [ 71/391/1] test_file passed
0:00:14 load avg: 5.20 [ 72/391/1] test_global passed
0:00:14 load avg: 5.20 [ 73/391/1] test_bisect passed
0:00:14 load avg: 5.20 [ 74/391/1] test_script_helper passed
0:00:19 load avg: 5.35 [ 75/391/1] test_ctypes passed
0:00:19 load avg: 5.35 [ 76/391/1] test_webbrowser passed
0:00:20 load avg: 5.48 [ 77/391/1] test_cmd_line_script passed
0:00:20 load avg: 5.48 [ 78/391/1] test_strtod passed
0:00:21 load avg: 5.48 [ 79/391/1] test_osx_env passed
0:00:21 load avg: 5.48 [ 80/391/1] test_crypt passed
0:00:21 load avg: 5.48 [ 81/391/1] test_ensurepip passed
0:00:22 load avg: 5.48 [ 82/391/1] test_asyncore passed
0:00:23 load avg: 5.48 [ 83/391/1] test_sqlite passed
0:00:23 load avg: 5.48 [ 84/391/1] test_zipfile passed
0:00:23 load avg: 5.48 [ 85/391/1] test_with passed
0:00:23 load avg: 5.48 [ 86/391/1] test_pow passed
0:00:23 load avg: 5.48 [ 87/391/1] test_dict passed
0:00:23 load avg: 5.48 [ 88/391/1] test_future4 passed
0:00:23 load avg: 5.48 [ 89/391/1] test_mimetypes passed
0:00:23 load avg: 5.48 [ 90/391/1] test_eintr passed
0:00:23 load avg: 5.48 [ 91/391/1] test_float passed
0:00:23 load avg: 5.48 [ 92/391/1] test_zipfile64 skipped (resource denied)
test_zipfile64 skipped -- test requires loads of disk-space bytes and a long time to run
0:00:23 load avg: 5.48 [ 93/391/1] test_codecencodings_tw passed
0:00:23 load avg: 5.48 [ 94/391/1] test_selectors passed
0:00:24 load avg: 5.48 [ 95/391/1] test_generator_stop passed
0:00:24 load avg: 5.48 [ 96/391/1] test_pathlib passed
0:00:24 load avg: 5.48 [ 97/391/1] test_tuple passed
0:00:25 load avg: 5.48 [ 98/391/1] test_ordered_dict passed
0:00:25 load avg: 5.48 [ 99/391/1] test_pyexpat passed
0:00:25 load avg: 5.48 [100/391/1] test_profile passed
0:00:25 load avg: 5.48 [101/391/1] test_exception_hierarchy passed
0:00:25 load avg: 5.48 [102/391/1] test_gc passed
0:00:25 load avg: 5.48 [103/391/1] test_doctest passed
0:00:25 load avg: 5.68 [104/391/1] test_grammar passed
0:00:25 load avg: 5.68 [105/391/1] test_atexit passed
0:00:26 load avg: 5.68 [106/391/1] test_threadsignals passed
0:00:26 load avg: 5.68 [107/391/1] test_syntax passed
0:00:26 load avg: 5.68 [108/391/1] test_asyncgen passed
0:00:26 load avg: 5.68 [109/391/1] test_dynamic passed
0:00:26 load avg: 5.68 [110/391/1] test_dbm_dumb passed
0:00:26 load avg: 5.68 [111/391/1] test_smtplib passed
0:00:27 load avg: 5.68 [112/391/1] test_base64 passed
0:00:27 load avg: 5.68 [113/391/1] test_dbm_gnu passed
0:00:27 load avg: 5.68 [114/391/1] test_structseq passed
0:00:27 load avg: 5.68 [115/391/1] test_hash passed
0:00:27 load avg: 5.68 [116/391/1] test_plistlib passed
0:00:27 load avg: 5.68 [117/391/1] test_ttk_guionly skipped (resource denied)
test_ttk_guionly skipped -- Use of the 'gui' resource not enabled
0:00:27 load avg: 5.68 [118/391/1] test_codeccallbacks passed
0:00:28 load avg: 5.68 [119/391/1] test_shutil passed
0:00:28 load avg: 5.68 [120/391/1] test_parser passed
0:00:28 load avg: 5.68 [121/391/1] test_py_compile passed
0:00:28 load avg: 5.68 [122/391/1] test_code passed
0:00:28 load avg: 5.68 [123/391/1] test_string_literals passed
0:00:28 load avg: 5.68 [124/391/1] test_tcl passed
0:00:28 load avg: 5.68 [125/391/1] test_csv passed
0:00:29 load avg: 5.68 [126/391/1] test_charmapcodec passed
0:00:29 load avg: 5.68 [127/391/1] test_decorators passed
0:00:29 load avg: 5.68 [128/391/1] test_compileall passed
0:00:29 load avg: 5.68 [129/391/1] test_defaultdict passed
0:00:29 load avg: 5.68 [130/391/1] test_codecencodings_kr passed
0:00:31 load avg: 6.11 [131/391/1] test_zipimport_support passed -- running: test_mailbox (31 sec)
0:00:31 load avg: 6.11 [132/391/1] test_sundry passed -- running: test_mailbox (31 sec)
0:00:31 load avg: 6.11 [133/391/1] test_mailcap passed -- running: test_mailbox (31 sec), test_tools (30 sec)
0:00:31 load avg: 6.11 [134/391/1] test_idle passed -- running: test_mailbox (32 sec), test_tools (30 sec)
0:00:31 load avg: 6.11 [135/391/1] test_unicodedata passed -- running: test_lib2to3 (30 sec), test_mailbox (32 sec), test_tools (30 sec)
0:00:31 load avg: 6.11 [136/391/1] test_wsgiref passed -- running: test_lib2to3 (30 sec), test_mailbox (32 sec), test_tools (30 sec)
0:00:31 load avg: 6.11 [137/391/1] test_wait4 passed -- running: test_lib2to3 (30 sec), test_mailbox (32 sec), test_tools (30 sec)
0:00:31 load avg: 6.11 [138/391/1] test_index passed -- running: test_lib2to3 (30 sec), test_mailbox (32 sec), test_tools (31 sec)
0:00:32 load avg: 6.11 [139/391/1] test_symtable passed -- running: test_lib2to3 (30 sec), test_mailbox (32 sec), test_tools (31 sec)
0:00:32 load avg: 6.11 [140/391/1] test_httplib passed -- running: test_lib2to3 (30 sec), test_mailbox (32 sec), test_tools (31 sec)
Resource 'self-signed.pythontest.net' is not available
Resource 'self-signed.pythontest.net' is not available
Resource 'self-signed.pythontest.net' is not available
Resource 'self-signed.pythontest.net' is not available
Resource 'www.python.org' is not available
0:00:32 load avg: 6.11 [141/391/1] test_aifc passed -- running: test_lib2to3 (31 sec), test_mailbox (32 sec), test_tools (31 sec)
0:00:32 load avg: 6.11 [142/391/1] test_strptime passed -- running: test_lib2to3 (31 sec), test_mailbox (32 sec), test_tools (31 sec)
0:00:32 load avg: 6.11 [143/391/1] test_telnetlib passed -- running: test_lib2to3 (31 sec), test_mailbox (33 sec), test_tools (31 sec)
0:00:33 load avg: 6.11 [144/391/1] test___all__ passed -- running: test_lib2to3 (32 sec), test_mailbox (34 sec), test_tools (32 sec)
0:00:34 load avg: 6.11 [145/391/1] test_file_eintr passed -- running: test_lib2to3 (33 sec), test_mailbox (35 sec), test_tools (33 sec)
0:00:36 load avg: 6.34 [146/391/1] test_poplib passed -- running: test_lib2to3 (34 sec), test_mailbox (36 sec), test_tools (35 sec)
0:00:36 load avg: 6.34 [147/391/1] test_bz2 passed -- running: test_multiprocessing_forkserver (31 sec), test_lib2to3 (35 sec), test_mailbox (37 sec), test_tools (36 sec)
0:00:37 load avg: 6.34 [148/391/1] test_traceback passed -- running: test_multiprocessing_forkserver (31 sec), test_lib2to3 (35 sec), test_mailbox (37 sec), test_tools (36 sec)
0:00:37 load avg: 6.34 [149/391/1] test_ntpath passed -- running: test_multiprocessing_forkserver (31 sec), test_lib2to3 (36 sec), test_mailbox (37 sec), test_tools (36 sec)
0:00:37 load avg: 6.34 [150/391/1] test_gzip passed -- running: test_multiprocessing_forkserver (32 sec), test_lib2to3 (36 sec), test_mailbox (38 sec), test_tools (36 sec)
0:00:37 load avg: 6.34 [151/391/1] test_collections passed -- running: test_multiprocessing_forkserver (32 sec), test_lib2to3 (36 sec), test_mailbox (38 sec), test_tools (37 sec)
0:00:39 load avg: 6.34 [152/391/1] test_tracemalloc passed -- running: test_multiprocessing_forkserver (33 sec), test_lib2to3 (37 sec), test_mailbox (39 sec), test_tools (38 sec)
0:00:39 load avg: 6.34 [153/391/1] test_future5 passed -- running: test_multiprocessing_forkserver (33 sec), test_lib2to3 (38 sec), test_mailbox (39 sec), test_tools (38 sec)
0:00:39 load avg: 6.34 [154/391/1] test_linecache passed -- running: test_multiprocessing_forkserver (33 sec), test_lib2to3 (38 sec), test_mailbox (40 sec), test_tools (38 sec)
0:00:40 load avg: 6.39 [155/391/1] test_zlib passed -- running: test_multiprocessing_forkserver (35 sec), test_lib2to3 (39 sec), test_mailbox (41 sec), test_tools (40 sec)
0:00:41 load avg: 6.39 [156/391/1] test_quopri passed -- running: test_multiprocessing_forkserver (35 sec), test_lib2to3 (40 sec), test_mailbox (41 sec), test_tools (40 sec)
0:00:41 load avg: 6.39 [157/391/1] test_genericpath passed -- running: test_multiprocessing_forkserver (35 sec), test_lib2to3 (40 sec), test_mailbox (41 sec), test_tools (40 sec)
0:00:42 load avg: 6.39 [158/391/1] test_decimal passed -- running: test_multiprocessing_forkserver (36 sec), test_lib2to3 (40 sec), test_mailbox (42 sec), test_tools (41 sec)
0:00:42 load avg: 6.39 [159/391/1] test_iter passed -- running: test_multiprocessing_forkserver (36 sec), test_lib2to3 (41 sec), test_mailbox (42 sec), test_tools (41 sec)
0:00:42 load avg: 6.39 [160/391/1] test_colorsys passed -- running: test_multiprocessing_forkserver (36 sec), test_lib2to3 (41 sec), test_mailbox (42 sec), test_tools (41 sec)
0:00:42 load avg: 6.39 [161/391/1] test_ipaddress passed -- running: test_multiprocessing_forkserver (37 sec), test_lib2to3 (41 sec), test_mailbox (43 sec), test_tools (41 sec)
0:00:43 load avg: 6.39 [162/391/1] test_htmlparser passed -- running: test_multiprocessing_forkserver (37 sec), test_lib2to3 (41 sec), test_mailbox (43 sec), test_tools (42 sec)
0:00:43 load avg: 6.39 [163/391/1] test_http_cookies passed -- running: test_multiprocessing_forkserver (37 sec), test_lib2to3 (42 sec), test_mailbox (43 sec), test_tools (42 sec)
0:00:43 load avg: 6.39 [164/391/1] test_smtpnet passed -- running: test_multiprocessing_forkserver (37 sec), test_lib2to3 (42 sec), test_mailbox (44 sec), test_tools (42 sec)
Resource 'smtp.gmail.com' is not available
Resource 'smtp.gmail.com' is not available
Resource 'smtp.gmail.com' is not available
Resource 'smtp.gmail.com' is not available
Resource 'smtp.gmail.com' is not available
0:00:43 load avg: 6.39 [165/391/1] test_listcomps passed -- running: test_multiprocessing_forkserver (38 sec), test_lib2to3 (42 sec), test_mailbox (44 sec), test_tools (42 sec)
0:00:44 load avg: 6.39 [166/391/1] test_dict_version passed -- running: test_multiprocessing_forkserver (38 sec), test_lib2to3 (42 sec), test_mailbox (44 sec), test_tools (43 sec)
0:00:44 load avg: 6.39 [167/391/1] test_email passed -- running: test_multiprocessing_forkserver (39 sec), test_lib2to3 (43 sec), test_mailbox (45 sec), test_tools (43 sec)
0:00:44 load avg: 6.39 [168/391/1] test_thread passed -- running: test_multiprocessing_forkserver (39 sec), test_lib2to3 (43 sec), test_mailbox (45 sec), test_tools (44 sec)
0:00:45 load avg: 6.39 [169/391/1] test_importlib passed -- running: test_multiprocessing_forkserver (39 sec), test_lib2to3 (44 sec), test_mailbox (46 sec), test_tools (44 sec)
0:00:48 load avg: 6.44 [170/391/1] test_userstring passed -- running: test_multiprocessing_forkserver (42 sec), test_lib2to3 (46 sec), test_mailbox (48 sec), test_tools (47 sec)
0:00:48 load avg: 6.44 [171/391/1] test_calendar passed -- running: test_multiprocessing_forkserver (42 sec), test_lib2to3 (47 sec), test_mailbox (48 sec), test_tools (47 sec)
0:00:50 load avg: 6.97 [172/391/1] test_wait3 passed -- running: test_multiprocessing_forkserver (45 sec), test_lib2to3 (49 sec), test_mailbox (51 sec), test_tools (50 sec)
0:00:54 load avg: 6.97 [173/391/1] test_tools passed (53 sec) -- running: test_multiprocessing_forkserver (49 sec), test_lib2to3 (53 sec), test_mailbox (55 sec)
0:01:00 load avg: 7.69 [174/391/1] test_faulthandler passed -- running: test_multiprocessing_forkserver (54 sec), test_lib2to3 (59 sec), test_mailbox (60 sec), test_io (34 sec)
0:01:00 load avg: 7.69 [175/391/1] test_startfile skipped -- running: test_multiprocessing_forkserver (54 sec), test_lib2to3 (59 sec), test_mailbox (60 sec), test_io (34 sec)
test_startfile skipped -- object <module 'os' from '/tmp/B.SpRmKI/BUILD/Python-3.6.3/Lib/os.py'> has no attribute 'startfile'
0:01:00 load avg: 7.69 [176/391/1] test_int_literal passed -- running: test_multiprocessing_forkserver (54 sec), test_lib2to3 (59 sec), test_mailbox (60 sec), test_io (34 sec)
0:01:00 load avg: 7.69 [177/391/1] test_macurl2path passed -- running: test_multiprocessing_forkserver (54 sec), test_lib2to3 (59 sec), test_mailbox (60 sec), test_io (34 sec)
0:01:00 load avg: 7.69 [178/391/1] test_rlcompleter passed -- running: test_multiprocessing_forkserver (54 sec), test_lib2to3 (59 sec), test_mailbox (60 sec), test_io (34 sec)
0:01:00 load avg: 7.71 [179/391/1] test_getpass passed -- running: test_multiprocessing_forkserver (55 sec), test_lib2to3 (59 sec), test_mailbox (61 sec), test_io (34 sec)
0:01:00 load avg: 7.71 [180/391/1] test_posixpath passed -- running: test_multiprocessing_forkserver (55 sec), test_lib2to3 (59 sec), test_mailbox (61 sec), test_io (34 sec)
0:01:00 load avg: 7.71 [181/391/1] test_support passed -- running: test_multiprocessing_forkserver (55 sec), test_lib2to3 (59 sec), test_mailbox (61 sec), test_io (34 sec)
0:01:00 load avg: 7.71 [182/391/1] test_bigmem passed -- running: test_multiprocessing_forkserver (55 sec), test_lib2to3 (59 sec), test_mailbox (61 sec), test_io (34 sec)
0:01:01 load avg: 7.71 [183/391/1] test_wave passed -- running: test_multiprocessing_forkserver (55 sec), test_lib2to3 (59 sec), test_mailbox (61 sec), test_io (35 sec)
0:01:02 load avg: 7.71 [184/391/1] test_urllib passed -- running: test_multiprocessing_forkserver (56 sec), test_lib2to3 (61 sec), test_mailbox (63 sec), test_io (36 sec)
0:01:02 load avg: 7.71 [185/391/1] test_zipimport passed -- running: test_multiprocessing_forkserver (57 sec), test_lib2to3 (61 sec), test_mailbox (63 sec), test_io (36 sec)
0:01:02 load avg: 7.71 [186/391/1] test_dynamicclassattribute passed -- running: test_multiprocessing_forkserver (57 sec), test_lib2to3 (61 sec), test_mailbox (63 sec), test_io (36 sec)
0:01:02 load avg: 7.71 [187/391/1] test_richcmp passed -- running: test_multiprocessing_forkserver (57 sec), test_lib2to3 (61 sec), test_mailbox (63 sec), test_io (36 sec)
0:01:03 load avg: 7.71 [188/391/1] test_pipes passed -- running: test_multiprocessing_forkserver (57 sec), test_lib2to3 (61 sec), test_mailbox (63 sec), test_io (37 sec)
0:01:03 load avg: 7.71 [189/391/1] test_fnmatch passed -- running: test_multiprocessing_forkserver (57 sec), test_lib2to3 (62 sec), test_mailbox (63 sec), test_io (37 sec)
0:01:03 load avg: 7.71 [190/391/1] test_pickletools passed -- running: test_multiprocessing_forkserver (57 sec), test_lib2to3 (62 sec), test_mailbox (63 sec), test_io (37 sec)
0:01:03 load avg: 7.71 [191/391/1] test_grp passed -- running: test_multiprocessing_forkserver (57 sec), test_lib2to3 (62 sec), test_mailbox (63 sec), test_io (37 sec)
0:01:03 load avg: 7.71 [192/391/1] test_tk skipped (resource denied) -- running: test_multiprocessing_forkserver (57 sec), test_lib2to3 (62 sec), test_mailbox (63 sec), test_io (37 sec)
test_tk skipped -- Use of the 'gui' resource not enabled
0:01:03 load avg: 7.71 [193/391/1] test_augassign passed -- running: test_multiprocessing_forkserver (58 sec), test_lib2to3 (62 sec), test_mailbox (64 sec), test_io (37 sec)
0:01:04 load avg: 7.71 [194/391/1] test_pdb passed -- running: test_multiprocessing_forkserver (58 sec), test_lib2to3 (62 sec), test_mailbox (64 sec), test_io (38 sec)
0:01:04 load avg: 7.71 [195/391/1] test_struct passed -- running: test_multiprocessing_forkserver (59 sec), test_lib2to3 (63 sec), test_mailbox (65 sec), test_io (38 sec)
0:01:05 load avg: 7.71 [196/391/1] test_itertools passed -- running: test_multiprocessing_forkserver (59 sec), test_lib2to3 (64 sec), test_mailbox (65 sec), test_io (39 sec)
0:01:05 load avg: 7.71 [197/391/1] test_mailbox passed (65 sec) -- running: test_multiprocessing_forkserver (59 sec), test_lib2to3 (64 sec), test_io (39 sec)
0:01:05 load avg: 7.71 [198/391/1] test_keywordonlyarg passed -- running: test_multiprocessing_forkserver (59 sec), test_lib2to3 (64 sec), test_io (39 sec)
0:01:05 load avg: 7.71 [199/391/1] test_math passed -- running: test_multiprocessing_forkserver (59 sec), test_lib2to3 (64 sec), test_io (39 sec)
0:01:05 load avg: 7.66 [200/391/1] test_sysconfig passed -- running: test_multiprocessing_forkserver (60 sec), test_lib2to3 (64 sec), test_io (39 sec)
0:01:05 load avg: 7.66 [201/391/1] test_abstract_numbers passed -- running: test_multiprocessing_forkserver (60 sec), test_lib2to3 (64 sec), test_io (39 sec)
0:01:06 load avg: 7.66 [202/391/1] test_urllib2net passed -- running: test_multiprocessing_forkserver (60 sec), test_lib2to3 (64 sec), test_io (40 sec)
Resource 'http://www.example.com/' is not available
Resource 'http://www.example.com' is not available
Resource 'ftp://www.pythontest.net/README' is not available
Resource 'http://www.pythontest.net/redir/with_frag/' is not available
Resource 'http://www.imdb.com' is not available
Resource 'http://www.pythontest.net/index.html#frag' is not available
Resource 'ftp://www.pythontest.net/' is not available
Resource 'ftp://www.pythontest.net/' is not available
Resource 'ftp://www.pythontest.net/' is not available
Resource 'ftp://www.pythontest.net/' is not available
Resource 'http://www.example.com' is not available
Resource 'http://www.example.com' is not available
Resource 'http://www.example.com' is not available
Resource 'http://www.example.com' is not available
0:01:06 load avg: 7.66 [203/391/1] test_xmlrpc_net passed -- running: test_multiprocessing_forkserver (60 sec), test_lib2to3 (65 sec), test_io (40 sec)
0:01:06 load avg: 7.66 [204/391/1] test_cmd_line passed -- running: test_multiprocessing_forkserver (60 sec), test_lib2to3 (65 sec), test_io (40 sec)
0:01:06 load avg: 7.66 [205/391/1] test_future3 passed -- running: test_multiprocessing_forkserver (60 sec), test_lib2to3 (65 sec), test_io (40 sec)
0:01:06 load avg: 7.66 [206/391/1] test_future passed -- running: test_multiprocessing_forkserver (61 sec), test_lib2to3 (65 sec), test_io (40 sec)
0:01:06 load avg: 7.66 [207/391/1] test_getopt passed -- running: test_multiprocessing_forkserver (61 sec), test_lib2to3 (65 sec), test_io (40 sec)
0:01:06 load avg: 7.66 [208/391/1] test_codecencodings_cn passed -- running: test_multiprocessing_forkserver (61 sec), test_lib2to3 (65 sec), test_io (40 sec)
0:01:07 load avg: 7.66 [209/391/1] test_scope passed -- running: test_multiprocessing_forkserver (61 sec), test_lib2to3 (65 sec), test_io (41 sec)
0:01:07 load avg: 7.66 [210/391/1] test_turtle passed -- running: test_multiprocessing_forkserver (61 sec), test_lib2to3 (66 sec), test_io (41 sec)
0:01:07 load avg: 7.66 [211/391/1] test_audioop passed -- running: test_multiprocessing_forkserver (61 sec), test_lib2to3 (66 sec), test_io (41 sec)
0:01:07 load avg: 7.66 [212/391/1] test_random passed -- running: test_multiprocessing_forkserver (61 sec), test_lib2to3 (66 sec), test_io (41 sec)
0:01:07 load avg: 7.66 [213/391/1] test_popen passed -- running: test_multiprocessing_forkserver (62 sec), test_concurrent_futures (30 sec), test_lib2to3 (66 sec), test_io (41 sec)
0:01:07 load avg: 7.66 [214/391/1] test_winconsoleio skipped -- running: test_multiprocessing_forkserver (62 sec), test_concurrent_futures (30 sec), test_lib2to3 (66 sec), test_io (41 sec)
test_winconsoleio skipped -- test only relevant on win32
0:01:08 load avg: 7.66 [215/391/1] test_cmd passed -- running: test_multiprocessing_forkserver (62 sec), test_concurrent_futures (30 sec), test_lib2to3 (66 sec), test_io (42 sec)
0:01:08 load avg: 7.66 [216/391/1] test_html passed -- running: test_multiprocessing_forkserver (62 sec), test_concurrent_futures (31 sec), test_lib2to3 (67 sec), test_io (42 sec)
0:01:08 load avg: 7.66 [217/391/1] test_lib2to3 passed (66 sec) -- running: test_multiprocessing_forkserver (62 sec), test_concurrent_futures (31 sec), test_io (42 sec)
0:01:08 load avg: 7.66 [218/391/1] test_smtpd passed -- running: test_multiprocessing_forkserver (62 sec), test_concurrent_futures (31 sec), test_io (42 sec)
0:01:08 load avg: 7.66 [219/391/1] test_isinstance passed -- running: test_multiprocessing_forkserver (62 sec), test_concurrent_futures (31 sec), test_io (42 sec)
0:01:08 load avg: 7.66 [220/391/1] test_re passed -- running: test_multiprocessing_forkserver (62 sec), test_concurrent_futures (31 sec), test_io (42 sec)
0:01:08 load avg: 7.66 [221/391/1] test_exception_variations passed -- running: test_multiprocessing_forkserver (63 sec), test_concurrent_futures (31 sec), test_io (42 sec)
0:01:08 load avg: 7.66 [222/391/1] test_ioctl skipped -- running: test_multiprocessing_forkserver (63 sec), test_concurrent_futures (31 sec), test_io (42 sec)
test_ioctl skipped -- Unable to open /dev/tty
0:01:09 load avg: 7.66 [223/391/1] test_gettext passed -- running: test_multiprocessing_forkserver (63 sec), test_concurrent_futures (31 sec), test_io (43 sec)
0:01:09 load avg: 7.66 [224/391/1] test_fileinput passed -- running: test_multiprocessing_forkserver (63 sec), test_concurrent_futures (31 sec), test_io (43 sec)
0:01:09 load avg: 7.66 [225/391/1] test_compare passed -- running: test_multiprocessing_forkserver (63 sec), test_concurrent_futures (32 sec), test_io (43 sec)
0:01:09 load avg: 7.66 [226/391/1] test_weakset passed -- running: test_multiprocessing_forkserver (63 sec), test_concurrent_futures (32 sec), test_io (43 sec)
0:01:09 load avg: 7.66 [227/391/1] test_exceptions passed -- running: test_multiprocessing_forkserver (64 sec), test_concurrent_futures (32 sec), test_io (43 sec)
0:01:09 load avg: 7.66 [228/391/1] test_copyreg passed -- running: test_multiprocessing_forkserver (64 sec), test_concurrent_futures (32 sec), test_io (43 sec)
0:01:10 load avg: 7.66 [229/391/1] test_weakref passed -- running: test_multiprocessing_forkserver (64 sec), test_concurrent_futures (32 sec), test_io (44 sec)
0:01:10 load avg: 7.66 [230/391/1] test_utf8source passed -- running: test_multiprocessing_forkserver (64 sec), test_concurrent_futures (33 sec), test_io (44 sec)
0:01:10 load avg: 7.66 [231/391/1] test_generators passed -- running: test_multiprocessing_forkserver (64 sec), test_concurrent_futures (33 sec), test_io (44 sec)
0:01:10 load avg: 7.66 [232/391/1] test_xdrlib passed -- running: test_multiprocessing_forkserver (64 sec), test_concurrent_futures (33 sec), test_io (44 sec)
0:01:10 load avg: 7.66 [233/391/1] test_bytes passed -- running: test_multiprocessing_forkserver (64 sec), test_concurrent_futures (33 sec), test_io (44 sec)
0:01:10 load avg: 7.36 [234/391/1] test_class passed -- running: test_multiprocessing_forkserver (65 sec), test_concurrent_futures (33 sec), test_io (44 sec)
0:01:10 load avg: 7.36 [235/391/1] test_threadedtempfile passed -- running: test_multiprocessing_forkserver (65 sec), test_concurrent_futures (33 sec), test_io (44 sec)
0:01:10 load avg: 7.36 [236/391/1] test_unary passed -- running: test_multiprocessing_forkserver (65 sec), test_concurrent_futures (33 sec), test_io (45 sec)
0:01:11 load avg: 7.36 [237/391/1] test_array passed -- running: test_multiprocessing_forkserver (66 sec), test_concurrent_futures (34 sec), test_io (45 sec)
0:01:11 load avg: 7.36 [238/391/1] test_uu passed -- running: test_multiprocessing_forkserver (66 sec), test_concurrent_futures (34 sec), test_io (45 sec)
0:01:12 load avg: 7.36 [239/391/1] test_asdl_parser passed -- running: test_multiprocessing_forkserver (66 sec), test_concurrent_futures (34 sec), test_io (46 sec)
0:01:12 load avg: 7.36 [240/391/1] test_source_encoding passed -- running: test_multiprocessing_forkserver (67 sec), test_concurrent_futures (35 sec), test_io (46 sec)
0:01:12 load avg: 7.36 [241/391/1] test_xmlrpc passed -- running: test_multiprocessing_forkserver (67 sec), test_concurrent_futures (35 sec), test_io (46 sec)
0:01:13 load avg: 7.36 [242/391/1] test_uuid passed -- running: test_multiprocessing_forkserver (67 sec), test_concurrent_futures (35 sec), test_io (47 sec)
0:01:13 load avg: 7.36 [243/391/1] test_frame passed -- running: test_multiprocessing_forkserver (67 sec), test_concurrent_futures (36 sec), test_io (47 sec)
0:01:14 load avg: 7.36 [244/391/1] test_json passed -- running: test_multiprocessing_forkserver (68 sec), test_concurrent_futures (36 sec), test_io (48 sec)
0:01:14 load avg: 7.36 [245/391/1] test_tempfile passed -- running: test_multiprocessing_forkserver (68 sec), test_concurrent_futures (37 sec), test_io (48 sec)
0:01:14 load avg: 7.36 [246/391/1] test_fileio passed -- running: test_multiprocessing_forkserver (68 sec), test_concurrent_futures (37 sec), test_io (48 sec)
0:01:14 load avg: 7.36 [247/391/1] test_optparse passed -- running: test_multiprocessing_forkserver (68 sec), test_concurrent_futures (37 sec), test_io (48 sec)
0:01:14 load avg: 7.36 [248/391/1] test_contains passed -- running: test_multiprocessing_forkserver (68 sec), test_concurrent_futures (37 sec), test_io (48 sec)
0:01:14 load avg: 7.36 [249/391/1] test_setcomps passed -- running: test_multiprocessing_forkserver (69 sec), test_concurrent_futures (37 sec), test_io (48 sec)
0:01:14 load avg: 7.36 [250/391/1] test_ast passed -- running: test_multiprocessing_forkserver (69 sec), test_concurrent_futures (37 sec), test_io (48 sec)
0:01:14 load avg: 7.36 [251/391/1] test_pkg passed -- running: test_multiprocessing_forkserver (69 sec), test_concurrent_futures (37 sec), test_io (48 sec)
0:01:15 load avg: 7.36 [252/391/1] test_dictcomps passed -- running: test_multiprocessing_forkserver (69 sec), test_concurrent_futures (37 sec), test_io (49 sec)
0:01:15 load avg: 7.36 [253/391/1] test_sndhdr passed -- running: test_multiprocessing_forkserver (69 sec), test_concurrent_futures (38 sec), test_io (49 sec)
0:01:15 load avg: 7.36 [254/391/1] test_venv passed -- running: test_multiprocessing_forkserver (69 sec), test_concurrent_futures (38 sec), test_io (49 sec)
0:01:15 load avg: 7.36 [255/391/1] test_platform passed -- running: test_multiprocessing_forkserver (69 sec), test_concurrent_futures (38 sec), test_io (49 sec)
0:01:15 load avg: 7.36 [256/391/1] test_pstats passed -- running: test_multiprocessing_forkserver (69 sec), test_concurrent_futures (38 sec), test_io (49 sec)
0:01:15 load avg: 7.42 [257/391/1] test_shelve passed -- running: test_multiprocessing_forkserver (70 sec), test_concurrent_futures (38 sec), test_io (49 sec)
0:01:15 load avg: 7.42 [258/391/1] test_codecmaps_hk passed -- running: test_multiprocessing_forkserver (70 sec), test_concurrent_futures (38 sec), test_io (49 sec)
0:01:15 load avg: 7.42 [259/391/1] test_pprint passed -- running: test_multiprocessing_forkserver (70 sec), test_concurrent_futures (38 sec), test_io (49 sec)
0:01:16 load avg: 7.42 [260/391/1] test_long passed -- running: test_multiprocessing_forkserver (70 sec), test_concurrent_futures (39 sec), test_io (50 sec)
0:01:16 load avg: 7.42 [261/391/1] test_codeop passed -- running: test_multiprocessing_forkserver (70 sec), test_concurrent_futures (39 sec), test_io (50 sec)
0:01:16 load avg: 7.42 [262/391/1] test_time passed -- running: test_multiprocessing_forkserver (71 sec), test_concurrent_futures (39 sec), test_io (50 sec)
0:01:16 load avg: 7.42 [263/391/1] test_dummy_threading passed -- running: test_multiprocessing_forkserver (71 sec), test_concurrent_futures (39 sec), test_io (50 sec)
0:01:16 load avg: 7.42 [264/391/1] test_fcntl passed -- running: test_multiprocessing_forkserver (71 sec), test_concurrent_futures (39 sec), test_io (50 sec)
0:01:16 load avg: 7.42 [265/391/1] test_codecmaps_cn passed -- running: test_multiprocessing_forkserver (71 sec), test_concurrent_futures (39 sec), test_io (50 sec)
0:01:17 load avg: 7.42 [266/391/1] test_tix skipped (resource denied) -- running: test_multiprocessing_forkserver (71 sec), test_concurrent_futures (39 sec), test_io (51 sec)
test_tix skipped -- Use of the 'gui' resource not enabled
0:01:17 load avg: 7.42 [267/391/1] test_sys passed -- running: test_multiprocessing_forkserver (71 sec), test_concurrent_futures (40 sec), test_io (51 sec)
0:01:17 load avg: 7.42 [268/391/1] test_warnings passed -- running: test_multiprocessing_forkserver (71 sec), test_concurrent_futures (40 sec), test_io (51 sec)
0:01:17 load avg: 7.42 [269/391/1] test_filecmp passed -- running: test_multiprocessing_forkserver (71 sec), test_concurrent_futures (40 sec), test_io (51 sec)
0:01:17 load avg: 7.42 [270/391/1] test_extcall passed -- running: test_multiprocessing_forkserver (72 sec), test_concurrent_futures (40 sec), test_io (51 sec)
0:01:17 load avg: 7.42 [271/391/1] test_imaplib passed -- running: test_multiprocessing_forkserver (72 sec), test_concurrent_futures (40 sec), test_io (51 sec)
Resource 'cyrus.andrew.cmu.edu' is not available
Resource 'cyrus.andrew.cmu.edu' is not available
Resource 'cyrus.andrew.cmu.edu' is not available
Resource 'cyrus.andrew.cmu.edu' is not available
Resource 'cyrus.andrew.cmu.edu' is not available
Resource 'cyrus.andrew.cmu.edu' is not available
0:01:18 load avg: 7.42 [272/391/1] test_binop passed -- running: test_multiprocessing_forkserver (72 sec), test_concurrent_futures (40 sec), test_io (52 sec)
0:01:18 load avg: 7.42 [273/391/1] test_codecencodings_iso2022 passed -- running: test_multiprocessing_forkserver (72 sec), test_concurrent_futures (40 sec), test_io (52 sec)
0:01:18 load avg: 7.42 [274/391/1] test_typing passed -- running: test_multiprocessing_forkserver (72 sec), test_concurrent_futures (40 sec), test_io (52 sec)
0:01:18 load avg: 7.42 [275/391/1] test_statistics passed -- running: test_multiprocessing_forkserver (72 sec), test_concurrent_futures (41 sec), test_io (52 sec)
0:01:18 load avg: 7.42 [276/391/1] test_modulefinder passed -- running: test_multiprocessing_forkserver (72 sec), test_concurrent_futures (41 sec), test_io (52 sec)
0:01:18 load avg: 7.42 [277/391/1] test_unittest passed -- running: test_multiprocessing_forkserver (73 sec), test_concurrent_futures (41 sec), test_io (52 sec)
0:01:19 load avg: 7.42 [278/391/1] test_timeout passed -- running: test_multiprocessing_forkserver (74 sec), test_concurrent_futures (42 sec), test_io (53 sec)
Resource 'www.python.org.' is not available
Resource 'www.python.org.' is not available
Resource 'www.python.org.' is not available
Resource 'www.python.org.' is not available
Resource 'www.python.org.' is not available
Resource 'www.python.org.' is not available
/tmp/B.SpRmKI/BUILD/Python-3.6.3/Lib/test/support/__init__.py:1508: ResourceWarning: unclosed <socket.socket fd=4, family=AddressFamily.AF_INET, type=SocketKind.SOCK_STREAM, proto=0, laddr=('0.0.0.0', 0)>
  gc.collect()
/tmp/B.SpRmKI/BUILD/Python-3.6.3/Lib/test/support/__init__.py:1508: ResourceWarning: unclosed <socket.socket fd=5, family=AddressFamily.AF_INET, type=SocketKind.SOCK_STREAM, proto=0, laddr=('0.0.0.0', 0)>
  gc.collect()
/tmp/B.SpRmKI/BUILD/Python-3.6.3/Lib/test/support/__init__.py:1508: ResourceWarning: unclosed <socket.socket fd=6, family=AddressFamily.AF_INET, type=SocketKind.SOCK_STREAM, proto=0, laddr=('0.0.0.0', 0)>
  gc.collect()
/tmp/B.SpRmKI/BUILD/Python-3.6.3/Lib/test/support/__init__.py:1508: ResourceWarning: unclosed <socket.socket fd=7, family=AddressFamily.AF_INET, type=SocketKind.SOCK_STREAM, proto=0, laddr=('0.0.0.0', 0)>
  gc.collect()
/tmp/B.SpRmKI/BUILD/Python-3.6.3/Lib/test/support/__init__.py:1508: ResourceWarning: unclosed <socket.socket fd=8, family=AddressFamily.AF_INET, type=SocketKind.SOCK_STREAM, proto=0, laddr=('0.0.0.0', 0)>
  gc.collect()
/tmp/B.SpRmKI/BUILD/Python-3.6.3/Lib/test/support/__init__.py:1508: ResourceWarning: unclosed <socket.socket fd=3, family=AddressFamily.AF_INET, type=SocketKind.SOCK_STREAM, proto=0, laddr=('0.0.0.0', 0)>
  gc.collect()
0:01:20 load avg: 7.42 [279/391/1] test_macpath passed -- running: test_multiprocessing_forkserver (74 sec), test_concurrent_futures (42 sec), test_io (54 sec)
0:01:20 load avg: 7.42 [280/391/1] test_stat passed -- running: test_multiprocessing_forkserver (74 sec), test_concurrent_futures (43 sec), test_io (54 sec)
0:01:20 load avg: 7.42 [281/391/1] test_dbm passed -- running: test_multiprocessing_forkserver (74 sec), test_concurrent_futures (43 sec), test_io (54 sec)
0:01:20 load avg: 7.42 [282/391/1] test_argparse passed -- running: test_multiprocessing_forkserver (74 sec), test_concurrent_futures (43 sec), test_io (54 sec)
0:01:20 load avg: 7.42 [283/391/1] test_cgi passed -- running: test_multiprocessing_forkserver (74 sec), test_concurrent_futures (43 sec), test_io (54 sec)
0:01:20 load avg: 7.22 [284/391/1] test_symbol passed -- running: test_multiprocessing_forkserver (75 sec), test_concurrent_futures (43 sec), test_io (54 sec)
0:01:20 load avg: 7.22 [285/391/1] test_unicode_identifiers passed -- running: test_multiprocessing_forkserver (75 sec), test_concurrent_futures (43 sec), test_io (54 sec)
0:01:21 load avg: 7.22 [286/391/1] test__opcode passed -- running: test_multiprocessing_forkserver (75 sec), test_concurrent_futures (43 sec), test_io (55 sec)
0:01:21 load avg: 7.22 [287/391/1] test_socketserver passed -- running: test_multiprocessing_forkserver (75 sec), test_concurrent_futures (44 sec), test_io (55 sec)
0:01:21 load avg: 7.22 [288/391/1] test_cmath passed -- running: test_multiprocessing_forkserver (75 sec), test_concurrent_futures (44 sec), test_io (55 sec)
0:01:22 load avg: 7.22 [289/391/1] test_heapq passed -- running: test_multiprocessing_forkserver (76 sec), test_concurrent_futures (45 sec), test_io (56 sec)
0:01:23 load avg: 7.22 [290/391/1] test_builtin passed -- running: test_multiprocessing_forkserver (77 sec), test_concurrent_futures (45 sec), test_io (57 sec)
0:01:23 load avg: 7.22 [291/391/1] test_enumerate passed -- running: test_multiprocessing_forkserver (77 sec), test_concurrent_futures (46 sec), test_io (57 sec)
0:01:23 load avg: 7.22 [292/391/1] test_marshal passed -- running: test_multiprocessing_forkserver (78 sec), test_concurrent_futures (46 sec), test_io (57 sec)
0:01:24 load avg: 7.22 [293/391/1] test_fstring passed -- running: test_multiprocessing_forkserver (78 sec), test_concurrent_futures (47 sec), test_io (58 sec)
0:01:24 load avg: 7.22 [294/391/1] test_timeit passed -- running: test_multiprocessing_forkserver (78 sec), test_concurrent_futures (47 sec), test_io (58 sec)
0:01:25 load avg: 7.22 [295/391/1] test_lzma passed -- running: test_multiprocessing_forkserver (79 sec), test_concurrent_futures (48 sec), test_io (59 sec)
0:01:25 load avg: 7.22 [296/391/1] test_multiprocessing_forkserver passed (79 sec) -- running: test_concurrent_futures (48 sec), test_io (59 sec)
0:01:25 load avg: 7.22 [297/391/1] test__locale passed -- running: test_concurrent_futures (48 sec), test_io (59 sec)
0:01:25 load avg: 7.22 [298/391/1] test_sched passed -- running: test_concurrent_futures (48 sec), test_io (59 sec)
0:01:25 load avg: 7.22 [299/391/1] test_zipapp passed -- running: test_concurrent_futures (48 sec), test_io (59 sec)
0:01:25 load avg: 7.22 [300/391/1] test_io passed (59 sec) -- running: test_concurrent_futures (48 sec)
0:01:25 load avg: 7.22 [301/391/1] test_devpoll skipped -- running: test_concurrent_futures (48 sec)
test_devpoll skipped -- test works only on Solaris OS family
0:01:25 load avg: 7.22 [302/391/1] test_urlparse passed -- running: test_concurrent_futures (48 sec)
0:01:25 load avg: 7.12 [303/391/1] test_eof passed -- running: test_concurrent_futures (48 sec)
0:01:25 load avg: 7.12 [304/391/1] test_subclassinit passed -- running: test_concurrent_futures (48 sec)
0:01:25 load avg: 7.12 [305/391/1] test_slice passed -- running: test_concurrent_futures (48 sec)
0:01:26 load avg: 7.12 [306/391/1] test_unpack passed -- running: test_concurrent_futures (48 sec)
0:01:26 load avg: 7.12 [307/391/1] test_opcodes passed -- running: test_concurrent_futures (49 sec)
0:01:26 load avg: 7.12 [308/391/1] test_peepholer passed -- running: test_concurrent_futures (49 sec)
0:01:27 load avg: 7.12 [309/391/1] test_urllib2_localnet passed -- running: test_concurrent_futures (50 sec)
0:01:27 load avg: 7.12 [310/391/1] test_imghdr passed -- running: test_concurrent_futures (50 sec)
0:01:27 load avg: 7.12 [311/391/1] test_buffer passed -- running: test_concurrent_futures (50 sec)
0:01:27 load avg: 7.12 [312/391/1] test_httpservers passed -- running: test_concurrent_futures (50 sec)
0:01:27 load avg: 7.12 [313/391/1] test_minidom passed -- running: test_concurrent_futures (50 sec)
0:01:27 load avg: 7.12 [314/391/1] test_netrc passed -- running: test_concurrent_futures (50 sec)
0:01:28 load avg: 7.12 [315/391/1] test_robotparser passed -- running: test_concurrent_futures (50 sec)
Resource 'http://www.pythontest.net/' is not available
0:01:28 load avg: 7.12 [316/391/1] test_univnewlines passed -- running: test_concurrent_futures (50 sec)
0:01:28 load avg: 7.12 [317/391/1] test_dis passed -- running: test_concurrent_futures (51 sec)
0:01:28 load avg: 7.12 [318/391/1] test_multibytecodec passed -- running: test_concurrent_futures (51 sec)
0:01:28 load avg: 7.12 [319/391/1] test_list passed -- running: test_concurrent_futures (51 sec)
0:01:28 load avg: 7.12 [320/391/1] test_codecencodings_hk passed -- running: test_concurrent_futures (51 sec)
0:01:28 load avg: 7.12 [321/391/1] test_bool passed -- running: test_concurrent_futures (51 sec)
0:01:28 load avg: 7.12 [322/391/1] test_xml_etree_c passed -- running: test_concurrent_futures (51 sec)
0:01:28 load avg: 7.12 [323/391/1] test_memoryview passed -- running: test_concurrent_futures (51 sec)
0:01:29 load avg: 7.12 [324/391/1] test_compile passed -- running: test_concurrent_futures (51 sec)
0:01:29 load avg: 7.12 [325/391/1] test_docxmlrpc passed -- running: test_concurrent_futures (51 sec)
0:01:29 load avg: 7.12 [326/391/1] test_select passed -- running: test_concurrent_futures (52 sec)
0:01:29 load avg: 7.12 [327/391/1] test_cprofile passed -- running: test_concurrent_futures (52 sec)
0:01:29 load avg: 7.12 [328/391/1] test_xml_dom_minicompat passed -- running: test_concurrent_futures (52 sec)
0:01:29 load avg: 7.12 [329/391/1] test_range passed -- running: test_concurrent_futures (52 sec)
0:01:29 load avg: 7.12 [330/391/1] test_crashers passed -- running: test_concurrent_futures (52 sec)
0:01:30 load avg: 7.12 [331/391/1] test_capi passed -- running: test_concurrent_futures (52 sec)
0:01:30 load avg: 7.12 [332/391/1] test_memoryio passed -- running: test_concurrent_futures (52 sec)
0:01:30 load avg: 7.12 [333/391/1] test_sort passed -- running: test_concurrent_futures (52 sec)
0:01:30 load avg: 7.12 [334/391/1] test_bigaddrspace passed -- running: test_concurrent_futures (53 sec)
0:01:30 load avg: 7.12 [335/391/1] test_unicode_file skipped -- running: test_concurrent_futures (53 sec)
test_unicode_file skipped -- No Unicode filesystem semantics on this platform.
0:01:30 load avg: 6.95 [336/391/1] test_enum passed -- running: test_concurrent_futures (53 sec)
0:01:31 load avg: 6.95 [337/391/1] test_threaded_import passed -- running: test_concurrent_futures (54 sec)
0:01:31 load avg: 6.95 [338/391/1] test_poll passed -- running: test_concurrent_futures (54 sec)
0:01:31 load avg: 6.95 [339/391/1] test_userlist passed -- running: test_concurrent_futures (54 sec)
0:01:31 load avg: 6.95 [340/391/1] test_spwd passed -- running: test_concurrent_futures (54 sec)
0:01:31 load avg: 6.95 [341/391/1] test_sunau passed -- running: test_concurrent_futures (54 sec)
0:01:31 load avg: 6.95 [342/391/1] test_binascii passed -- running: test_concurrent_futures (54 sec)
0:01:32 load avg: 6.95 [343/391/1] test_hashlib passed -- running: test_concurrent_futures (54 sec)
0:01:32 load avg: 6.95 [344/391/1] test_format passed -- running: test_concurrent_futures (54 sec)
0:01:32 load avg: 6.95 [345/391/1] test_codecmaps_kr passed -- running: test_concurrent_futures (55 sec)
0:01:32 load avg: 6.95 [346/391/1] test_mmap passed -- running: test_concurrent_futures (55 sec)
0:01:32 load avg: 6.95 [347/391/1] test_pyclbr passed -- running: test_concurrent_futures (55 sec)
0:01:32 load avg: 6.95 [348/391/1] test_super passed -- running: test_concurrent_futures (55 sec)
0:01:32 load avg: 6.95 [349/391/1] test_baseexception passed -- running: test_concurrent_futures (55 sec), test_multiprocessing_spawn (30 sec)
0:01:33 load avg: 6.95 [350/391/1] test_urllib2 passed -- running: test_concurrent_futures (56 sec), test_multiprocessing_spawn (30 sec)
Resource 'http://www.example.com/' is not available
0:01:33 load avg: 6.95 [351/391/1] test_ucn passed -- running: test_concurrent_futures (56 sec), test_multiprocessing_spawn (31 sec)
0:01:34 load avg: 6.95 [352/391/1] test_typechecks passed -- running: test_concurrent_futures (57 sec), test_multiprocessing_spawn (31 sec)
0:01:34 load avg: 6.95 [353/391/1] test_binhex passed -- running: test_concurrent_futures (57 sec), test_multiprocessing_spawn (32 sec)
0:01:34 load avg: 6.95 [354/391/1] test_urllibnet passed -- running: test_concurrent_futures (57 sec), test_multiprocessing_spawn (32 sec)
Resource 'www.example.com' is not available
Resource 'http://www.pythontest.net/' is not available
Resource 'http://www.pythontest.net/XXXinvalidXXX' is not available
Resource 'http://www.pythontest.net/' is not available
Resource 'http://www.pythontest.net/' is not available
Resource 'http://www.pythontest.net/' is not available
Resource 'http://www.pythontest.net/' is not available
Resource 'http://www.pythontest.net/' is not available
Resource 'http://www.pythontest.net/' is not available
Resource 'http://www.pythontest.net/' is not available
Resource 'http://www.pythontest.net/' is not available
0:01:34 load avg: 6.95 [355/391/1] test_code_module passed -- running: test_concurrent_futures (57 sec), test_multiprocessing_spawn (32 sec)
0:01:36 load avg: 7.12 [356/391/1] test_descr passed -- running: test_concurrent_futures (58 sec), test_multiprocessing_spawn (33 sec)
0:01:36 load avg: 7.12 [357/391/1] test_descrtut passed -- running: test_concurrent_futures (59 sec), test_multiprocessing_spawn (33 sec)
0:01:38 load avg: 7.12 [358/391/1] test_regrtest passed -- running: test_concurrent_futures (61 sec), test_multiprocessing_spawn (36 sec)
0:01:38 load avg: 7.12 [359/391/1] test_trace passed -- running: test_concurrent_futures (61 sec), test_multiprocessing_spawn (36 sec)
0:01:38 load avg: 7.12 [360/391/1] test_dtrace passed -- running: test_concurrent_futures (61 sec), test_multiprocessing_spawn (36 sec)
0:01:39 load avg: 7.12 [361/391/1] test_yield_from passed -- running: test_concurrent_futures (61 sec), test_multiprocessing_spawn (36 sec)
0:01:39 load avg: 7.12 [362/391/1] test_codecmaps_jp passed -- running: test_concurrent_futures (61 sec), test_multiprocessing_spawn (36 sec)
0:01:39 load avg: 7.12 [363/391/1] test_fork1 passed -- running: test_concurrent_futures (62 sec), test_multiprocessing_spawn (36 sec)
0:01:39 load avg: 7.12 [364/391/1] test_codecmaps_tw passed -- running: test_concurrent_futures (62 sec), test_multiprocessing_spawn (36 sec)
0:01:39 load avg: 7.12 [365/391/1] test_getargs2 passed -- running: test_concurrent_futures (62 sec), test_multiprocessing_spawn (36 sec)
0:01:39 load avg: 7.12 [366/391/1] test_types passed -- running: test_concurrent_futures (62 sec), test_multiprocessing_spawn (37 sec)
0:01:39 load avg: 7.12 [367/391/1] test_threading passed -- running: test_concurrent_futures (62 sec), test_multiprocessing_spawn (37 sec)
0:01:39 load avg: 7.12 [368/391/1] test_doctest2 passed -- running: test_concurrent_futures (62 sec), test_multiprocessing_spawn (37 sec)
0:01:40 load avg: 7.12 [369/391/1] test_dbm_ndbm passed -- running: test_concurrent_futures (63 sec), test_multiprocessing_spawn (38 sec)
0:01:41 load avg: 7.35 [370/391/1] test_set passed -- running: test_concurrent_futures (63 sec), test_multiprocessing_spawn (38 sec)
0:01:41 load avg: 7.35 [371/391/1] test_funcattrs passed -- running: test_concurrent_futures (64 sec), test_multiprocessing_spawn (38 sec)
0:01:41 load avg: 7.35 [372/391/1] test_unicode passed -- running: test_concurrent_futures (64 sec), test_multiprocessing_spawn (39 sec)
0:01:41 load avg: 7.35 [373/391/1] test_functools passed -- running: test_concurrent_futures (64 sec), test_multiprocessing_spawn (39 sec)
0:01:41 load avg: 7.35 [374/391/1] test_metaclass passed -- running: test_concurrent_futures (64 sec), test_multiprocessing_spawn (39 sec)
0:01:42 load avg: 7.35 [375/391/1] test_pydoc passed -- running: test_concurrent_futures (65 sec), test_multiprocessing_spawn (40 sec)
0:01:43 load avg: 7.35 [376/391/1] test_kqueue skipped -- running: test_concurrent_futures (65 sec), test_multiprocessing_spawn (40 sec)
test_kqueue skipped -- test works only on BSD
0:01:43 load avg: 7.35 [377/391/1] test_xml_etree passed -- running: test_concurrent_futures (66 sec), test_multiprocessing_spawn (41 sec)
0:01:44 load avg: 7.35 [378/391/1] test_codecs passed -- running: test_concurrent_futures (66 sec), test_multiprocessing_spawn (41 sec)
0:01:44 load avg: 7.35 [379/391/1] test_numeric_tower passed -- running: test_concurrent_futures (67 sec), test_multiprocessing_spawn (42 sec)
0:01:44 load avg: 7.35 [380/391/1] test_userdict passed -- running: test_concurrent_futures (67 sec), test_multiprocessing_spawn (42 sec)
0:01:45 load avg: 7.35 [381/391/1] test_print passed -- running: test_concurrent_futures (67 sec), test_multiprocessing_spawn (42 sec)
0:01:45 load avg: 7.35 [382/391/1] test_deque passed -- running: test_concurrent_futures (68 sec), test_multiprocessing_spawn (42 sec)
0:01:45 load avg: 7.35 [383/391/1] test_keyword passed -- running: test_concurrent_futures (68 sec), test_multiprocessing_spawn (43 sec)
0:01:46 load avg: 7.40 [384/391/1] test_concurrent_futures passed (68 sec) -- running: test_multiprocessing_spawn (43 sec)
0:01:50 load avg: 7.40 [385/391/1] test_subprocess passed -- running: test_multiprocessing_spawn (48 sec)
0:01:53 load avg: 7.21 [386/391/1] test_multiprocessing_main_handling passed -- running: test_multiprocessing_spawn (51 sec)
0:01:58 load avg: 6.87 [387/391/1] test_signal passed -- running: test_multiprocessing_spawn (56 sec)
0:02:02 load avg: 6.48 [388/391/1] test_logging passed -- running: test_multiprocessing_fork (32 sec), test_tokenize (31 sec), test_multiprocessing_spawn (60 sec)
0:02:29 load avg: 5.02 [389/391/1] test_multiprocessing_spawn passed (86 sec) -- running: test_multiprocessing_fork (59 sec), test_tokenize (58 sec)
0:02:32 load avg: 4.70 [390/391/1] test_multiprocessing_fork passed (62 sec) -- running: test_tokenize (61 sec)
0:02:36 load avg: 4.41 [391/391/1] test_tokenize passed (65 sec)
375 tests OK.

1 test failed:
    test_normalization

15 tests skipped:
    test_devpoll test_ioctl test_kqueue test_msilib test_ossaudiodev
    test_startfile test_tix test_tk test_ttk_guionly test_unicode_file
    test_unicode_file_functions test_winconsoleio test_winreg
    test_winsound test_zipfile64
Re-running failed tests in verbose mode
Re-running test 'test_normalization' in verbose mode
test_bug_834676 (test.test_normalization.NormalizationTest) ... ok
test_main (test.test_normalization.NormalizationTest) ... test test_normalization failed
	fetching http://www.pythontest.net/unicode/9.0.0/NormalizationTest.txt ...
FAIL

======================================================================
FAIL: test_main (test.test_normalization.NormalizationTest)
----------------------------------------------------------------------
Traceback (most recent call last):
  File "/tmp/B.SpRmKI/BUILD/Python-3.6.3/Lib/urllib/request.py", line 1318, in do_open
    encode_chunked=req.has_header('Transfer-encoding'))
socket.gaierror: [Errno -3] Temporary failure in name resolution

During handling of the above exception, another exception occurred:

Traceback (most recent call last):
  File "/tmp/B.SpRmKI/BUILD/Python-3.6.3/Lib/test/test_normalization.py", line 42, in test_main
    check=check_version)
urllib.error.URLError: <urlopen error [Errno -3] Temporary failure in name resolution>

During handling of the above exception, another exception occurred:

Traceback (most recent call last):
  File "/tmp/B.SpRmKI/BUILD/Python-3.6.3/Lib/test/test_normalization.py", line 47, in test_main
    self.fail(f"Could not retrieve {TESTDATAURL}")
AssertionError: Could not retrieve http://www.pythontest.net/unicode/9.0.0/NormalizationTest.txt

----------------------------------------------------------------------
Ran 2 tests in 0.009s

FAILED (failures=1)
1 test failed again:
    test_normalization

Total duration: 2 min 37 sec
Tests result: FAILURE
make: *** [Makefile:1025: test] Error 2
error: Bad exit status from /tmp/B.SpRmKI/BUILD/tmp/rpm-tmp.12947 (%build)


RPM build errors:
    Bad exit status from /tmp/B.SpRmKI/BUILD/tmp/rpm-tmp.12947 (%build)
ended at: Wed Oct  4 10:02:09 2017, done in 0:03:44.519154
+ chmod -R u+rwX /tmp/B.SpRmKI/BUILD
+ rm -rf /tmp/B.SpRmKI/tmp /tmp/B.SpRmKI/BUILD
copy rpm files to cache_dir: /spools/ready
cp: cannot stat '/tmp/B.SpRmKI/BUILD/tmp/tmpq37srwtj/foo/build/bdist.linux-i686/rpm/RPMS/foo-0.1-1.noarch.rpm': No such file or directory
cp: cannot stat '/tmp/B.SpRmKI/BUILD/tmp/tmpq37srwtj/foo/build/bdist.linux-i686/rpm/SRPMS/foo-0.1-1.src.rpm': No such file or directory
Begin-PLD-Builder-Info
upgrading packages
error: open of /tmp/B.SpRmKI/BUILD/tmp/tmpq37srwtj/foo/build/bdist.linux-i686/rpm/RPMS/foo-0.1-1.noarch.rpm failed: No such file or directory
package upgrade failed
End-PLD-Builder-Info
+ rm -rf /tmp/B.SpRmKI
Begin-PLD-Builder-Info
Build-Time: user:693.90s sys:50.71s real:233.57s (faults io:1 non-io:9148454)

Files queued for ftp:
         0 foo-0.1-1.noarch.rpm
         0 foo-0.1-1.src.rpm
        98 python3-3.6.3-1.src.rpm.uploadinfo

End-PLD-Builder-Info
[Back to list of logs] [View rpm -qa of builder]