FailedOk

th/SRPMS[OK]
th/x32[OK]
th/i686[OK]
th/x86_64[OK]

ac/SRPMS[OK]
ac/i386[OK]
ac/i586[OK]
ac/i686[OK]
ac/alpha[OK]
ac/amd64[OK]
ac/athlon[OK]
ac/ppc[OK]
ac/sparc[OK]
ac/sparc64[OK]

Advanced Search
main()
Powered by PLD Linux
(c) 2002-2020 PLD Team
$Revision: 1.37 $
Powered by power.
Your IP: 3.228.220.31

rstudio 38da2283-183f-484f-bad0-77fbae588bc7

Status:Failed
Source URL:https://buildlogs.pld-linux.org/pld/th/i686/FAIL/rstudio,38da2283-183f-484f-bad0-77fbae588bc7.bz2
text/plain URL:View!
rpm -qa of builder:View!
Date:2020/08/01 00:17:59
Runtime:0:03:25.694004

Toc:

  • error 1
  • rpm: error: Failed build dependencies:
  • error 2
  • rpm: error: Failed build dependencies:
  • prep
  • Executing(%prep): /bin/sh -e /tmp/B.QcYDGd/BUILD/tmp/rpm-tmp.59790
  • build
  • Executing(%build): /bin/sh -e /tmp/B.QcYDGd/BUILD/tmp/rpm-tmp.34161
  • error 3
  • /tmp/B.QcYDGd/BUILD/rstudio-1.1.143/src/cpp/core/FilePath.cpp:1023:37: error: 'rstudio::core::{anonymous}::recursive_dir_iterator' {aka 'class boost::filesystem::recursive_directory_iterator'} has no member named 'level'
  • error 4
  • make[2]: *** [src/cpp/core/CMakeFiles/rstudio-core.dir/build.make:229: src/cpp/core/CMakeFiles/rstudio-core.dir/FilePath.cpp.o] Error 1
  • error 5
  • make[1]: *** [CMakeFiles/Makefile2:448: src/cpp/core/CMakeFiles/rstudio-core.dir/all] Error 2
  • error 6
  • error: Bad exit status from /tmp/B.QcYDGd/BUILD/tmp/rpm-tmp.34161 (%build)
  • error 7
  • RPM build errors:
  • error 8
  • error: No files produced.

Content:

request from: qboosh
checking if we should skip the build
started at: Sat Aug  1 00:13:40 2020
killing old processes on a builder
sending signal 9 to pid -1
Killed
cleaning up /tmp
fetching https://srcbuilder.pld-linux.org/th//srpms/38da2283-183f-484f-bad0-77fbae588bc7/rstudio-1.1.143-3.src.rpm
fetched 251829258 bytes, 9294.8 K/s
installing srpm: rstudio-1.1.143-3.src.rpm
+ install -d /tmp/B.QcYDGd/BUILD /tmp/B.QcYDGd/RPMS
+ LC_ALL=en_US.UTF-8
+ rpm -qp --changelog rstudio-1.1.143-3.src.rpm
* Fri Jul 31 2020 PLD Linux Team <feedback@pld-linux.org>
- For complete changelog see: http://git.pld-linux.org/?p=packages/rstudio.git;a=log;h=master
* Thu Oct 10 2019 Jan Rękorajski <baggins@pld-linux.org> 9b0d5a3
- rebuild with boost 1.71 and icu 65.1 - release 3 (by relup.sh) + rpm -Uhv --nodeps --define '_topdir /tmp/B.QcYDGd' --define '_specdir %{_topdir}' --define '_sourcedir %{_specdir}' --define '_rpmdir %{_topdir}/RPMS' --define '_builddir %{_topdir}/BUILD' rstudio-1.1.143-3.src.rpm Preparing... ################################################## rstudio ################################################## + rm -f rstudio-1.1.143-3.src.rpm + install -m 700 -d /tmp/B.QcYDGd/BUILD/tmp + TMPDIR=/tmp/B.QcYDGd/BUILD/tmp + exec nice -n 0 rpmbuild -bp --short-circuit --nodeps --define '_topdir /tmp/B.QcYDGd' --define '_specdir %{_topdir}' --define '_sourcedir %{_specdir}' --define '_rpmdir %{_topdir}/RPMS' --define '_builddir %{_topdir}/BUILD' --target i686-pld-linux --define 'prep exit 0' /tmp/B.QcYDGd/rstudio.spec Building target platforms: i686-pld-linux checking BuildConflict-ing packages no BuildConflicts found checking BR rpm: error: Failed build dependencies: rpm: R >= 2.11.1 is needed by rstudio-1.1.143-3.src rpm: Building target platforms: i686-pld-linux updating poldek cache... ready is up to date th is up to date th is up to date th-ready is up to date th-ready is up to date th-test is up to date th-test is up to date checking conflicting packages in BRed packages poldek: Loading [pndir]ready... poldek: Loading [pndir]th-test... poldek: Loading [pndir]th-test... poldek: Loading [pndir]th-ready... poldek: Loading [pndir]th-ready... poldek: Loading [pndir]th... poldek: Loading [pndir]th... poldek: 31170 packages read poldek: Removed 2660 duplicate packages from available set poldek: Processing dependencies... poldek: There are 1 package to install: poldek: A R-3.6.3-3.i686 poldek: This operation will use 61.4MB of disk space. poldek: Need to get 40.1MB of archives (40.1MB to download). poldek: poldek: Retrieving th::R-3.6.3-3.i686.rpm..........................................................done poldek: Executing pm-command.sh --upgrade -vh --test --root / --define _check_dirname_deps 1... poldek: Preparing... ################################################## no conflicts found checking BR rpm: error: Failed build dependencies: rpm: R >= 2.11.1 is needed by rstudio-1.1.143-3.src rpm: Building target platforms: i686-pld-linux installing BR: R + poldek --noask --caplookup -Q -v '--ignore=hhvm-*' '--ignore=php4-*' '--ignore=php52-*' '--ignore=php54-*' '--ignore=php55-*' '--ignore=php56-*' '--ignore=php70-*' '--ignore=php71-*' '--ignore=php72-*' '--ignore=php73-*' '--ignore=php74-*' --upgrade R Loading [pndir]ready... Loading [pndir]th-test... Loading [pndir]th-test... Loading [pndir]th-ready... Loading [pndir]th-ready... Loading [pndir]th... Loading [pndir]th... 31170 packages read Removed 2660 duplicate packages from available set Processing dependencies... There are 1 package to install: A R-3.6.3-3.i686 This operation will use 61.4MB of disk space. Need to get 40.1MB of archives. Executing pm-command.sh --upgrade -vh --root / --define _check_dirname_deps 1... Preparing... ################################################## R ################################################## building RPM using: set -ex; : build-id: 38da2283-183f-484f-bad0-77fbae588bc7; TMPDIR=/tmp/B.QcYDGd/BUILD/tmp exec nice -n 0 rpmbuild -bb --define '_smp_mflags -j9' --define '_make_opts -Otarget' --define '_pld_builder 1' --define '_topdir /tmp/B.QcYDGd' --define '_specdir %{_topdir}' --define '_sourcedir %{_specdir}' --define '_rpmdir %{_topdir}/RPMS' --define '_builddir %{_topdir}/BUILD' --target i686-pld-linux /tmp/B.QcYDGd/rstudio.spec + : build-id: 38da2283-183f-484f-bad0-77fbae588bc7 + TMPDIR=/tmp/B.QcYDGd/BUILD/tmp + exec nice -n 0 rpmbuild -bb --define '_smp_mflags -j9' --define '_make_opts -Otarget' --define '_pld_builder 1' --define '_topdir /tmp/B.QcYDGd' --define '_specdir %{_topdir}' --define '_sourcedir %{_specdir}' --define '_rpmdir %{_topdir}/RPMS' --define '_builddir %{_topdir}/BUILD' --target i686-pld-linux /tmp/B.QcYDGd/rstudio.spec Building target platforms: i686-pld-linux Executing(%prep): /bin/sh -e /tmp/B.QcYDGd/BUILD/tmp/rpm-tmp.59790 + umask 022 + cd /tmp/B.QcYDGd/BUILD + cd /tmp/B.QcYDGd/BUILD + rm -rf rstudio-1.1.143 + /bin/gzip -dc /tmp/B.QcYDGd/rstudio-1.1.143.tar.gz + /bin/tar -xf - + STATUS=0 + '[' 0 -ne 0 ']' + cd rstudio-1.1.143 + /bin/id -u + '[' 1001 '=' 0 ']' + /bin/id -u + '[' 1001 '=' 0 ']' + /bin/chmod -Rf a+rX,u+w,g-w,o-w . + echo 'Patch #0 (rstudio-includes.patch):' Patch #0 (rstudio-includes.patch): + '[' -f /tmp/B.QcYDGd/rstudio-includes.patch ']' + /bin/cat /tmp/B.QcYDGd/rstudio-includes.patch + /usr/bin/patch -s -p1 + echo 'Patch #1 (rstudio-openssl.patch):' Patch #1 (rstudio-openssl.patch): + '[' -f /tmp/B.QcYDGd/rstudio-openssl.patch ']' + /bin/cat /tmp/B.QcYDGd/rstudio-openssl.patch + /usr/bin/patch -s -p1 + echo 'Patch #2 (rstudio-boost.patch):' Patch #2 (rstudio-boost.patch): + '[' -f /tmp/B.QcYDGd/rstudio-boost.patch ']' + /bin/cat /tmp/B.QcYDGd/rstudio-boost.patch + /usr/bin/patch -s -p1 + cd src/cpp/ext + echo 'Patch #3 (websocketpp-boost.patch):' Patch #3 (websocketpp-boost.patch): + '[' -f /tmp/B.QcYDGd/websocketpp-boost.patch ']' + /bin/cat /tmp/B.QcYDGd/websocketpp-boost.patch + /usr/bin/patch -s -p1 + cd ../../.. + mkdir -p dependencies/common/dictionaries + unzip -qq /tmp/B.QcYDGd/core-dictionaries.zip -d dependencies/common/dictionaries + mkdir -p src/gwt/lib/gwt + mkdir -p src/gwt/lib/gin/1.5 + unzip -qq /tmp/B.QcYDGd/gwt-2.7.0.zip -d src/gwt/lib/gwt + unzip -qq /tmp/B.QcYDGd/gin-1.5.zip -d src/gwt/lib/gin/1.5 + /bin/mv src/gwt/lib/gwt/gwt-2.7.0 src/gwt/lib/gwt/2.7.0 + unzip -qq /tmp/B.QcYDGd/mathjax-26.zip -d dependencies/common + xz -dc /tmp/B.QcYDGd/packrat_0.4.1.24_bbdab984134678db91b8f372e2550e59f266de37.tar.xz + tar xf - -C dependencies/common/ + xz -dc /tmp/B.QcYDGd/rmarkdown_1.4.0.9001_b7434dcc5abe87cb27f01cbffb9ca94e1539d322.tar.xz + tar xf - -C dependencies/common/ + xz -dc /tmp/B.QcYDGd/shinyapps_0.3.61_d3ab9e1cdd02f0067d69fe6fc816a61c8a5f2218.tar.xz + tar xf - -C dependencies/common/ + xz -dc /tmp/B.QcYDGd/rsconnect_0.7.0-2_fa486121f8f75701e2044f33d2901e610160322f.tar.xz + tar xf - -C dependencies/common/ + mkdir -p dependencies/common/pandoc/1.12.4.2 + ln -s /usr/bin/pandoc dependencies/common/pandoc/1.12.4.2/pandoc + ln -s /usr/bin/pandoc dependencies/common/pandoc/1.12.4.2/pandoc-static + mkdir -p dependencies/common/libclang/3.5/include/ + ln -s /usr/include/clang-c dependencies/common/libclang/3.5/include/ + mkdir -p dependencies/common/libclang/builtin-headers + ln -s /usr/lib64/clang/3.5.0/include dependencies/common/libclang/builtin-headers/3.5 + mkdir -p dependencies/common/libclang/3.5/linux/x86 + ln -s /usr/lib/libclang.so dependencies/common/libclang/3.5/linux/x86/libclang.so + exit 0 Executing(%build): /bin/sh -e /tmp/B.QcYDGd/BUILD/tmp/rpm-tmp.34161 TMP=/home/users/builder/tmp HOME=/home/users/builder PATH=/home/users/builder/GNUstep/Tools:/bin:/usr/bin:/usr/local/bin:/home/users/builder/bin TMPDIR=/tmp/B.QcYDGd/BUILD/tmp + umask 022 + cd /tmp/B.QcYDGd/BUILD + cd rstudio-1.1.143 + install -d build + cd build + CC=i686-pld-linux-gcc CXX=i686-pld-linux-g++ CPPFLAGS='' /usr/bin/cmake -Wno-dev '-DCMAKE_VERBOSE_MAKEFILE=ON' '-DCMAKE_BUILD_TYPE=PLD' '-DCMAKE_INSTALL_BINDIR:PATH=/usr/bin' '-DCMAKE_INSTALL_SBINDIR:PATH=/usr/sbin' '-DCMAKE_INSTALL_LIBEXECDIR:PATH=/usr/libexec' '-DCMAKE_INSTALL_SYSCONFDIR:PATH=/etc' '-DCMAKE_INSTALL_SHAREDSTATEDIRPATH:PATH=/var/lib' '-DCMAKE_INSTALL_LOCALSTATEDIRPATH:PATH=/var' '-DCMAKE_INSTALL_LIBDIR:PATH=/usr/lib' '-DCMAKE_INSTALL_INCLUDEDIR:PATH=/usr/include' '-DCMAKE_INSTALL_OLDINCLUDEDIR:PATH=/usr/include' '-DCMAKE_INSTALL_DATAROOTDIR:PATH=/usr/share' '-DCMAKE_INSTALL_DATADIR:PATH=/usr/share' '-DCMAKE_INSTALL_INFODIR:PATH=/usr/share/info' '-DCMAKE_INSTALL_LOCALEDIR:PATH=/usr/share/locale' '-DCMAKE_INSTALL_MANDIR:PATH=/usr/share/man' '-DCMAKE_INSTALL_DOCDIR:PATH=/usr/share/doc' '-DCMAKE_INSTALL_PREFIX:PATH=/usr' '-DSYSCONF_INSTALL_DIR:PATH=/etc' '-DCMAKE_CXX_FLAGS_PLD=-O2 -fwrapv -pipe -Wformat -Werror=format-security -gdwarf-4 -fno-debug-types-section -fvar-tracking-assignments -g2 -Wp,-D_FORTIFY_SOURCE=2 -fstack-protector-strong --param=ssp-buffer-size=4 -Werror=trampolines -fomit-frame-pointer -march=i686 -fasynchronous-unwind-tables -mtune=pentium4 -gdwarf-4 -fno-debug-types-section -fvar-tracking-assignments -g2 -DNDEBUG -DQT_NO_DEBUG' '-DCMAKE_C_FLAGS_PLD=-O2 -fwrapv -pipe -Wformat -Werror=format-security -gdwarf-4 -fno-debug-types-section -fvar-tracking-assignments -g2 -Wp,-D_FORTIFY_SOURCE=2 -fstack-protector-strong --param=ssp-buffer-size=4 -Werror=trampolines -fomit-frame-pointer -march=i686 -fasynchronous-unwind-tables -mtune=pentium4 -gdwarf-4 -fno-debug-types-section -fvar-tracking-assignments -g2 -DNDEBUG -DQT_NO_DEBUG' '-DCMAKE_Fortran_FLAGS_PLD=-O2 -fwrapv -pipe -Wformat -Werror=format-security -gdwarf-4 -fno-debug-types-section -fvar-tracking-assignments -g2 -Wp,-D_FORTIFY_SOURCE=2 -fstack-protector-strong --param=ssp-buffer-size=4 -Werror=trampolines -fomit-frame-pointer -march=i686 -fasynchronous-unwind-tables -mtune=pentium4 -gdwarf-4 -fno-debug-types-section -fvar-tracking-assignments -g2 -DNDEBUG -DQT_NO_DEBUG' '-DCMAKE_EXE_LINKER_FLAGS_PLD=-Wl,--as-needed -Wl,--no-copy-dt-needed-entries -Wl,-z,relro -Wl,-z,combreloc ' '-DCMAKE_SHARED_LINKER_FLAGS_PLD=-Wl,--as-needed -Wl,--no-copy-dt-needed-entries -Wl,-z,relro -Wl,-z,combreloc ' '-DCMAKE_MODULE_LINKER_FLAGS_PLD=-Wl,--as-needed -Wl,--no-copy-dt-needed-entries -Wl,-z,relro -Wl,-z,combreloc ' '-DBUILD_SHARED_LIBS:BOOL=ON' .. '-DCMAKE_BUILD_TYPE=Release' '-DCMAKE_C_FLAGS_RELEASE=-O2 -fwrapv -pipe -Wformat -Werror=format-security -gdwarf-4 -fno-debug-types-section -fvar-tracking-assignments -g2 -Wp,-D_FORTIFY_SOURCE=2 -fstack-protector-strong --param=ssp-buffer-size=4 -Werror=trampolines -fomit-frame-pointer -march=i686 -fasynchronous-unwind-tables -mtune=pentium4 -gdwarf-4 -fno-debug-types-section -fvar-tracking-assignments -g2 -DNDEBUG -DQT_NO_DEBUG' '-DCMAKE_CXX_FLAGS_RELEASE=-O2 -fwrapv -pipe -Wformat -Werror=format-security -gdwarf-4 -fno-debug-types-section -fvar-tracking-assignments -g2 -Wp,-D_FORTIFY_SOURCE=2 -fstack-protector-strong --param=ssp-buffer-size=4 -Werror=trampolines -fomit-frame-pointer -march=i686 -fasynchronous-unwind-tables -mtune=pentium4 -gdwarf-4 -fno-debug-types-section -fvar-tracking-assignments -g2 -DNDEBUG -DQT_NO_DEBUG' '-DCMAKE_INSTALL_PREFIX=/usr/lib/rstudio' '-DQT_QMAKE_EXECUTABLE=/usr/bin/qt5-qmake' '-DRSTUDIO_TARGET=Desktop' -- The C compiler identification is GNU 10.2.0 -- The CXX compiler identification is GNU 10.2.0 -- Check for working C compiler: /usr/bin/i686-pld-linux-gcc -- Check for working C compiler: /usr/bin/i686-pld-linux-gcc - works -- Detecting C compiler ABI info -- Detecting C compiler ABI info - done -- Detecting C compile features -- Detecting C compile features - done -- Check for working CXX compiler: /usr/bin/i686-pld-linux-g++ -- Check for working CXX compiler: /usr/bin/i686-pld-linux-g++ - works -- Detecting CXX compiler ABI info -- Detecting CXX compiler ABI info - done -- Detecting CXX compile features -- Detecting CXX compile features - done -- LSB release: pld -- Looking for pthread.h -- Looking for pthread.h - found -- Performing Test CMAKE_HAVE_LIBC_PTHREAD -- Performing Test CMAKE_HAVE_LIBC_PTHREAD - Failed -- Looking for pthread_create in pthreads -- Looking for pthread_create in pthreads - not found -- Looking for pthread_create in pthread -- Looking for pthread_create in pthread - found -- Found Threads: TRUE -- Found Boost: /usr/include (found suitable version "1.73.0", minimum required is "1.63.0") found components: date_time filesystem iostreams program_options regex system thread chrono random atomic -- Using system Boost 1.63.0 -- Performing Test HAVE_SCANDIR_POSIX -- Performing Test HAVE_SCANDIR_POSIX - Success -- Looking for SA_NOCLDWAIT -- Looking for SA_NOCLDWAIT - found -- Looking for SO_PEERCRED -- Looking for SO_PEERCRED - found -- Looking for inotify_init1 -- Looking for inotify_init1 - found -- Looking for getpeereid -- Looking for getpeereid - not found -- Looking for setresuid -- Looking for setresuid - found -- Found LibR: /usr/lib/R -- Found R: /usr/lib/R -- Performing Test LIBR_MINIMUM_VERSION -- Performing Test LIBR_MINIMUM_VERSION - Success -- Configuring done -- Generating done CMake Warning: Manually-specified variables were not used by the project: CMAKE_CXX_FLAGS_PLD CMAKE_C_FLAGS_PLD CMAKE_EXE_LINKER_FLAGS_PLD CMAKE_Fortran_FLAGS_PLD CMAKE_INSTALL_BINDIR CMAKE_INSTALL_DATADIR CMAKE_INSTALL_DATAROOTDIR CMAKE_INSTALL_DOCDIR CMAKE_INSTALL_INCLUDEDIR CMAKE_INSTALL_INFODIR CMAKE_INSTALL_LIBDIR CMAKE_INSTALL_LIBEXECDIR CMAKE_INSTALL_LOCALEDIR CMAKE_INSTALL_LOCALSTATEDIRPATH CMAKE_INSTALL_MANDIR CMAKE_INSTALL_OLDINCLUDEDIR CMAKE_INSTALL_SBINDIR CMAKE_INSTALL_SHAREDSTATEDIRPATH CMAKE_INSTALL_SYSCONFDIR CMAKE_MODULE_LINKER_FLAGS_PLD CMAKE_SHARED_LINKER_FLAGS_PLD SYSCONF_INSTALL_DIR -- Build files have been written to: /tmp/B.QcYDGd/BUILD/rstudio-1.1.143/build + /usr/bin/make -Otarget -j9 /usr/bin/cmake -S/tmp/B.QcYDGd/BUILD/rstudio-1.1.143 -B/tmp/B.QcYDGd/BUILD/rstudio-1.1.143/build --check-build-system CMakeFiles/Makefile.cmake 0 /usr/bin/cmake -E cmake_progress_start /tmp/B.QcYDGd/BUILD/rstudio-1.1.143/build/CMakeFiles /tmp/B.QcYDGd/BUILD/rstudio-1.1.143/build/CMakeFiles/progress.marks /usr/bin/make -f CMakeFiles/Makefile2 all /usr/bin/make -f src/gwt/CMakeFiles/gwt_build.dir/build.make src/gwt/CMakeFiles/gwt_build.dir/depend /usr/bin/make -f src/cpp/core/CMakeFiles/rstudio-core.dir/build.make src/cpp/core/CMakeFiles/rstudio-core.dir/depend /usr/bin/make -f src/cpp/core/spelling/hunspell/CMakeFiles/rstudio-core-hunspell.dir/build.make src/cpp/core/spelling/hunspell/CMakeFiles/rstudio-core-hunspell.dir/depend /usr/bin/make -f src/cpp/core/tex/synctex/CMakeFiles/rstudio-core-synctex.dir/build.make src/cpp/core/tex/synctex/CMakeFiles/rstudio-core-synctex.dir/depend make[2]: Entering directory '/tmp/B.QcYDGd/BUILD/rstudio-1.1.143/build' cd /tmp/B.QcYDGd/BUILD/rstudio-1.1.143/build && /usr/bin/cmake -E cmake_depends "Unix Makefiles" /tmp/B.QcYDGd/BUILD/rstudio-1.1.143 /tmp/B.QcYDGd/BUILD/rstudio-1.1.143/src/gwt /tmp/B.QcYDGd/BUILD/rstudio-1.1.143/build /tmp/B.QcYDGd/BUILD/rstudio-1.1.143/build/src/gwt /tmp/B.QcYDGd/BUILD/rstudio-1.1.143/build/src/gwt/CMakeFiles/gwt_build.dir/DependInfo.cmake --color= Scanning dependencies of target gwt_build make[2]: Leaving directory '/tmp/B.QcYDGd/BUILD/rstudio-1.1.143/build' /usr/bin/make -f src/gwt/CMakeFiles/gwt_build.dir/build.make src/gwt/CMakeFiles/gwt_build.dir/build make[2]: Entering directory '/tmp/B.QcYDGd/BUILD/rstudio-1.1.143/build' cd /tmp/B.QcYDGd/BUILD/rstudio-1.1.143/build && /usr/bin/cmake -E cmake_depends "Unix Makefiles" /tmp/B.QcYDGd/BUILD/rstudio-1.1.143 /tmp/B.QcYDGd/BUILD/rstudio-1.1.143/src/cpp/core/tex/synctex /tmp/B.QcYDGd/BUILD/rstudio-1.1.143/build /tmp/B.QcYDGd/BUILD/rstudio-1.1.143/build/src/cpp/core/tex/synctex /tmp/B.QcYDGd/BUILD/rstudio-1.1.143/build/src/cpp/core/tex/synctex/CMakeFiles/rstudio-core-synctex.dir/DependInfo.cmake --color= Scanning dependencies of target rstudio-core-synctex make[2]: Leaving directory '/tmp/B.QcYDGd/BUILD/rstudio-1.1.143/build' /usr/bin/make -f src/cpp/core/tex/synctex/CMakeFiles/rstudio-core-synctex.dir/build.make src/cpp/core/tex/synctex/CMakeFiles/rstudio-core-synctex.dir/build make[2]: Entering directory '/tmp/B.QcYDGd/BUILD/rstudio-1.1.143/build' cd /tmp/B.QcYDGd/BUILD/rstudio-1.1.143/build && /usr/bin/cmake -E cmake_depends "Unix Makefiles" /tmp/B.QcYDGd/BUILD/rstudio-1.1.143 /tmp/B.QcYDGd/BUILD/rstudio-1.1.143/src/cpp/core/spelling/hunspell /tmp/B.QcYDGd/BUILD/rstudio-1.1.143/build /tmp/B.QcYDGd/BUILD/rstudio-1.1.143/build/src/cpp/core/spelling/hunspell /tmp/B.QcYDGd/BUILD/rstudio-1.1.143/build/src/cpp/core/spelling/hunspell/CMakeFiles/rstudio-core-hunspell.dir/DependInfo.cmake --color= Scanning dependencies of target rstudio-core-hunspell make[2]: Leaving directory '/tmp/B.QcYDGd/BUILD/rstudio-1.1.143/build' /usr/bin/make -f src/cpp/core/spelling/hunspell/CMakeFiles/rstudio-core-hunspell.dir/build.make src/cpp/core/spelling/hunspell/CMakeFiles/rstudio-core-hunspell.dir/build make[2]: Entering directory '/tmp/B.QcYDGd/BUILD/rstudio-1.1.143/build' cd /tmp/B.QcYDGd/BUILD/rstudio-1.1.143/build && /usr/bin/cmake -E cmake_depends "Unix Makefiles" /tmp/B.QcYDGd/BUILD/rstudio-1.1.143 /tmp/B.QcYDGd/BUILD/rstudio-1.1.143/src/cpp/core /tmp/B.QcYDGd/BUILD/rstudio-1.1.143/build /tmp/B.QcYDGd/BUILD/rstudio-1.1.143/build/src/cpp/core /tmp/B.QcYDGd/BUILD/rstudio-1.1.143/build/src/cpp/core/CMakeFiles/rstudio-core.dir/DependInfo.cmake --color= Scanning dependencies of target rstudio-core make[2]: Leaving directory '/tmp/B.QcYDGd/BUILD/rstudio-1.1.143/build' /usr/bin/make -f src/cpp/core/CMakeFiles/rstudio-core.dir/build.make src/cpp/core/CMakeFiles/rstudio-core.dir/build make[2]: Entering directory '/tmp/B.QcYDGd/BUILD/rstudio-1.1.143/build' [ 1%] Building CXX object src/cpp/core/spelling/hunspell/CMakeFiles/rstudio-core-hunspell.dir/dictmgr.cxx.o cd /tmp/B.QcYDGd/BUILD/rstudio-1.1.143/build/src/cpp/core/spelling/hunspell && /usr/bin/i686-pld-linux-g++ -DBOOST_ASIO_DISABLE_KQUEUE -DBOOST_ENABLE_ASSERT_HANDLER -DBOOST_SIGNALS_NO_DEPRECATION_WARNING -DRSTUDIO_BOOST_NAMESPACE=boost -D_FORTIFY_SOURCE=2 -I/tmp/B.QcYDGd/BUILD/rstudio-1.1.143/build/src/cpp/core/spelling/hunspell -O2 -fwrapv -pipe -Wformat -Werror=format-security -gdwarf-4 -fno-debug-types-section -fvar-tracking-assignments -g2 -Wp,-D_FORTIFY_SOURCE=2 -fstack-protector-strong --param=ssp-buffer-size=4 -Werror=trampolines -fomit-frame-pointer -march=i686 -fasynchronous-unwind-tables -mtune=pentium4 -gdwarf-4 -fno-debug-types-section -fvar-tracking-assignments -g2 -DNDEBUG -DQT_NO_DEBUG -Wall -pthread -Wformat -Wformat-security -fstack-protector --param ssp-buffer-size=4 -pie -fPIE -w -o CMakeFiles/rstudio-core-hunspell.dir/dictmgr.cxx.o -c /tmp/B.QcYDGd/BUILD/rstudio-1.1.143/src/cpp/core/spelling/hunspell/dictmgr.cxx make[2]: Leaving directory '/tmp/B.QcYDGd/BUILD/rstudio-1.1.143/build' make[2]: Entering directory '/tmp/B.QcYDGd/BUILD/rstudio-1.1.143/build' [ 0%] Building C object src/cpp/core/tex/synctex/CMakeFiles/rstudio-core-synctex.dir/synctex_parser_utils.c.o cd /tmp/B.QcYDGd/BUILD/rstudio-1.1.143/build/src/cpp/core/tex/synctex && /usr/bin/i686-pld-linux-gcc -DBOOST_ASIO_DISABLE_KQUEUE -DBOOST_ENABLE_ASSERT_HANDLER -DBOOST_SIGNALS_NO_DEPRECATION_WARNING -DRSTUDIO_BOOST_NAMESPACE=boost -D_FORTIFY_SOURCE=2 -I/tmp/B.QcYDGd/BUILD/rstudio-1.1.143/src/cpp/core/tex/synctex -O2 -fwrapv -pipe -Wformat -Werror=format-security -gdwarf-4 -fno-debug-types-section -fvar-tracking-assignments -g2 -Wp,-D_FORTIFY_SOURCE=2 -fstack-protector-strong --param=ssp-buffer-size=4 -Werror=trampolines -fomit-frame-pointer -march=i686 -fasynchronous-unwind-tables -mtune=pentium4 -gdwarf-4 -fno-debug-types-section -fvar-tracking-assignments -g2 -DNDEBUG -DQT_NO_DEBUG -Wall -pthread -Wformat -Wformat-security -fstack-protector --param ssp-buffer-size=4 -pie -fPIE -o CMakeFiles/rstudio-core-synctex.dir/synctex_parser_utils.c.o -c /tmp/B.QcYDGd/BUILD/rstudio-1.1.143/src/cpp/core/tex/synctex/synctex_parser_utils.c In file included from /usr/include/string.h:495, from /tmp/B.QcYDGd/BUILD/rstudio-1.1.143/src/cpp/core/tex/synctex/synctex_parser_utils.c:46: In function 'strncpy', inlined from '_synctex_merge_strings' at /tmp/B.QcYDGd/BUILD/rstudio-1.1.143/src/cpp/core/tex/synctex/synctex_parser_utils.c:307:17: /usr/include/bits/string_fortified.h:106:10: warning: '__builtin_strncpy' output truncated before terminating nul copying as many bytes from a string as its length [-Wstringop-truncation] 106 | return __builtin___strncpy_chk (__dest, __src, __len, __bos (__dest)); | ^~~~~~~~~~~~~~~~~~~~~~~~~~~~~~~~~~~~~~~~~~~~~~~~~~~~~~~~~~~~~~ /tmp/B.QcYDGd/BUILD/rstudio-1.1.143/src/cpp/core/tex/synctex/synctex_parser_utils.c: In function '_synctex_merge_strings': /tmp/B.QcYDGd/BUILD/rstudio-1.1.143/src/cpp/core/tex/synctex/synctex_parser_utils.c:305:16: note: length computed here 305 | if((size = strlen(temp))>0) { | ^~~~~~~~~~~~ In file included from /usr/include/string.h:495, from /tmp/B.QcYDGd/BUILD/rstudio-1.1.143/src/cpp/core/tex/synctex/synctex_parser_utils.c:46: In function 'strncpy', inlined from '_synctex_get_name' at /tmp/B.QcYDGd/BUILD/rstudio-1.1.143/src/cpp/core/tex/synctex/synctex_parser_utils.c:387:20: /usr/include/bits/string_fortified.h:106:10: warning: '__builtin_strncpy' specified bound depends on the length of the source argument [-Wstringop-overflow=] 106 | return __builtin___strncpy_chk (__dest, __src, __len, __bos (__dest)); | ^~~~~~~~~~~~~~~~~~~~~~~~~~~~~~~~~~~~~~~~~~~~~~~~~~~~~~~~~~~~~~ /tmp/B.QcYDGd/BUILD/rstudio-1.1.143/src/cpp/core/tex/synctex/synctex_parser_utils.c: In function '_synctex_get_name': /tmp/B.QcYDGd/BUILD/rstudio-1.1.143/src/cpp/core/tex/synctex/synctex_parser_utils.c:378:11: note: length computed here 378 | size = strlen(output)-strlen(base_name); | ^~~~~~~~~~~~~~ make[2]: Leaving directory '/tmp/B.QcYDGd/BUILD/rstudio-1.1.143/build' make[2]: Entering directory '/tmp/B.QcYDGd/BUILD/rstudio-1.1.143/build' [ 1%] Building CXX object src/cpp/core/spelling/hunspell/CMakeFiles/rstudio-core-hunspell.dir/phonet.cxx.o cd /tmp/B.QcYDGd/BUILD/rstudio-1.1.143/build/src/cpp/core/spelling/hunspell && /usr/bin/i686-pld-linux-g++ -DBOOST_ASIO_DISABLE_KQUEUE -DBOOST_ENABLE_ASSERT_HANDLER -DBOOST_SIGNALS_NO_DEPRECATION_WARNING -DRSTUDIO_BOOST_NAMESPACE=boost -D_FORTIFY_SOURCE=2 -I/tmp/B.QcYDGd/BUILD/rstudio-1.1.143/build/src/cpp/core/spelling/hunspell -O2 -fwrapv -pipe -Wformat -Werror=format-security -gdwarf-4 -fno-debug-types-section -fvar-tracking-assignments -g2 -Wp,-D_FORTIFY_SOURCE=2 -fstack-protector-strong --param=ssp-buffer-size=4 -Werror=trampolines -fomit-frame-pointer -march=i686 -fasynchronous-unwind-tables -mtune=pentium4 -gdwarf-4 -fno-debug-types-section -fvar-tracking-assignments -g2 -DNDEBUG -DQT_NO_DEBUG -Wall -pthread -Wformat -Wformat-security -fstack-protector --param ssp-buffer-size=4 -pie -fPIE -w -o CMakeFiles/rstudio-core-hunspell.dir/phonet.cxx.o -c /tmp/B.QcYDGd/BUILD/rstudio-1.1.143/src/cpp/core/spelling/hunspell/phonet.cxx make[2]: Leaving directory '/tmp/B.QcYDGd/BUILD/rstudio-1.1.143/build' make[2]: Entering directory '/tmp/B.QcYDGd/BUILD/rstudio-1.1.143/build' [ 0%] Building CXX object src/cpp/core/spelling/hunspell/CMakeFiles/rstudio-core-hunspell.dir/hashmgr.cxx.o cd /tmp/B.QcYDGd/BUILD/rstudio-1.1.143/build/src/cpp/core/spelling/hunspell && /usr/bin/i686-pld-linux-g++ -DBOOST_ASIO_DISABLE_KQUEUE -DBOOST_ENABLE_ASSERT_HANDLER -DBOOST_SIGNALS_NO_DEPRECATION_WARNING -DRSTUDIO_BOOST_NAMESPACE=boost -D_FORTIFY_SOURCE=2 -I/tmp/B.QcYDGd/BUILD/rstudio-1.1.143/build/src/cpp/core/spelling/hunspell -O2 -fwrapv -pipe -Wformat -Werror=format-security -gdwarf-4 -fno-debug-types-section -fvar-tracking-assignments -g2 -Wp,-D_FORTIFY_SOURCE=2 -fstack-protector-strong --param=ssp-buffer-size=4 -Werror=trampolines -fomit-frame-pointer -march=i686 -fasynchronous-unwind-tables -mtune=pentium4 -gdwarf-4 -fno-debug-types-section -fvar-tracking-assignments -g2 -DNDEBUG -DQT_NO_DEBUG -Wall -pthread -Wformat -Wformat-security -fstack-protector --param ssp-buffer-size=4 -pie -fPIE -w -o CMakeFiles/rstudio-core-hunspell.dir/hashmgr.cxx.o -c /tmp/B.QcYDGd/BUILD/rstudio-1.1.143/src/cpp/core/spelling/hunspell/hashmgr.cxx make[2]: Leaving directory '/tmp/B.QcYDGd/BUILD/rstudio-1.1.143/build' make[2]: Entering directory '/tmp/B.QcYDGd/BUILD/rstudio-1.1.143/build' [ 2%] Building CXX object src/cpp/core/spelling/hunspell/CMakeFiles/rstudio-core-hunspell.dir/filemgr.cxx.o cd /tmp/B.QcYDGd/BUILD/rstudio-1.1.143/build/src/cpp/core/spelling/hunspell && /usr/bin/i686-pld-linux-g++ -DBOOST_ASIO_DISABLE_KQUEUE -DBOOST_ENABLE_ASSERT_HANDLER -DBOOST_SIGNALS_NO_DEPRECATION_WARNING -DRSTUDIO_BOOST_NAMESPACE=boost -D_FORTIFY_SOURCE=2 -I/tmp/B.QcYDGd/BUILD/rstudio-1.1.143/build/src/cpp/core/spelling/hunspell -O2 -fwrapv -pipe -Wformat -Werror=format-security -gdwarf-4 -fno-debug-types-section -fvar-tracking-assignments -g2 -Wp,-D_FORTIFY_SOURCE=2 -fstack-protector-strong --param=ssp-buffer-size=4 -Werror=trampolines -fomit-frame-pointer -march=i686 -fasynchronous-unwind-tables -mtune=pentium4 -gdwarf-4 -fno-debug-types-section -fvar-tracking-assignments -g2 -DNDEBUG -DQT_NO_DEBUG -Wall -pthread -Wformat -Wformat-security -fstack-protector --param ssp-buffer-size=4 -pie -fPIE -w -o CMakeFiles/rstudio-core-hunspell.dir/filemgr.cxx.o -c /tmp/B.QcYDGd/BUILD/rstudio-1.1.143/src/cpp/core/spelling/hunspell/filemgr.cxx make[2]: Leaving directory '/tmp/B.QcYDGd/BUILD/rstudio-1.1.143/build' make[2]: Entering directory '/tmp/B.QcYDGd/BUILD/rstudio-1.1.143/build' [ 0%] Building CXX object src/cpp/core/spelling/hunspell/CMakeFiles/rstudio-core-hunspell.dir/affentry.cxx.o cd /tmp/B.QcYDGd/BUILD/rstudio-1.1.143/build/src/cpp/core/spelling/hunspell && /usr/bin/i686-pld-linux-g++ -DBOOST_ASIO_DISABLE_KQUEUE -DBOOST_ENABLE_ASSERT_HANDLER -DBOOST_SIGNALS_NO_DEPRECATION_WARNING -DRSTUDIO_BOOST_NAMESPACE=boost -D_FORTIFY_SOURCE=2 -I/tmp/B.QcYDGd/BUILD/rstudio-1.1.143/build/src/cpp/core/spelling/hunspell -O2 -fwrapv -pipe -Wformat -Werror=format-security -gdwarf-4 -fno-debug-types-section -fvar-tracking-assignments -g2 -Wp,-D_FORTIFY_SOURCE=2 -fstack-protector-strong --param=ssp-buffer-size=4 -Werror=trampolines -fomit-frame-pointer -march=i686 -fasynchronous-unwind-tables -mtune=pentium4 -gdwarf-4 -fno-debug-types-section -fvar-tracking-assignments -g2 -DNDEBUG -DQT_NO_DEBUG -Wall -pthread -Wformat -Wformat-security -fstack-protector --param ssp-buffer-size=4 -pie -fPIE -w -o CMakeFiles/rstudio-core-hunspell.dir/affentry.cxx.o -c /tmp/B.QcYDGd/BUILD/rstudio-1.1.143/src/cpp/core/spelling/hunspell/affentry.cxx make[2]: Leaving directory '/tmp/B.QcYDGd/BUILD/rstudio-1.1.143/build' make[2]: Entering directory '/tmp/B.QcYDGd/BUILD/rstudio-1.1.143/build' [ 2%] Building CXX object src/cpp/core/spelling/hunspell/CMakeFiles/rstudio-core-hunspell.dir/hunzip.cxx.o cd /tmp/B.QcYDGd/BUILD/rstudio-1.1.143/build/src/cpp/core/spelling/hunspell && /usr/bin/i686-pld-linux-g++ -DBOOST_ASIO_DISABLE_KQUEUE -DBOOST_ENABLE_ASSERT_HANDLER -DBOOST_SIGNALS_NO_DEPRECATION_WARNING -DRSTUDIO_BOOST_NAMESPACE=boost -D_FORTIFY_SOURCE=2 -I/tmp/B.QcYDGd/BUILD/rstudio-1.1.143/build/src/cpp/core/spelling/hunspell -O2 -fwrapv -pipe -Wformat -Werror=format-security -gdwarf-4 -fno-debug-types-section -fvar-tracking-assignments -g2 -Wp,-D_FORTIFY_SOURCE=2 -fstack-protector-strong --param=ssp-buffer-size=4 -Werror=trampolines -fomit-frame-pointer -march=i686 -fasynchronous-unwind-tables -mtune=pentium4 -gdwarf-4 -fno-debug-types-section -fvar-tracking-assignments -g2 -DNDEBUG -DQT_NO_DEBUG -Wall -pthread -Wformat -Wformat-security -fstack-protector --param ssp-buffer-size=4 -pie -fPIE -w -o CMakeFiles/rstudio-core-hunspell.dir/hunzip.cxx.o -c /tmp/B.QcYDGd/BUILD/rstudio-1.1.143/src/cpp/core/spelling/hunspell/hunzip.cxx make[2]: Leaving directory '/tmp/B.QcYDGd/BUILD/rstudio-1.1.143/build' make[2]: Entering directory '/tmp/B.QcYDGd/BUILD/rstudio-1.1.143/build' [ 2%] Building CXX object src/cpp/core/spelling/hunspell/CMakeFiles/rstudio-core-hunspell.dir/replist.cxx.o cd /tmp/B.QcYDGd/BUILD/rstudio-1.1.143/build/src/cpp/core/spelling/hunspell && /usr/bin/i686-pld-linux-g++ -DBOOST_ASIO_DISABLE_KQUEUE -DBOOST_ENABLE_ASSERT_HANDLER -DBOOST_SIGNALS_NO_DEPRECATION_WARNING -DRSTUDIO_BOOST_NAMESPACE=boost -D_FORTIFY_SOURCE=2 -I/tmp/B.QcYDGd/BUILD/rstudio-1.1.143/build/src/cpp/core/spelling/hunspell -O2 -fwrapv -pipe -Wformat -Werror=format-security -gdwarf-4 -fno-debug-types-section -fvar-tracking-assignments -g2 -Wp,-D_FORTIFY_SOURCE=2 -fstack-protector-strong --param=ssp-buffer-size=4 -Werror=trampolines -fomit-frame-pointer -march=i686 -fasynchronous-unwind-tables -mtune=pentium4 -gdwarf-4 -fno-debug-types-section -fvar-tracking-assignments -g2 -DNDEBUG -DQT_NO_DEBUG -Wall -pthread -Wformat -Wformat-security -fstack-protector --param ssp-buffer-size=4 -pie -fPIE -w -o CMakeFiles/rstudio-core-hunspell.dir/replist.cxx.o -c /tmp/B.QcYDGd/BUILD/rstudio-1.1.143/src/cpp/core/spelling/hunspell/replist.cxx make[2]: Leaving directory '/tmp/B.QcYDGd/BUILD/rstudio-1.1.143/build' make[2]: Entering directory '/tmp/B.QcYDGd/BUILD/rstudio-1.1.143/build' [ 0%] Building CXX object src/cpp/core/spelling/hunspell/CMakeFiles/rstudio-core-hunspell.dir/csutil.cxx.o cd /tmp/B.QcYDGd/BUILD/rstudio-1.1.143/build/src/cpp/core/spelling/hunspell && /usr/bin/i686-pld-linux-g++ -DBOOST_ASIO_DISABLE_KQUEUE -DBOOST_ENABLE_ASSERT_HANDLER -DBOOST_SIGNALS_NO_DEPRECATION_WARNING -DRSTUDIO_BOOST_NAMESPACE=boost -D_FORTIFY_SOURCE=2 -I/tmp/B.QcYDGd/BUILD/rstudio-1.1.143/build/src/cpp/core/spelling/hunspell -O2 -fwrapv -pipe -Wformat -Werror=format-security -gdwarf-4 -fno-debug-types-section -fvar-tracking-assignments -g2 -Wp,-D_FORTIFY_SOURCE=2 -fstack-protector-strong --param=ssp-buffer-size=4 -Werror=trampolines -fomit-frame-pointer -march=i686 -fasynchronous-unwind-tables -mtune=pentium4 -gdwarf-4 -fno-debug-types-section -fvar-tracking-assignments -g2 -DNDEBUG -DQT_NO_DEBUG -Wall -pthread -Wformat -Wformat-security -fstack-protector --param ssp-buffer-size=4 -pie -fPIE -w -o CMakeFiles/rstudio-core-hunspell.dir/csutil.cxx.o -c /tmp/B.QcYDGd/BUILD/rstudio-1.1.143/src/cpp/core/spelling/hunspell/csutil.cxx make[2]: Leaving directory '/tmp/B.QcYDGd/BUILD/rstudio-1.1.143/build' make[2]: Entering directory '/tmp/B.QcYDGd/BUILD/rstudio-1.1.143/build' [ 1%] Building CXX object src/cpp/core/CMakeFiles/rstudio-core.dir/Assert.cpp.o cd /tmp/B.QcYDGd/BUILD/rstudio-1.1.143/build/src/cpp/core && /usr/bin/i686-pld-linux-g++ -DBOOST_ASIO_DISABLE_KQUEUE -DBOOST_ENABLE_ASSERT_HANDLER -DBOOST_SIGNALS_NO_DEPRECATION_WARNING -DRSTUDIO_BOOST_NAMESPACE=boost -D_FORTIFY_SOURCE=2 -I/tmp/B.QcYDGd/BUILD/rstudio-1.1.143/src/cpp/core/include -I/tmp/B.QcYDGd/BUILD/rstudio-1.1.143/build/src/cpp/core -I/tmp/B.QcYDGd/BUILD/rstudio-1.1.143/src/cpp/tests/cpp -O2 -fwrapv -pipe -Wformat -Werror=format-security -gdwarf-4 -fno-debug-types-section -fvar-tracking-assignments -g2 -Wp,-D_FORTIFY_SOURCE=2 -fstack-protector-strong --param=ssp-buffer-size=4 -Werror=trampolines -fomit-frame-pointer -march=i686 -fasynchronous-unwind-tables -mtune=pentium4 -gdwarf-4 -fno-debug-types-section -fvar-tracking-assignments -g2 -DNDEBUG -DQT_NO_DEBUG -Wall -pthread -Wformat -Wformat-security -fstack-protector --param ssp-buffer-size=4 -pie -fPIE -o CMakeFiles/rstudio-core.dir/Assert.cpp.o -c /tmp/B.QcYDGd/BUILD/rstudio-1.1.143/src/cpp/core/Assert.cpp make[2]: Leaving directory '/tmp/B.QcYDGd/BUILD/rstudio-1.1.143/build' make[2]: Entering directory '/tmp/B.QcYDGd/BUILD/rstudio-1.1.143/build' [ 1%] Building CXX object src/cpp/core/spelling/hunspell/CMakeFiles/rstudio-core-hunspell.dir/suggestmgr.cxx.o cd /tmp/B.QcYDGd/BUILD/rstudio-1.1.143/build/src/cpp/core/spelling/hunspell && /usr/bin/i686-pld-linux-g++ -DBOOST_ASIO_DISABLE_KQUEUE -DBOOST_ENABLE_ASSERT_HANDLER -DBOOST_SIGNALS_NO_DEPRECATION_WARNING -DRSTUDIO_BOOST_NAMESPACE=boost -D_FORTIFY_SOURCE=2 -I/tmp/B.QcYDGd/BUILD/rstudio-1.1.143/build/src/cpp/core/spelling/hunspell -O2 -fwrapv -pipe -Wformat -Werror=format-security -gdwarf-4 -fno-debug-types-section -fvar-tracking-assignments -g2 -Wp,-D_FORTIFY_SOURCE=2 -fstack-protector-strong --param=ssp-buffer-size=4 -Werror=trampolines -fomit-frame-pointer -march=i686 -fasynchronous-unwind-tables -mtune=pentium4 -gdwarf-4 -fno-debug-types-section -fvar-tracking-assignments -g2 -DNDEBUG -DQT_NO_DEBUG -Wall -pthread -Wformat -Wformat-security -fstack-protector --param ssp-buffer-size=4 -pie -fPIE -w -o CMakeFiles/rstudio-core-hunspell.dir/suggestmgr.cxx.o -c /tmp/B.QcYDGd/BUILD/rstudio-1.1.143/src/cpp/core/spelling/hunspell/suggestmgr.cxx make[2]: Leaving directory '/tmp/B.QcYDGd/BUILD/rstudio-1.1.143/build' make[2]: Entering directory '/tmp/B.QcYDGd/BUILD/rstudio-1.1.143/build' [ 2%] Building CXX object src/cpp/core/spelling/hunspell/CMakeFiles/rstudio-core-hunspell.dir/hunspell.cxx.o cd /tmp/B.QcYDGd/BUILD/rstudio-1.1.143/build/src/cpp/core/spelling/hunspell && /usr/bin/i686-pld-linux-g++ -DBOOST_ASIO_DISABLE_KQUEUE -DBOOST_ENABLE_ASSERT_HANDLER -DBOOST_SIGNALS_NO_DEPRECATION_WARNING -DRSTUDIO_BOOST_NAMESPACE=boost -D_FORTIFY_SOURCE=2 -I/tmp/B.QcYDGd/BUILD/rstudio-1.1.143/build/src/cpp/core/spelling/hunspell -O2 -fwrapv -pipe -Wformat -Werror=format-security -gdwarf-4 -fno-debug-types-section -fvar-tracking-assignments -g2 -Wp,-D_FORTIFY_SOURCE=2 -fstack-protector-strong --param=ssp-buffer-size=4 -Werror=trampolines -fomit-frame-pointer -march=i686 -fasynchronous-unwind-tables -mtune=pentium4 -gdwarf-4 -fno-debug-types-section -fvar-tracking-assignments -g2 -DNDEBUG -DQT_NO_DEBUG -Wall -pthread -Wformat -Wformat-security -fstack-protector --param ssp-buffer-size=4 -pie -fPIE -w -o CMakeFiles/rstudio-core-hunspell.dir/hunspell.cxx.o -c /tmp/B.QcYDGd/BUILD/rstudio-1.1.143/src/cpp/core/spelling/hunspell/hunspell.cxx make[2]: Leaving directory '/tmp/B.QcYDGd/BUILD/rstudio-1.1.143/build' make[2]: Entering directory '/tmp/B.QcYDGd/BUILD/rstudio-1.1.143/build' [ 0%] Building C object src/cpp/core/tex/synctex/CMakeFiles/rstudio-core-synctex.dir/synctex_parser.c.o cd /tmp/B.QcYDGd/BUILD/rstudio-1.1.143/build/src/cpp/core/tex/synctex && /usr/bin/i686-pld-linux-gcc -DBOOST_ASIO_DISABLE_KQUEUE -DBOOST_ENABLE_ASSERT_HANDLER -DBOOST_SIGNALS_NO_DEPRECATION_WARNING -DRSTUDIO_BOOST_NAMESPACE=boost -D_FORTIFY_SOURCE=2 -I/tmp/B.QcYDGd/BUILD/rstudio-1.1.143/src/cpp/core/tex/synctex -O2 -fwrapv -pipe -Wformat -Werror=format-security -gdwarf-4 -fno-debug-types-section -fvar-tracking-assignments -g2 -Wp,-D_FORTIFY_SOURCE=2 -fstack-protector-strong --param=ssp-buffer-size=4 -Werror=trampolines -fomit-frame-pointer -march=i686 -fasynchronous-unwind-tables -mtune=pentium4 -gdwarf-4 -fno-debug-types-section -fvar-tracking-assignments -g2 -DNDEBUG -DQT_NO_DEBUG -Wall -pthread -Wformat -Wformat-security -fstack-protector --param ssp-buffer-size=4 -pie -fPIE -o CMakeFiles/rstudio-core-synctex.dir/synctex_parser.c.o -c /tmp/B.QcYDGd/BUILD/rstudio-1.1.143/src/cpp/core/tex/synctex/synctex_parser.c make[2]: Leaving directory '/tmp/B.QcYDGd/BUILD/rstudio-1.1.143/build' make[2]: Entering directory '/tmp/B.QcYDGd/BUILD/rstudio-1.1.143/build' [ 4%] Linking C static library librstudio-core-synctex.a cd /tmp/B.QcYDGd/BUILD/rstudio-1.1.143/build/src/cpp/core/tex/synctex && /usr/bin/cmake -P CMakeFiles/rstudio-core-synctex.dir/cmake_clean_target.cmake cd /tmp/B.QcYDGd/BUILD/rstudio-1.1.143/build/src/cpp/core/tex/synctex && /usr/bin/cmake -E cmake_link_script CMakeFiles/rstudio-core-synctex.dir/link.txt --verbose=1 /usr/bin/ar qc librstudio-core-synctex.a CMakeFiles/rstudio-core-synctex.dir/synctex_parser.c.o CMakeFiles/rstudio-core-synctex.dir/synctex_parser_utils.c.o /usr/bin/ranlib librstudio-core-synctex.a make[2]: Leaving directory '/tmp/B.QcYDGd/BUILD/rstudio-1.1.143/build' make[1]: Entering directory '/tmp/B.QcYDGd/BUILD/rstudio-1.1.143/build' [ 4%] Built target rstudio-core-synctex make[1]: Leaving directory '/tmp/B.QcYDGd/BUILD/rstudio-1.1.143/build' make[2]: Entering directory '/tmp/B.QcYDGd/BUILD/rstudio-1.1.143/build' [ 0%] Building CXX object src/cpp/core/spelling/hunspell/CMakeFiles/rstudio-core-hunspell.dir/affixmgr.cxx.o cd /tmp/B.QcYDGd/BUILD/rstudio-1.1.143/build/src/cpp/core/spelling/hunspell && /usr/bin/i686-pld-linux-g++ -DBOOST_ASIO_DISABLE_KQUEUE -DBOOST_ENABLE_ASSERT_HANDLER -DBOOST_SIGNALS_NO_DEPRECATION_WARNING -DRSTUDIO_BOOST_NAMESPACE=boost -D_FORTIFY_SOURCE=2 -I/tmp/B.QcYDGd/BUILD/rstudio-1.1.143/build/src/cpp/core/spelling/hunspell -O2 -fwrapv -pipe -Wformat -Werror=format-security -gdwarf-4 -fno-debug-types-section -fvar-tracking-assignments -g2 -Wp,-D_FORTIFY_SOURCE=2 -fstack-protector-strong --param=ssp-buffer-size=4 -Werror=trampolines -fomit-frame-pointer -march=i686 -fasynchronous-unwind-tables -mtune=pentium4 -gdwarf-4 -fno-debug-types-section -fvar-tracking-assignments -g2 -DNDEBUG -DQT_NO_DEBUG -Wall -pthread -Wformat -Wformat-security -fstack-protector --param ssp-buffer-size=4 -pie -fPIE -w -o CMakeFiles/rstudio-core-hunspell.dir/affixmgr.cxx.o -c /tmp/B.QcYDGd/BUILD/rstudio-1.1.143/src/cpp/core/spelling/hunspell/affixmgr.cxx make[2]: Leaving directory '/tmp/B.QcYDGd/BUILD/rstudio-1.1.143/build' make[2]: Entering directory '/tmp/B.QcYDGd/BUILD/rstudio-1.1.143/build' [ 5%] Linking CXX static library librstudio-core-hunspell.a cd /tmp/B.QcYDGd/BUILD/rstudio-1.1.143/build/src/cpp/core/spelling/hunspell && /usr/bin/cmake -P CMakeFiles/rstudio-core-hunspell.dir/cmake_clean_target.cmake cd /tmp/B.QcYDGd/BUILD/rstudio-1.1.143/build/src/cpp/core/spelling/hunspell && /usr/bin/cmake -E cmake_link_script CMakeFiles/rstudio-core-hunspell.dir/link.txt --verbose=1 /usr/bin/ar qc librstudio-core-hunspell.a CMakeFiles/rstudio-core-hunspell.dir/affentry.cxx.o CMakeFiles/rstudio-core-hunspell.dir/affixmgr.cxx.o CMakeFiles/rstudio-core-hunspell.dir/csutil.cxx.o CMakeFiles/rstudio-core-hunspell.dir/dictmgr.cxx.o CMakeFiles/rstudio-core-hunspell.dir/hashmgr.cxx.o CMakeFiles/rstudio-core-hunspell.dir/suggestmgr.cxx.o CMakeFiles/rstudio-core-hunspell.dir/phonet.cxx.o CMakeFiles/rstudio-core-hunspell.dir/filemgr.cxx.o CMakeFiles/rstudio-core-hunspell.dir/hunzip.cxx.o CMakeFiles/rstudio-core-hunspell.dir/hunspell.cxx.o CMakeFiles/rstudio-core-hunspell.dir/replist.cxx.o /usr/bin/ranlib librstudio-core-hunspell.a make[2]: Leaving directory '/tmp/B.QcYDGd/BUILD/rstudio-1.1.143/build' make[1]: Entering directory '/tmp/B.QcYDGd/BUILD/rstudio-1.1.143/build' [ 5%] Built target rstudio-core-hunspell make[1]: Leaving directory '/tmp/B.QcYDGd/BUILD/rstudio-1.1.143/build' make[2]: Entering directory '/tmp/B.QcYDGd/BUILD/rstudio-1.1.143/build' [ 3%] Building CXX object src/cpp/core/CMakeFiles/rstudio-core.dir/Base64.cpp.o cd /tmp/B.QcYDGd/BUILD/rstudio-1.1.143/build/src/cpp/core && /usr/bin/i686-pld-linux-g++ -DBOOST_ASIO_DISABLE_KQUEUE -DBOOST_ENABLE_ASSERT_HANDLER -DBOOST_SIGNALS_NO_DEPRECATION_WARNING -DRSTUDIO_BOOST_NAMESPACE=boost -D_FORTIFY_SOURCE=2 -I/tmp/B.QcYDGd/BUILD/rstudio-1.1.143/src/cpp/core/include -I/tmp/B.QcYDGd/BUILD/rstudio-1.1.143/build/src/cpp/core -I/tmp/B.QcYDGd/BUILD/rstudio-1.1.143/src/cpp/tests/cpp -O2 -fwrapv -pipe -Wformat -Werror=format-security -gdwarf-4 -fno-debug-types-section -fvar-tracking-assignments -g2 -Wp,-D_FORTIFY_SOURCE=2 -fstack-protector-strong --param=ssp-buffer-size=4 -Werror=trampolines -fomit-frame-pointer -march=i686 -fasynchronous-unwind-tables -mtune=pentium4 -gdwarf-4 -fno-debug-types-section -fvar-tracking-assignments -g2 -DNDEBUG -DQT_NO_DEBUG -Wall -pthread -Wformat -Wformat-security -fstack-protector --param ssp-buffer-size=4 -pie -fPIE -o CMakeFiles/rstudio-core.dir/Base64.cpp.o -c /tmp/B.QcYDGd/BUILD/rstudio-1.1.143/src/cpp/core/Base64.cpp In file included from /usr/include/boost/bind.hpp:30, from /usr/include/boost/iostreams/copy.hpp:26, from /tmp/B.QcYDGd/BUILD/rstudio-1.1.143/src/cpp/core/include/core/FileSerializer.hpp:25, from /tmp/B.QcYDGd/BUILD/rstudio-1.1.143/src/cpp/core/Base64.cpp:19: /usr/include/boost/bind.hpp:36:1: note: '#pragma message: The practice of declaring the Bind placeholders (_1, _2, ...) in the global namespace is deprecated. Please use <boost/bind/bind.hpp> + using namespace boost::placeholders, or define BOOST_BIND_GLOBAL_PLACEHOLDERS to retain the current behavior.' 36 | BOOST_PRAGMA_MESSAGE( | ^~~~~~~~~~~~~~~~~~~~ make[2]: Leaving directory '/tmp/B.QcYDGd/BUILD/rstudio-1.1.143/build' make[2]: Entering directory '/tmp/B.QcYDGd/BUILD/rstudio-1.1.143/build' [ 5%] Building CXX object src/cpp/core/CMakeFiles/rstudio-core.dir/Exec.cpp.o cd /tmp/B.QcYDGd/BUILD/rstudio-1.1.143/build/src/cpp/core && /usr/bin/i686-pld-linux-g++ -DBOOST_ASIO_DISABLE_KQUEUE -DBOOST_ENABLE_ASSERT_HANDLER -DBOOST_SIGNALS_NO_DEPRECATION_WARNING -DRSTUDIO_BOOST_NAMESPACE=boost -D_FORTIFY_SOURCE=2 -I/tmp/B.QcYDGd/BUILD/rstudio-1.1.143/src/cpp/core/include -I/tmp/B.QcYDGd/BUILD/rstudio-1.1.143/build/src/cpp/core -I/tmp/B.QcYDGd/BUILD/rstudio-1.1.143/src/cpp/tests/cpp -O2 -fwrapv -pipe -Wformat -Werror=format-security -gdwarf-4 -fno-debug-types-section -fvar-tracking-assignments -g2 -Wp,-D_FORTIFY_SOURCE=2 -fstack-protector-strong --param=ssp-buffer-size=4 -Werror=trampolines -fomit-frame-pointer -march=i686 -fasynchronous-unwind-tables -mtune=pentium4 -gdwarf-4 -fno-debug-types-section -fvar-tracking-assignments -g2 -DNDEBUG -DQT_NO_DEBUG -Wall -pthread -Wformat -Wformat-security -fstack-protector --param ssp-buffer-size=4 -pie -fPIE -o CMakeFiles/rstudio-core.dir/Exec.cpp.o -c /tmp/B.QcYDGd/BUILD/rstudio-1.1.143/src/cpp/core/Exec.cpp make[2]: Leaving directory '/tmp/B.QcYDGd/BUILD/rstudio-1.1.143/build' make[2]: Entering directory '/tmp/B.QcYDGd/BUILD/rstudio-1.1.143/build' [ 3%] Building CXX object src/cpp/core/CMakeFiles/rstudio-core.dir/BoostErrors.cpp.o cd /tmp/B.QcYDGd/BUILD/rstudio-1.1.143/build/src/cpp/core && /usr/bin/i686-pld-linux-g++ -DBOOST_ASIO_DISABLE_KQUEUE -DBOOST_ENABLE_ASSERT_HANDLER -DBOOST_SIGNALS_NO_DEPRECATION_WARNING -DRSTUDIO_BOOST_NAMESPACE=boost -D_FORTIFY_SOURCE=2 -I/tmp/B.QcYDGd/BUILD/rstudio-1.1.143/src/cpp/core/include -I/tmp/B.QcYDGd/BUILD/rstudio-1.1.143/build/src/cpp/core -I/tmp/B.QcYDGd/BUILD/rstudio-1.1.143/src/cpp/tests/cpp -O2 -fwrapv -pipe -Wformat -Werror=format-security -gdwarf-4 -fno-debug-types-section -fvar-tracking-assignments -g2 -Wp,-D_FORTIFY_SOURCE=2 -fstack-protector-strong --param=ssp-buffer-size=4 -Werror=trampolines -fomit-frame-pointer -march=i686 -fasynchronous-unwind-tables -mtune=pentium4 -gdwarf-4 -fno-debug-types-section -fvar-tracking-assignments -g2 -DNDEBUG -DQT_NO_DEBUG -Wall -pthread -Wformat -Wformat-security -fstack-protector --param ssp-buffer-size=4 -pie -fPIE -o CMakeFiles/rstudio-core.dir/BoostErrors.cpp.o -c /tmp/B.QcYDGd/BUILD/rstudio-1.1.143/src/cpp/core/BoostErrors.cpp make[2]: Leaving directory '/tmp/B.QcYDGd/BUILD/rstudio-1.1.143/build' make[2]: Entering directory '/tmp/B.QcYDGd/BUILD/rstudio-1.1.143/build' [ 5%] Building CXX object src/cpp/core/CMakeFiles/rstudio-core.dir/FileInfo.cpp.o cd /tmp/B.QcYDGd/BUILD/rstudio-1.1.143/build/src/cpp/core && /usr/bin/i686-pld-linux-g++ -DBOOST_ASIO_DISABLE_KQUEUE -DBOOST_ENABLE_ASSERT_HANDLER -DBOOST_SIGNALS_NO_DEPRECATION_WARNING -DRSTUDIO_BOOST_NAMESPACE=boost -D_FORTIFY_SOURCE=2 -I/tmp/B.QcYDGd/BUILD/rstudio-1.1.143/src/cpp/core/include -I/tmp/B.QcYDGd/BUILD/rstudio-1.1.143/build/src/cpp/core -I/tmp/B.QcYDGd/BUILD/rstudio-1.1.143/src/cpp/tests/cpp -O2 -fwrapv -pipe -Wformat -Werror=format-security -gdwarf-4 -fno-debug-types-section -fvar-tracking-assignments -g2 -Wp,-D_FORTIFY_SOURCE=2 -fstack-protector-strong --param=ssp-buffer-size=4 -Werror=trampolines -fomit-frame-pointer -march=i686 -fasynchronous-unwind-tables -mtune=pentium4 -gdwarf-4 -fno-debug-types-section -fvar-tracking-assignments -g2 -DNDEBUG -DQT_NO_DEBUG -Wall -pthread -Wformat -Wformat-security -fstack-protector --param ssp-buffer-size=4 -pie -fPIE -o CMakeFiles/rstudio-core.dir/FileInfo.cpp.o -c /tmp/B.QcYDGd/BUILD/rstudio-1.1.143/src/cpp/core/FileInfo.cpp make[2]: Leaving directory '/tmp/B.QcYDGd/BUILD/rstudio-1.1.143/build' make[2]: Entering directory '/tmp/B.QcYDGd/BUILD/rstudio-1.1.143/build' [ 4%] Building CXX object src/cpp/core/CMakeFiles/rstudio-core.dir/Error.cpp.o cd /tmp/B.QcYDGd/BUILD/rstudio-1.1.143/build/src/cpp/core && /usr/bin/i686-pld-linux-g++ -DBOOST_ASIO_DISABLE_KQUEUE -DBOOST_ENABLE_ASSERT_HANDLER -DBOOST_SIGNALS_NO_DEPRECATION_WARNING -DRSTUDIO_BOOST_NAMESPACE=boost -D_FORTIFY_SOURCE=2 -I/tmp/B.QcYDGd/BUILD/rstudio-1.1.143/src/cpp/core/include -I/tmp/B.QcYDGd/BUILD/rstudio-1.1.143/build/src/cpp/core -I/tmp/B.QcYDGd/BUILD/rstudio-1.1.143/src/cpp/tests/cpp -O2 -fwrapv -pipe -Wformat -Werror=format-security -gdwarf-4 -fno-debug-types-section -fvar-tracking-assignments -g2 -Wp,-D_FORTIFY_SOURCE=2 -fstack-protector-strong --param=ssp-buffer-size=4 -Werror=trampolines -fomit-frame-pointer -march=i686 -fasynchronous-unwind-tables -mtune=pentium4 -gdwarf-4 -fno-debug-types-section -fvar-tracking-assignments -g2 -DNDEBUG -DQT_NO_DEBUG -Wall -pthread -Wformat -Wformat-security -fstack-protector --param ssp-buffer-size=4 -pie -fPIE -o CMakeFiles/rstudio-core.dir/Error.cpp.o -c /tmp/B.QcYDGd/BUILD/rstudio-1.1.143/src/cpp/core/Error.cpp make[2]: Leaving directory '/tmp/B.QcYDGd/BUILD/rstudio-1.1.143/build' make[2]: Entering directory '/tmp/B.QcYDGd/BUILD/rstudio-1.1.143/build' [ 4%] Building CXX object src/cpp/core/CMakeFiles/rstudio-core.dir/DateTime.cpp.o cd /tmp/B.QcYDGd/BUILD/rstudio-1.1.143/build/src/cpp/core && /usr/bin/i686-pld-linux-g++ -DBOOST_ASIO_DISABLE_KQUEUE -DBOOST_ENABLE_ASSERT_HANDLER -DBOOST_SIGNALS_NO_DEPRECATION_WARNING -DRSTUDIO_BOOST_NAMESPACE=boost -D_FORTIFY_SOURCE=2 -I/tmp/B.QcYDGd/BUILD/rstudio-1.1.143/src/cpp/core/include -I/tmp/B.QcYDGd/BUILD/rstudio-1.1.143/build/src/cpp/core -I/tmp/B.QcYDGd/BUILD/rstudio-1.1.143/src/cpp/tests/cpp -O2 -fwrapv -pipe -Wformat -Werror=format-security -gdwarf-4 -fno-debug-types-section -fvar-tracking-assignments -g2 -Wp,-D_FORTIFY_SOURCE=2 -fstack-protector-strong --param=ssp-buffer-size=4 -Werror=trampolines -fomit-frame-pointer -march=i686 -fasynchronous-unwind-tables -mtune=pentium4 -gdwarf-4 -fno-debug-types-section -fvar-tracking-assignments -g2 -DNDEBUG -DQT_NO_DEBUG -Wall -pthread -Wformat -Wformat-security -fstack-protector --param ssp-buffer-size=4 -pie -fPIE -o CMakeFiles/rstudio-core.dir/DateTime.cpp.o -c /tmp/B.QcYDGd/BUILD/rstudio-1.1.143/src/cpp/core/DateTime.cpp make[2]: Leaving directory '/tmp/B.QcYDGd/BUILD/rstudio-1.1.143/build' make[2]: Entering directory '/tmp/B.QcYDGd/BUILD/rstudio-1.1.143/build' [ 5%] Building CXX object src/cpp/core/CMakeFiles/rstudio-core.dir/FileLogWriter.cpp.o cd /tmp/B.QcYDGd/BUILD/rstudio-1.1.143/build/src/cpp/core && /usr/bin/i686-pld-linux-g++ -DBOOST_ASIO_DISABLE_KQUEUE -DBOOST_ENABLE_ASSERT_HANDLER -DBOOST_SIGNALS_NO_DEPRECATION_WARNING -DRSTUDIO_BOOST_NAMESPACE=boost -D_FORTIFY_SOURCE=2 -I/tmp/B.QcYDGd/BUILD/rstudio-1.1.143/src/cpp/core/include -I/tmp/B.QcYDGd/BUILD/rstudio-1.1.143/build/src/cpp/core -I/tmp/B.QcYDGd/BUILD/rstudio-1.1.143/src/cpp/tests/cpp -O2 -fwrapv -pipe -Wformat -Werror=format-security -gdwarf-4 -fno-debug-types-section -fvar-tracking-assignments -g2 -Wp,-D_FORTIFY_SOURCE=2 -fstack-protector-strong --param=ssp-buffer-size=4 -Werror=trampolines -fomit-frame-pointer -march=i686 -fasynchronous-unwind-tables -mtune=pentium4 -gdwarf-4 -fno-debug-types-section -fvar-tracking-assignments -g2 -DNDEBUG -DQT_NO_DEBUG -Wall -pthread -Wformat -Wformat-security -fstack-protector --param ssp-buffer-size=4 -pie -fPIE -o CMakeFiles/rstudio-core.dir/FileLogWriter.cpp.o -c /tmp/B.QcYDGd/BUILD/rstudio-1.1.143/src/cpp/core/FileLogWriter.cpp In file included from /usr/include/boost/bind.hpp:30, from /usr/include/boost/iostreams/copy.hpp:26, from /tmp/B.QcYDGd/BUILD/rstudio-1.1.143/src/cpp/core/include/core/FileSerializer.hpp:25, from /tmp/B.QcYDGd/BUILD/rstudio-1.1.143/src/cpp/core/FileLogWriter.cpp:20: /usr/include/boost/bind.hpp:36:1: note: '#pragma message: The practice of declaring the Bind placeholders (_1, _2, ...) in the global namespace is deprecated. Please use <boost/bind/bind.hpp> + using namespace boost::placeholders, or define BOOST_BIND_GLOBAL_PLACEHOLDERS to retain the current behavior.' 36 | BOOST_PRAGMA_MESSAGE( | ^~~~~~~~~~~~~~~~~~~~ make[2]: Leaving directory '/tmp/B.QcYDGd/BUILD/rstudio-1.1.143/build' make[2]: Entering directory '/tmp/B.QcYDGd/BUILD/rstudio-1.1.143/build' [ 6%] Building CXX object src/cpp/core/CMakeFiles/rstudio-core.dir/FilePath.cpp.o cd /tmp/B.QcYDGd/BUILD/rstudio-1.1.143/build/src/cpp/core && /usr/bin/i686-pld-linux-g++ -DBOOST_ASIO_DISABLE_KQUEUE -DBOOST_ENABLE_ASSERT_HANDLER -DBOOST_SIGNALS_NO_DEPRECATION_WARNING -DRSTUDIO_BOOST_NAMESPACE=boost -D_FORTIFY_SOURCE=2 -I/tmp/B.QcYDGd/BUILD/rstudio-1.1.143/src/cpp/core/include -I/tmp/B.QcYDGd/BUILD/rstudio-1.1.143/build/src/cpp/core -I/tmp/B.QcYDGd/BUILD/rstudio-1.1.143/src/cpp/tests/cpp -O2 -fwrapv -pipe -Wformat -Werror=format-security -gdwarf-4 -fno-debug-types-section -fvar-tracking-assignments -g2 -Wp,-D_FORTIFY_SOURCE=2 -fstack-protector-strong --param=ssp-buffer-size=4 -Werror=trampolines -fomit-frame-pointer -march=i686 -fasynchronous-unwind-tables -mtune=pentium4 -gdwarf-4 -fno-debug-types-section -fvar-tracking-assignments -g2 -DNDEBUG -DQT_NO_DEBUG -Wall -pthread -Wformat -Wformat-security -fstack-protector --param ssp-buffer-size=4 -pie -fPIE -o CMakeFiles/rstudio-core.dir/FilePath.cpp.o -c /tmp/B.QcYDGd/BUILD/rstudio-1.1.143/src/cpp/core/FilePath.cpp In file included from /usr/include/boost/bind.hpp:30, from /tmp/B.QcYDGd/BUILD/rstudio-1.1.143/src/cpp/core/FilePath.cpp:33: /usr/include/boost/bind.hpp:36:1: note: '#pragma message: The practice of declaring the Bind placeholders (_1, _2, ...) in the global namespace is deprecated. Please use <boost/bind/bind.hpp> + using namespace boost::placeholders, or define BOOST_BIND_GLOBAL_PLACEHOLDERS to retain the current behavior.' 36 | BOOST_PRAGMA_MESSAGE( | ^~~~~~~~~~~~~~~~~~~~ /tmp/B.QcYDGd/BUILD/rstudio-1.1.143/src/cpp/core/FilePath.cpp: In member function 'rstudio::core::Error rstudio::core::FilePath::childrenRecursive(rstudio::core::FilePath::RecursiveIterationFunction) const': /tmp/B.QcYDGd/BUILD/rstudio-1.1.143/src/cpp/core/FilePath.cpp:1023:37: error: 'rstudio::core::{anonymous}::recursive_dir_iterator' {aka 'class boost::filesystem::recursive_directory_iterator'} has no member named 'level' 1023 | if (!iterationFunction(itr.level(), | ^~~~~ make[2]: *** [src/cpp/core/CMakeFiles/rstudio-core.dir/build.make:229: src/cpp/core/CMakeFiles/rstudio-core.dir/FilePath.cpp.o] Error 1 make[2]: Leaving directory '/tmp/B.QcYDGd/BUILD/rstudio-1.1.143/build' make[2]: *** Waiting for unfinished jobs.... make[2]: Entering directory '/tmp/B.QcYDGd/BUILD/rstudio-1.1.143/build' [ 6%] Building CXX object src/cpp/core/CMakeFiles/rstudio-core.dir/FileUtils.cpp.o cd /tmp/B.QcYDGd/BUILD/rstudio-1.1.143/build/src/cpp/core && /usr/bin/i686-pld-linux-g++ -DBOOST_ASIO_DISABLE_KQUEUE -DBOOST_ENABLE_ASSERT_HANDLER -DBOOST_SIGNALS_NO_DEPRECATION_WARNING -DRSTUDIO_BOOST_NAMESPACE=boost -D_FORTIFY_SOURCE=2 -I/tmp/B.QcYDGd/BUILD/rstudio-1.1.143/src/cpp/core/include -I/tmp/B.QcYDGd/BUILD/rstudio-1.1.143/build/src/cpp/core -I/tmp/B.QcYDGd/BUILD/rstudio-1.1.143/src/cpp/tests/cpp -O2 -fwrapv -pipe -Wformat -Werror=format-security -gdwarf-4 -fno-debug-types-section -fvar-tracking-assignments -g2 -Wp,-D_FORTIFY_SOURCE=2 -fstack-protector-strong --param=ssp-buffer-size=4 -Werror=trampolines -fomit-frame-pointer -march=i686 -fasynchronous-unwind-tables -mtune=pentium4 -gdwarf-4 -fno-debug-types-section -fvar-tracking-assignments -g2 -DNDEBUG -DQT_NO_DEBUG -Wall -pthread -Wformat -Wformat-security -fstack-protector --param ssp-buffer-size=4 -pie -fPIE -o CMakeFiles/rstudio-core.dir/FileUtils.cpp.o -c /tmp/B.QcYDGd/BUILD/rstudio-1.1.143/src/cpp/core/FileUtils.cpp In file included from /usr/include/boost/bind.hpp:30, from /tmp/B.QcYDGd/BUILD/rstudio-1.1.143/src/cpp/core/FileUtils.cpp:19: /usr/include/boost/bind.hpp:36:1: note: '#pragma message: The practice of declaring the Bind placeholders (_1, _2, ...) in the global namespace is deprecated. Please use <boost/bind/bind.hpp> + using namespace boost::placeholders, or define BOOST_BIND_GLOBAL_PLACEHOLDERS to retain the current behavior.' 36 | BOOST_PRAGMA_MESSAGE( | ^~~~~~~~~~~~~~~~~~~~ make[2]: Leaving directory '/tmp/B.QcYDGd/BUILD/rstudio-1.1.143/build' make[2]: Entering directory '/tmp/B.QcYDGd/BUILD/rstudio-1.1.143/build' [ 3%] Building CXX object src/cpp/core/CMakeFiles/rstudio-core.dir/ConfigUtils.cpp.o cd /tmp/B.QcYDGd/BUILD/rstudio-1.1.143/build/src/cpp/core && /usr/bin/i686-pld-linux-g++ -DBOOST_ASIO_DISABLE_KQUEUE -DBOOST_ENABLE_ASSERT_HANDLER -DBOOST_SIGNALS_NO_DEPRECATION_WARNING -DRSTUDIO_BOOST_NAMESPACE=boost -D_FORTIFY_SOURCE=2 -I/tmp/B.QcYDGd/BUILD/rstudio-1.1.143/src/cpp/core/include -I/tmp/B.QcYDGd/BUILD/rstudio-1.1.143/build/src/cpp/core -I/tmp/B.QcYDGd/BUILD/rstudio-1.1.143/src/cpp/tests/cpp -O2 -fwrapv -pipe -Wformat -Werror=format-security -gdwarf-4 -fno-debug-types-section -fvar-tracking-assignments -g2 -Wp,-D_FORTIFY_SOURCE=2 -fstack-protector-strong --param=ssp-buffer-size=4 -Werror=trampolines -fomit-frame-pointer -march=i686 -fasynchronous-unwind-tables -mtune=pentium4 -gdwarf-4 -fno-debug-types-section -fvar-tracking-assignments -g2 -DNDEBUG -DQT_NO_DEBUG -Wall -pthread -Wformat -Wformat-security -fstack-protector --param ssp-buffer-size=4 -pie -fPIE -o CMakeFiles/rstudio-core.dir/ConfigUtils.cpp.o -c /tmp/B.QcYDGd/BUILD/rstudio-1.1.143/src/cpp/core/ConfigUtils.cpp In file included from /usr/include/boost/bind.hpp:30, from /tmp/B.QcYDGd/BUILD/rstudio-1.1.143/src/cpp/core/ConfigUtils.cpp:21: /usr/include/boost/bind.hpp:36:1: note: '#pragma message: The practice of declaring the Bind placeholders (_1, _2, ...) in the global namespace is deprecated. Please use <boost/bind/bind.hpp> + using namespace boost::placeholders, or define BOOST_BIND_GLOBAL_PLACEHOLDERS to retain the current behavior.' 36 | BOOST_PRAGMA_MESSAGE( | ^~~~~~~~~~~~~~~~~~~~ make[2]: Leaving directory '/tmp/B.QcYDGd/BUILD/rstudio-1.1.143/build' make[2]: Entering directory '/tmp/B.QcYDGd/BUILD/rstudio-1.1.143/build' [ 6%] Building CXX object src/cpp/core/CMakeFiles/rstudio-core.dir/FileSerializer.cpp.o cd /tmp/B.QcYDGd/BUILD/rstudio-1.1.143/build/src/cpp/core && /usr/bin/i686-pld-linux-g++ -DBOOST_ASIO_DISABLE_KQUEUE -DBOOST_ENABLE_ASSERT_HANDLER -DBOOST_SIGNALS_NO_DEPRECATION_WARNING -DRSTUDIO_BOOST_NAMESPACE=boost -D_FORTIFY_SOURCE=2 -I/tmp/B.QcYDGd/BUILD/rstudio-1.1.143/src/cpp/core/include -I/tmp/B.QcYDGd/BUILD/rstudio-1.1.143/build/src/cpp/core -I/tmp/B.QcYDGd/BUILD/rstudio-1.1.143/src/cpp/tests/cpp -O2 -fwrapv -pipe -Wformat -Werror=format-security -gdwarf-4 -fno-debug-types-section -fvar-tracking-assignments -g2 -Wp,-D_FORTIFY_SOURCE=2 -fstack-protector-strong --param=ssp-buffer-size=4 -Werror=trampolines -fomit-frame-pointer -march=i686 -fasynchronous-unwind-tables -mtune=pentium4 -gdwarf-4 -fno-debug-types-section -fvar-tracking-assignments -g2 -DNDEBUG -DQT_NO_DEBUG -Wall -pthread -Wformat -Wformat-security -fstack-protector --param ssp-buffer-size=4 -pie -fPIE -o CMakeFiles/rstudio-core.dir/FileSerializer.cpp.o -c /tmp/B.QcYDGd/BUILD/rstudio-1.1.143/src/cpp/core/FileSerializer.cpp In file included from /usr/include/boost/bind.hpp:30, from /usr/include/boost/iostreams/copy.hpp:26, from /tmp/B.QcYDGd/BUILD/rstudio-1.1.143/src/cpp/core/include/core/FileSerializer.hpp:25, from /tmp/B.QcYDGd/BUILD/rstudio-1.1.143/src/cpp/core/FileSerializer.cpp:16: /usr/include/boost/bind.hpp:36:1: note: '#pragma message: The practice of declaring the Bind placeholders (_1, _2, ...) in the global namespace is deprecated. Please use <boost/bind/bind.hpp> + using namespace boost::placeholders, or define BOOST_BIND_GLOBAL_PLACEHOLDERS to retain the current behavior.' 36 | BOOST_PRAGMA_MESSAGE( | ^~~~~~~~~~~~~~~~~~~~ make[2]: Leaving directory '/tmp/B.QcYDGd/BUILD/rstudio-1.1.143/build' make[2]: Entering directory '/tmp/B.QcYDGd/BUILD/rstudio-1.1.143/build' [ 7%] Building CXX object src/cpp/core/CMakeFiles/rstudio-core.dir/Hash.cpp.o cd /tmp/B.QcYDGd/BUILD/rstudio-1.1.143/build/src/cpp/core && /usr/bin/i686-pld-linux-g++ -DBOOST_ASIO_DISABLE_KQUEUE -DBOOST_ENABLE_ASSERT_HANDLER -DBOOST_SIGNALS_NO_DEPRECATION_WARNING -DRSTUDIO_BOOST_NAMESPACE=boost -D_FORTIFY_SOURCE=2 -I/tmp/B.QcYDGd/BUILD/rstudio-1.1.143/src/cpp/core/include -I/tmp/B.QcYDGd/BUILD/rstudio-1.1.143/build/src/cpp/core -I/tmp/B.QcYDGd/BUILD/rstudio-1.1.143/src/cpp/tests/cpp -O2 -fwrapv -pipe -Wformat -Werror=format-security -gdwarf-4 -fno-debug-types-section -fvar-tracking-assignments -g2 -Wp,-D_FORTIFY_SOURCE=2 -fstack-protector-strong --param=ssp-buffer-size=4 -Werror=trampolines -fomit-frame-pointer -march=i686 -fasynchronous-unwind-tables -mtune=pentium4 -gdwarf-4 -fno-debug-types-section -fvar-tracking-assignments -g2 -DNDEBUG -DQT_NO_DEBUG -Wall -pthread -Wformat -Wformat-security -fstack-protector --param ssp-buffer-size=4 -pie -fPIE -o CMakeFiles/rstudio-core.dir/Hash.cpp.o -c /tmp/B.QcYDGd/BUILD/rstudio-1.1.143/src/cpp/core/Hash.cpp make[2]: Leaving directory '/tmp/B.QcYDGd/BUILD/rstudio-1.1.143/build' make[2]: Entering directory '/tmp/B.QcYDGd/BUILD/rstudio-1.1.143/build' [ 6%] Building CXX object src/cpp/core/CMakeFiles/rstudio-core.dir/GitGraph.cpp.o cd /tmp/B.QcYDGd/BUILD/rstudio-1.1.143/build/src/cpp/core && /usr/bin/i686-pld-linux-g++ -DBOOST_ASIO_DISABLE_KQUEUE -DBOOST_ENABLE_ASSERT_HANDLER -DBOOST_SIGNALS_NO_DEPRECATION_WARNING -DRSTUDIO_BOOST_NAMESPACE=boost -D_FORTIFY_SOURCE=2 -I/tmp/B.QcYDGd/BUILD/rstudio-1.1.143/src/cpp/core/include -I/tmp/B.QcYDGd/BUILD/rstudio-1.1.143/build/src/cpp/core -I/tmp/B.QcYDGd/BUILD/rstudio-1.1.143/src/cpp/tests/cpp -O2 -fwrapv -pipe -Wformat -Werror=format-security -gdwarf-4 -fno-debug-types-section -fvar-tracking-assignments -g2 -Wp,-D_FORTIFY_SOURCE=2 -fstack-protector-strong --param=ssp-buffer-size=4 -Werror=trampolines -fomit-frame-pointer -march=i686 -fasynchronous-unwind-tables -mtune=pentium4 -gdwarf-4 -fno-debug-types-section -fvar-tracking-assignments -g2 -DNDEBUG -DQT_NO_DEBUG -Wall -pthread -Wformat -Wformat-security -fstack-protector --param ssp-buffer-size=4 -pie -fPIE -o CMakeFiles/rstudio-core.dir/GitGraph.cpp.o -c /tmp/B.QcYDGd/BUILD/rstudio-1.1.143/src/cpp/core/GitGraph.cpp In file included from /usr/include/boost/bind.hpp:30, from /tmp/B.QcYDGd/BUILD/rstudio-1.1.143/src/cpp/core/GitGraph.cpp:21: /usr/include/boost/bind.hpp:36:1: note: '#pragma message: The practice of declaring the Bind placeholders (_1, _2, ...) in the global namespace is deprecated. Please use <boost/bind/bind.hpp> + using namespace boost::placeholders, or define BOOST_BIND_GLOBAL_PLACEHOLDERS to retain the current behavior.' 36 | BOOST_PRAGMA_MESSAGE( | ^~~~~~~~~~~~~~~~~~~~ make[2]: Leaving directory '/tmp/B.QcYDGd/BUILD/rstudio-1.1.143/build' make[2]: Entering directory '/tmp/B.QcYDGd/BUILD/rstudio-1.1.143/build' [ 3%] Building CXX object src/cpp/core/CMakeFiles/rstudio-core.dir/BrowserUtils.cpp.o cd /tmp/B.QcYDGd/BUILD/rstudio-1.1.143/build/src/cpp/core && /usr/bin/i686-pld-linux-g++ -DBOOST_ASIO_DISABLE_KQUEUE -DBOOST_ENABLE_ASSERT_HANDLER -DBOOST_SIGNALS_NO_DEPRECATION_WARNING -DRSTUDIO_BOOST_NAMESPACE=boost -D_FORTIFY_SOURCE=2 -I/tmp/B.QcYDGd/BUILD/rstudio-1.1.143/src/cpp/core/include -I/tmp/B.QcYDGd/BUILD/rstudio-1.1.143/build/src/cpp/core -I/tmp/B.QcYDGd/BUILD/rstudio-1.1.143/src/cpp/tests/cpp -O2 -fwrapv -pipe -Wformat -Werror=format-security -gdwarf-4 -fno-debug-types-section -fvar-tracking-assignments -g2 -Wp,-D_FORTIFY_SOURCE=2 -fstack-protector-strong --param=ssp-buffer-size=4 -Werror=trampolines -fomit-frame-pointer -march=i686 -fasynchronous-unwind-tables -mtune=pentium4 -gdwarf-4 -fno-debug-types-section -fvar-tracking-assignments -g2 -DNDEBUG -DQT_NO_DEBUG -Wall -pthread -Wformat -Wformat-security -fstack-protector --param ssp-buffer-size=4 -pie -fPIE -o CMakeFiles/rstudio-core.dir/BrowserUtils.cpp.o -c /tmp/B.QcYDGd/BUILD/rstudio-1.1.143/src/cpp/core/BrowserUtils.cpp make[2]: Leaving directory '/tmp/B.QcYDGd/BUILD/rstudio-1.1.143/build' make[2]: Entering directory '/tmp/B.QcYDGd/BUILD/rstudio-1.1.143/build' [ 2%] Building CXX object src/cpp/core/CMakeFiles/rstudio-core.dir/Backtrace.cpp.o cd /tmp/B.QcYDGd/BUILD/rstudio-1.1.143/build/src/cpp/core && /usr/bin/i686-pld-linux-g++ -DBOOST_ASIO_DISABLE_KQUEUE -DBOOST_ENABLE_ASSERT_HANDLER -DBOOST_SIGNALS_NO_DEPRECATION_WARNING -DRSTUDIO_BOOST_NAMESPACE=boost -D_FORTIFY_SOURCE=2 -I/tmp/B.QcYDGd/BUILD/rstudio-1.1.143/src/cpp/core/include -I/tmp/B.QcYDGd/BUILD/rstudio-1.1.143/build/src/cpp/core -I/tmp/B.QcYDGd/BUILD/rstudio-1.1.143/src/cpp/tests/cpp -O2 -fwrapv -pipe -Wformat -Werror=format-security -gdwarf-4 -fno-debug-types-section -fvar-tracking-assignments -g2 -Wp,-D_FORTIFY_SOURCE=2 -fstack-protector-strong --param=ssp-buffer-size=4 -Werror=trampolines -fomit-frame-pointer -march=i686 -fasynchronous-unwind-tables -mtune=pentium4 -gdwarf-4 -fno-debug-types-section -fvar-tracking-assignments -g2 -DNDEBUG -DQT_NO_DEBUG -Wall -pthread -Wformat -Wformat-security -fstack-protector --param ssp-buffer-size=4 -pie -fPIE -o CMakeFiles/rstudio-core.dir/Backtrace.cpp.o -c /tmp/B.QcYDGd/BUILD/rstudio-1.1.143/src/cpp/core/Backtrace.cpp make[2]: Leaving directory '/tmp/B.QcYDGd/BUILD/rstudio-1.1.143/build' make[1]: *** [CMakeFiles/Makefile2:448: src/cpp/core/CMakeFiles/rstudio-core.dir/all] Error 2 make[1]: *** Waiting for unfinished jobs.... make[2]: Entering directory '/tmp/B.QcYDGd/BUILD/rstudio-1.1.143/build' cd /tmp/B.QcYDGd/BUILD/rstudio-1.1.143/src/gwt && ant Buildfile: /tmp/B.QcYDGd/BUILD/rstudio-1.1.143/src/gwt/build.xml ext: [jscomp] Compiling 54 file(s) with 41 extern(s) [jscomp] 0 error(s), 0 warning(s) javac: [mkdir] Created dir: /tmp/B.QcYDGd/BUILD/rstudio-1.1.143/src/gwt/bin [javac] Compiling 10 source files to /tmp/B.QcYDGd/BUILD/rstudio-1.1.143/src/gwt/bin [javac] Note: Some input files use or override a deprecated API. [javac] Note: Recompile with -Xlint:deprecation for details. [javac] Compiling 2029 source files to /tmp/B.QcYDGd/BUILD/rstudio-1.1.143/src/gwt/bin [copy] Copying 1423 files to /tmp/B.QcYDGd/BUILD/rstudio-1.1.143/src/gwt/bin gwtc: [java] Compiling module org.rstudio.studio.RStudio [java] Compiling 4 permutations [java] Compiling permutation 0... [java] Process output [java] Compiling [java] Compiling permutation 1... [java] Compiling [java] Compiling permutation 2... [java] Compiling permutation 3... [java] Compile of permutations succeeded [java] Compilation succeeded -- 169.797s [java] Linking into /tmp/B.QcYDGd/BUILD/rstudio-1.1.143/src/gwt/www/rstudio; Writing extras to /tmp/B.QcYDGd/BUILD/rstudio-1.1.143/src/gwt/extras/rstudio [java] Link succeeded [java] Linking succeeded -- 2.931s build: BUILD SUCCESSFUL Total time: 3 minutes 17 seconds make[2]: Leaving directory '/tmp/B.QcYDGd/BUILD/rstudio-1.1.143/build' make[1]: Entering directory '/tmp/B.QcYDGd/BUILD/rstudio-1.1.143/build' [ 7%] Built target gwt_build make[1]: Leaving directory '/tmp/B.QcYDGd/BUILD/rstudio-1.1.143/build' make: *** [Makefile:175: all] Error 2 error: Bad exit status from /tmp/B.QcYDGd/BUILD/tmp/rpm-tmp.34161 (%build) RPM build errors: Bad exit status from /tmp/B.QcYDGd/BUILD/tmp/rpm-tmp.34161 (%build) ended at: Sat Aug 1 00:17:58 2020, done in 0:03:25.694004 error: No files produced. + chmod -R u+rwX /tmp/B.QcYDGd/BUILD + rm -rf /tmp/B.QcYDGd/tmp /tmp/B.QcYDGd/BUILD + rm -rf /tmp/B.QcYDGd Begin-PLD-Builder-Info Build-Time: user:670.24s sys:29.57s real:259.41s (faults io:3 non-io:1845690) End-PLD-Builder-Info
[Back to list of logs] [View rpm -qa of builder]