FailedOk

th/SRPMS[OK]
th/x32[OK]
th/i686[OK]
th/x86_64[OK]

ac/SRPMS[OK]
ac/i386[OK]
ac/i586[OK]
ac/i686[OK]
ac/alpha[OK]
ac/amd64[OK]
ac/athlon[OK]
ac/ppc[OK]
ac/sparc[OK]
ac/sparc64[OK]

Advanced Search
main()
Powered by PLD Linux
(c) 2002-2020 PLD Team
$Revision: 1.37 $
Powered by Ken.
Your IP: 34.200.218.187

rstudio 4d2d9ce9-d45d-474a-be58-e9a8eac06582

Status:Failed
Source URL:https://buildlogs.pld-linux.org/pld/th/i686/FAIL/rstudio,4d2d9ce9-d45d-474a-be58-e9a8eac06582.bz2
text/plain URL:View!
full text:View!
rpm -qa of builder:View!
Date:2020/08/01 11:05:44
Runtime:0:03:25.462430

Toc:

  • error 1
  • /tmp/B.aveFcX/BUILD/rstudio-1.1.143/src/cpp/core/FilePath.cpp:1023:37: error: 'rstudio::core::{anonymous}::recursive_dir_iterator' {aka 'class boost::filesystem::recursive_directory_iterator'} has no member named 'level'
  • error 2
  • make[2]: *** [src/cpp/core/CMakeFiles/rstudio-core.dir/build.make:229: src/cpp/core/CMakeFiles/rstudio-core.dir/FilePath.cpp.o] Error 1
  • error 3
  • make[1]: *** [CMakeFiles/Makefile2:448: src/cpp/core/CMakeFiles/rstudio-core.dir/all] Error 2
  • error 4
  • error: Bad exit status from /tmp/B.aveFcX/BUILD/tmp/rpm-tmp.12542 (%build)
  • error 5
  • RPM build errors:
  • error 6
  • error: No files produced.

Content:

[  1%] Building CXX object src/cpp/core/spelling/hunspell/CMakeFiles/rstudio-core-hunspell.dir/hashmgr.cxx.o
cd /tmp/B.aveFcX/BUILD/rstudio-1.1.143/build/src/cpp/core/spelling/hunspell && /usr/bin/i686-pld-linux-g++  -DBOOST_ASIO_DISABLE_KQUEUE -DBOOST_ENABLE_ASSERT_HANDLER -DBOOST_SIGNALS_NO_DEPRECATION_WARNING -DRSTUDIO_BOOST_NAMESPACE=boost -D_FORTIFY_SOURCE=2 -I/tmp/B.aveFcX/BUILD/rstudio-1.1.143/build/src/cpp/core/spelling/hunspell  -O2 -fwrapv -pipe -Wformat -Werror=format-security -gdwarf-4 -fno-debug-types-section -fvar-tracking-assignments -g2 -Wp,-D_FORTIFY_SOURCE=2 -fstack-protector-strong --param=ssp-buffer-size=4 -Werror=trampolines -fomit-frame-pointer -march=i686 -fasynchronous-unwind-tables -mtune=pentium4 -gdwarf-4 -fno-debug-types-section -fvar-tracking-assignments -g2  -DNDEBUG -DQT_NO_DEBUG   -Wall -pthread -Wformat -Wformat-security -fstack-protector --param ssp-buffer-size=4 -pie -fPIE -w -o CMakeFiles/rstudio-core-hunspell.dir/hashmgr.cxx.o -c /tmp/B.aveFcX/BUILD/rstudio-1.1.143/src/cpp/core/spelling/hunspell/hashmgr.cxx
make[2]: Leaving directory '/tmp/B.aveFcX/BUILD/rstudio-1.1.143/build'
make[2]: Entering directory '/tmp/B.aveFcX/BUILD/rstudio-1.1.143/build'
[  2%] Building CXX object src/cpp/core/spelling/hunspell/CMakeFiles/rstudio-core-hunspell.dir/filemgr.cxx.o
cd /tmp/B.aveFcX/BUILD/rstudio-1.1.143/build/src/cpp/core/spelling/hunspell && /usr/bin/i686-pld-linux-g++  -DBOOST_ASIO_DISABLE_KQUEUE -DBOOST_ENABLE_ASSERT_HANDLER -DBOOST_SIGNALS_NO_DEPRECATION_WARNING -DRSTUDIO_BOOST_NAMESPACE=boost -D_FORTIFY_SOURCE=2 -I/tmp/B.aveFcX/BUILD/rstudio-1.1.143/build/src/cpp/core/spelling/hunspell  -O2 -fwrapv -pipe -Wformat -Werror=format-security -gdwarf-4 -fno-debug-types-section -fvar-tracking-assignments -g2 -Wp,-D_FORTIFY_SOURCE=2 -fstack-protector-strong --param=ssp-buffer-size=4 -Werror=trampolines -fomit-frame-pointer -march=i686 -fasynchronous-unwind-tables -mtune=pentium4 -gdwarf-4 -fno-debug-types-section -fvar-tracking-assignments -g2  -DNDEBUG -DQT_NO_DEBUG   -Wall -pthread -Wformat -Wformat-security -fstack-protector --param ssp-buffer-size=4 -pie -fPIE -w -o CMakeFiles/rstudio-core-hunspell.dir/filemgr.cxx.o -c /tmp/B.aveFcX/BUILD/rstudio-1.1.143/src/cpp/core/spelling/hunspell/filemgr.cxx
make[2]: Leaving directory '/tmp/B.aveFcX/BUILD/rstudio-1.1.143/build'
make[2]: Entering directory '/tmp/B.aveFcX/BUILD/rstudio-1.1.143/build'
[  2%] Building CXX object src/cpp/core/spelling/hunspell/CMakeFiles/rstudio-core-hunspell.dir/hunzip.cxx.o
cd /tmp/B.aveFcX/BUILD/rstudio-1.1.143/build/src/cpp/core/spelling/hunspell && /usr/bin/i686-pld-linux-g++  -DBOOST_ASIO_DISABLE_KQUEUE -DBOOST_ENABLE_ASSERT_HANDLER -DBOOST_SIGNALS_NO_DEPRECATION_WARNING -DRSTUDIO_BOOST_NAMESPACE=boost -D_FORTIFY_SOURCE=2 -I/tmp/B.aveFcX/BUILD/rstudio-1.1.143/build/src/cpp/core/spelling/hunspell  -O2 -fwrapv -pipe -Wformat -Werror=format-security -gdwarf-4 -fno-debug-types-section -fvar-tracking-assignments -g2 -Wp,-D_FORTIFY_SOURCE=2 -fstack-protector-strong --param=ssp-buffer-size=4 -Werror=trampolines -fomit-frame-pointer -march=i686 -fasynchronous-unwind-tables -mtune=pentium4 -gdwarf-4 -fno-debug-types-section -fvar-tracking-assignments -g2  -DNDEBUG -DQT_NO_DEBUG   -Wall -pthread -Wformat -Wformat-security -fstack-protector --param ssp-buffer-size=4 -pie -fPIE -w -o CMakeFiles/rstudio-core-hunspell.dir/hunzip.cxx.o -c /tmp/B.aveFcX/BUILD/rstudio-1.1.143/src/cpp/core/spelling/hunspell/hunzip.cxx
make[2]: Leaving directory '/tmp/B.aveFcX/BUILD/rstudio-1.1.143/build'
make[2]: Entering directory '/tmp/B.aveFcX/BUILD/rstudio-1.1.143/build'
[  2%] Building CXX object src/cpp/core/spelling/hunspell/CMakeFiles/rstudio-core-hunspell.dir/replist.cxx.o
cd /tmp/B.aveFcX/BUILD/rstudio-1.1.143/build/src/cpp/core/spelling/hunspell && /usr/bin/i686-pld-linux-g++  -DBOOST_ASIO_DISABLE_KQUEUE -DBOOST_ENABLE_ASSERT_HANDLER -DBOOST_SIGNALS_NO_DEPRECATION_WARNING -DRSTUDIO_BOOST_NAMESPACE=boost -D_FORTIFY_SOURCE=2 -I/tmp/B.aveFcX/BUILD/rstudio-1.1.143/build/src/cpp/core/spelling/hunspell  -O2 -fwrapv -pipe -Wformat -Werror=format-security -gdwarf-4 -fno-debug-types-section -fvar-tracking-assignments -g2 -Wp,-D_FORTIFY_SOURCE=2 -fstack-protector-strong --param=ssp-buffer-size=4 -Werror=trampolines -fomit-frame-pointer -march=i686 -fasynchronous-unwind-tables -mtune=pentium4 -gdwarf-4 -fno-debug-types-section -fvar-tracking-assignments -g2  -DNDEBUG -DQT_NO_DEBUG   -Wall -pthread -Wformat -Wformat-security -fstack-protector --param ssp-buffer-size=4 -pie -fPIE -w -o CMakeFiles/rstudio-core-hunspell.dir/replist.cxx.o -c /tmp/B.aveFcX/BUILD/rstudio-1.1.143/src/cpp/core/spelling/hunspell/replist.cxx
make[2]: Leaving directory '/tmp/B.aveFcX/BUILD/rstudio-1.1.143/build'
make[2]: Entering directory '/tmp/B.aveFcX/BUILD/rstudio-1.1.143/build'
[  0%] Building CXX object src/cpp/core/spelling/hunspell/CMakeFiles/rstudio-core-hunspell.dir/csutil.cxx.o
cd /tmp/B.aveFcX/BUILD/rstudio-1.1.143/build/src/cpp/core/spelling/hunspell && /usr/bin/i686-pld-linux-g++  -DBOOST_ASIO_DISABLE_KQUEUE -DBOOST_ENABLE_ASSERT_HANDLER -DBOOST_SIGNALS_NO_DEPRECATION_WARNING -DRSTUDIO_BOOST_NAMESPACE=boost -D_FORTIFY_SOURCE=2 -I/tmp/B.aveFcX/BUILD/rstudio-1.1.143/build/src/cpp/core/spelling/hunspell  -O2 -fwrapv -pipe -Wformat -Werror=format-security -gdwarf-4 -fno-debug-types-section -fvar-tracking-assignments -g2 -Wp,-D_FORTIFY_SOURCE=2 -fstack-protector-strong --param=ssp-buffer-size=4 -Werror=trampolines -fomit-frame-pointer -march=i686 -fasynchronous-unwind-tables -mtune=pentium4 -gdwarf-4 -fno-debug-types-section -fvar-tracking-assignments -g2  -DNDEBUG -DQT_NO_DEBUG   -Wall -pthread -Wformat -Wformat-security -fstack-protector --param ssp-buffer-size=4 -pie -fPIE -w -o CMakeFiles/rstudio-core-hunspell.dir/csutil.cxx.o -c /tmp/B.aveFcX/BUILD/rstudio-1.1.143/src/cpp/core/spelling/hunspell/csutil.cxx
make[2]: Leaving directory '/tmp/B.aveFcX/BUILD/rstudio-1.1.143/build'
make[2]: Entering directory '/tmp/B.aveFcX/BUILD/rstudio-1.1.143/build'
[  1%] Building CXX object src/cpp/core/CMakeFiles/rstudio-core.dir/Assert.cpp.o
cd /tmp/B.aveFcX/BUILD/rstudio-1.1.143/build/src/cpp/core && /usr/bin/i686-pld-linux-g++  -DBOOST_ASIO_DISABLE_KQUEUE -DBOOST_ENABLE_ASSERT_HANDLER -DBOOST_SIGNALS_NO_DEPRECATION_WARNING -DRSTUDIO_BOOST_NAMESPACE=boost -D_FORTIFY_SOURCE=2 -I/tmp/B.aveFcX/BUILD/rstudio-1.1.143/src/cpp/core/include -I/tmp/B.aveFcX/BUILD/rstudio-1.1.143/build/src/cpp/core -I/tmp/B.aveFcX/BUILD/rstudio-1.1.143/src/cpp/tests/cpp  -O2 -fwrapv -pipe -Wformat -Werror=format-security -gdwarf-4 -fno-debug-types-section -fvar-tracking-assignments -g2 -Wp,-D_FORTIFY_SOURCE=2 -fstack-protector-strong --param=ssp-buffer-size=4 -Werror=trampolines -fomit-frame-pointer -march=i686 -fasynchronous-unwind-tables -mtune=pentium4 -gdwarf-4 -fno-debug-types-section -fvar-tracking-assignments -g2  -DNDEBUG -DQT_NO_DEBUG   -Wall -pthread -Wformat -Wformat-security -fstack-protector --param ssp-buffer-size=4 -pie -fPIE -o CMakeFiles/rstudio-core.dir/Assert.cpp.o -c /tmp/B.aveFcX/BUILD/rstudio-1.1.143/src/cpp/core/Assert.cpp
make[2]: Leaving directory '/tmp/B.aveFcX/BUILD/rstudio-1.1.143/build'
make[2]: Entering directory '/tmp/B.aveFcX/BUILD/rstudio-1.1.143/build'
[  1%] Building CXX object src/cpp/core/spelling/hunspell/CMakeFiles/rstudio-core-hunspell.dir/suggestmgr.cxx.o
cd /tmp/B.aveFcX/BUILD/rstudio-1.1.143/build/src/cpp/core/spelling/hunspell && /usr/bin/i686-pld-linux-g++  -DBOOST_ASIO_DISABLE_KQUEUE -DBOOST_ENABLE_ASSERT_HANDLER -DBOOST_SIGNALS_NO_DEPRECATION_WARNING -DRSTUDIO_BOOST_NAMESPACE=boost -D_FORTIFY_SOURCE=2 -I/tmp/B.aveFcX/BUILD/rstudio-1.1.143/build/src/cpp/core/spelling/hunspell  -O2 -fwrapv -pipe -Wformat -Werror=format-security -gdwarf-4 -fno-debug-types-section -fvar-tracking-assignments -g2 -Wp,-D_FORTIFY_SOURCE=2 -fstack-protector-strong --param=ssp-buffer-size=4 -Werror=trampolines -fomit-frame-pointer -march=i686 -fasynchronous-unwind-tables -mtune=pentium4 -gdwarf-4 -fno-debug-types-section -fvar-tracking-assignments -g2  -DNDEBUG -DQT_NO_DEBUG   -Wall -pthread -Wformat -Wformat-security -fstack-protector --param ssp-buffer-size=4 -pie -fPIE -w -o CMakeFiles/rstudio-core-hunspell.dir/suggestmgr.cxx.o -c /tmp/B.aveFcX/BUILD/rstudio-1.1.143/src/cpp/core/spelling/hunspell/suggestmgr.cxx
make[2]: Leaving directory '/tmp/B.aveFcX/BUILD/rstudio-1.1.143/build'
make[2]: Entering directory '/tmp/B.aveFcX/BUILD/rstudio-1.1.143/build'
[  1%] Building C object src/cpp/core/tex/synctex/CMakeFiles/rstudio-core-synctex.dir/synctex_parser.c.o
cd /tmp/B.aveFcX/BUILD/rstudio-1.1.143/build/src/cpp/core/tex/synctex && /usr/bin/i686-pld-linux-gcc -DBOOST_ASIO_DISABLE_KQUEUE -DBOOST_ENABLE_ASSERT_HANDLER -DBOOST_SIGNALS_NO_DEPRECATION_WARNING -DRSTUDIO_BOOST_NAMESPACE=boost -D_FORTIFY_SOURCE=2 -I/tmp/B.aveFcX/BUILD/rstudio-1.1.143/src/cpp/core/tex/synctex  -O2 -fwrapv -pipe -Wformat -Werror=format-security -gdwarf-4 -fno-debug-types-section -fvar-tracking-assignments -g2 -Wp,-D_FORTIFY_SOURCE=2 -fstack-protector-strong --param=ssp-buffer-size=4 -Werror=trampolines -fomit-frame-pointer -march=i686 -fasynchronous-unwind-tables -mtune=pentium4 -gdwarf-4 -fno-debug-types-section -fvar-tracking-assignments -g2  -DNDEBUG -DQT_NO_DEBUG   -Wall -pthread -Wformat -Wformat-security -fstack-protector --param ssp-buffer-size=4 -pie -fPIE -o CMakeFiles/rstudio-core-synctex.dir/synctex_parser.c.o   -c /tmp/B.aveFcX/BUILD/rstudio-1.1.143/src/cpp/core/tex/synctex/synctex_parser.c
make[2]: Leaving directory '/tmp/B.aveFcX/BUILD/rstudio-1.1.143/build'
make[2]: Entering directory '/tmp/B.aveFcX/BUILD/rstudio-1.1.143/build'
[  2%] Building CXX object src/cpp/core/spelling/hunspell/CMakeFiles/rstudio-core-hunspell.dir/hunspell.cxx.o
cd /tmp/B.aveFcX/BUILD/rstudio-1.1.143/build/src/cpp/core/spelling/hunspell && /usr/bin/i686-pld-linux-g++  -DBOOST_ASIO_DISABLE_KQUEUE -DBOOST_ENABLE_ASSERT_HANDLER -DBOOST_SIGNALS_NO_DEPRECATION_WARNING -DRSTUDIO_BOOST_NAMESPACE=boost -D_FORTIFY_SOURCE=2 -I/tmp/B.aveFcX/BUILD/rstudio-1.1.143/build/src/cpp/core/spelling/hunspell  -O2 -fwrapv -pipe -Wformat -Werror=format-security -gdwarf-4 -fno-debug-types-section -fvar-tracking-assignments -g2 -Wp,-D_FORTIFY_SOURCE=2 -fstack-protector-strong --param=ssp-buffer-size=4 -Werror=trampolines -fomit-frame-pointer -march=i686 -fasynchronous-unwind-tables -mtune=pentium4 -gdwarf-4 -fno-debug-types-section -fvar-tracking-assignments -g2  -DNDEBUG -DQT_NO_DEBUG   -Wall -pthread -Wformat -Wformat-security -fstack-protector --param ssp-buffer-size=4 -pie -fPIE -w -o CMakeFiles/rstudio-core-hunspell.dir/hunspell.cxx.o -c /tmp/B.aveFcX/BUILD/rstudio-1.1.143/src/cpp/core/spelling/hunspell/hunspell.cxx
make[2]: Leaving directory '/tmp/B.aveFcX/BUILD/rstudio-1.1.143/build'
make[2]: Entering directory '/tmp/B.aveFcX/BUILD/rstudio-1.1.143/build'
[  3%] Linking C static library librstudio-core-synctex.a
cd /tmp/B.aveFcX/BUILD/rstudio-1.1.143/build/src/cpp/core/tex/synctex && /usr/bin/cmake -P CMakeFiles/rstudio-core-synctex.dir/cmake_clean_target.cmake
cd /tmp/B.aveFcX/BUILD/rstudio-1.1.143/build/src/cpp/core/tex/synctex && /usr/bin/cmake -E cmake_link_script CMakeFiles/rstudio-core-synctex.dir/link.txt --verbose=1
/usr/bin/ar qc librstudio-core-synctex.a  CMakeFiles/rstudio-core-synctex.dir/synctex_parser.c.o CMakeFiles/rstudio-core-synctex.dir/synctex_parser_utils.c.o
/usr/bin/ranlib librstudio-core-synctex.a
make[2]: Leaving directory '/tmp/B.aveFcX/BUILD/rstudio-1.1.143/build'
make[1]: Entering directory '/tmp/B.aveFcX/BUILD/rstudio-1.1.143/build'
[  4%] Built target rstudio-core-synctex
make[1]: Leaving directory '/tmp/B.aveFcX/BUILD/rstudio-1.1.143/build'
make[2]: Entering directory '/tmp/B.aveFcX/BUILD/rstudio-1.1.143/build'
[  0%] Building CXX object src/cpp/core/spelling/hunspell/CMakeFiles/rstudio-core-hunspell.dir/affixmgr.cxx.o
cd /tmp/B.aveFcX/BUILD/rstudio-1.1.143/build/src/cpp/core/spelling/hunspell && /usr/bin/i686-pld-linux-g++  -DBOOST_ASIO_DISABLE_KQUEUE -DBOOST_ENABLE_ASSERT_HANDLER -DBOOST_SIGNALS_NO_DEPRECATION_WARNING -DRSTUDIO_BOOST_NAMESPACE=boost -D_FORTIFY_SOURCE=2 -I/tmp/B.aveFcX/BUILD/rstudio-1.1.143/build/src/cpp/core/spelling/hunspell  -O2 -fwrapv -pipe -Wformat -Werror=format-security -gdwarf-4 -fno-debug-types-section -fvar-tracking-assignments -g2 -Wp,-D_FORTIFY_SOURCE=2 -fstack-protector-strong --param=ssp-buffer-size=4 -Werror=trampolines -fomit-frame-pointer -march=i686 -fasynchronous-unwind-tables -mtune=pentium4 -gdwarf-4 -fno-debug-types-section -fvar-tracking-assignments -g2  -DNDEBUG -DQT_NO_DEBUG   -Wall -pthread -Wformat -Wformat-security -fstack-protector --param ssp-buffer-size=4 -pie -fPIE -w -o CMakeFiles/rstudio-core-hunspell.dir/affixmgr.cxx.o -c /tmp/B.aveFcX/BUILD/rstudio-1.1.143/src/cpp/core/spelling/hunspell/affixmgr.cxx
make[2]: Leaving directory '/tmp/B.aveFcX/BUILD/rstudio-1.1.143/build'
make[2]: Entering directory '/tmp/B.aveFcX/BUILD/rstudio-1.1.143/build'
[  5%] Linking CXX static library librstudio-core-hunspell.a
cd /tmp/B.aveFcX/BUILD/rstudio-1.1.143/build/src/cpp/core/spelling/hunspell && /usr/bin/cmake -P CMakeFiles/rstudio-core-hunspell.dir/cmake_clean_target.cmake
cd /tmp/B.aveFcX/BUILD/rstudio-1.1.143/build/src/cpp/core/spelling/hunspell && /usr/bin/cmake -E cmake_link_script CMakeFiles/rstudio-core-hunspell.dir/link.txt --verbose=1
/usr/bin/ar qc librstudio-core-hunspell.a  CMakeFiles/rstudio-core-hunspell.dir/affentry.cxx.o CMakeFiles/rstudio-core-hunspell.dir/affixmgr.cxx.o CMakeFiles/rstudio-core-hunspell.dir/csutil.cxx.o CMakeFiles/rstudio-core-hunspell.dir/dictmgr.cxx.o CMakeFiles/rstudio-core-hunspell.dir/hashmgr.cxx.o CMakeFiles/rstudio-core-hunspell.dir/suggestmgr.cxx.o CMakeFiles/rstudio-core-hunspell.dir/phonet.cxx.o CMakeFiles/rstudio-core-hunspell.dir/filemgr.cxx.o CMakeFiles/rstudio-core-hunspell.dir/hunzip.cxx.o CMakeFiles/rstudio-core-hunspell.dir/hunspell.cxx.o CMakeFiles/rstudio-core-hunspell.dir/replist.cxx.o
/usr/bin/ranlib librstudio-core-hunspell.a
make[2]: Leaving directory '/tmp/B.aveFcX/BUILD/rstudio-1.1.143/build'
make[1]: Entering directory '/tmp/B.aveFcX/BUILD/rstudio-1.1.143/build'
[  5%] Built target rstudio-core-hunspell
make[1]: Leaving directory '/tmp/B.aveFcX/BUILD/rstudio-1.1.143/build'
make[2]: Entering directory '/tmp/B.aveFcX/BUILD/rstudio-1.1.143/build'
[  3%] Building CXX object src/cpp/core/CMakeFiles/rstudio-core.dir/Base64.cpp.o
cd /tmp/B.aveFcX/BUILD/rstudio-1.1.143/build/src/cpp/core && /usr/bin/i686-pld-linux-g++  -DBOOST_ASIO_DISABLE_KQUEUE -DBOOST_ENABLE_ASSERT_HANDLER -DBOOST_SIGNALS_NO_DEPRECATION_WARNING -DRSTUDIO_BOOST_NAMESPACE=boost -D_FORTIFY_SOURCE=2 -I/tmp/B.aveFcX/BUILD/rstudio-1.1.143/src/cpp/core/include -I/tmp/B.aveFcX/BUILD/rstudio-1.1.143/build/src/cpp/core -I/tmp/B.aveFcX/BUILD/rstudio-1.1.143/src/cpp/tests/cpp  -O2 -fwrapv -pipe -Wformat -Werror=format-security -gdwarf-4 -fno-debug-types-section -fvar-tracking-assignments -g2 -Wp,-D_FORTIFY_SOURCE=2 -fstack-protector-strong --param=ssp-buffer-size=4 -Werror=trampolines -fomit-frame-pointer -march=i686 -fasynchronous-unwind-tables -mtune=pentium4 -gdwarf-4 -fno-debug-types-section -fvar-tracking-assignments -g2  -DNDEBUG -DQT_NO_DEBUG   -Wall -pthread -Wformat -Wformat-security -fstack-protector --param ssp-buffer-size=4 -pie -fPIE -o CMakeFiles/rstudio-core.dir/Base64.cpp.o -c /tmp/B.aveFcX/BUILD/rstudio-1.1.143/src/cpp/core/Base64.cpp
In file included from /usr/include/boost/bind.hpp:30,
                 from /usr/include/boost/iostreams/copy.hpp:26,
                 from /tmp/B.aveFcX/BUILD/rstudio-1.1.143/src/cpp/core/include/core/FileSerializer.hpp:25,
                 from /tmp/B.aveFcX/BUILD/rstudio-1.1.143/src/cpp/core/Base64.cpp:19:
/usr/include/boost/bind.hpp:36:1: note: '#pragma message: The practice of declaring the Bind placeholders (_1, _2, ...) in the global namespace is deprecated. Please use <boost/bind/bind.hpp> + using namespace boost::placeholders, or define BOOST_BIND_GLOBAL_PLACEHOLDERS to retain the current behavior.'
   36 | BOOST_PRAGMA_MESSAGE(
      | ^~~~~~~~~~~~~~~~~~~~
make[2]: Leaving directory '/tmp/B.aveFcX/BUILD/rstudio-1.1.143/build'
make[2]: Entering directory '/tmp/B.aveFcX/BUILD/rstudio-1.1.143/build'
[  5%] Building CXX object src/cpp/core/CMakeFiles/rstudio-core.dir/Exec.cpp.o
cd /tmp/B.aveFcX/BUILD/rstudio-1.1.143/build/src/cpp/core && /usr/bin/i686-pld-linux-g++  -DBOOST_ASIO_DISABLE_KQUEUE -DBOOST_ENABLE_ASSERT_HANDLER -DBOOST_SIGNALS_NO_DEPRECATION_WARNING -DRSTUDIO_BOOST_NAMESPACE=boost -D_FORTIFY_SOURCE=2 -I/tmp/B.aveFcX/BUILD/rstudio-1.1.143/src/cpp/core/include -I/tmp/B.aveFcX/BUILD/rstudio-1.1.143/build/src/cpp/core -I/tmp/B.aveFcX/BUILD/rstudio-1.1.143/src/cpp/tests/cpp  -O2 -fwrapv -pipe -Wformat -Werror=format-security -gdwarf-4 -fno-debug-types-section -fvar-tracking-assignments -g2 -Wp,-D_FORTIFY_SOURCE=2 -fstack-protector-strong --param=ssp-buffer-size=4 -Werror=trampolines -fomit-frame-pointer -march=i686 -fasynchronous-unwind-tables -mtune=pentium4 -gdwarf-4 -fno-debug-types-section -fvar-tracking-assignments -g2  -DNDEBUG -DQT_NO_DEBUG   -Wall -pthread -Wformat -Wformat-security -fstack-protector --param ssp-buffer-size=4 -pie -fPIE -o CMakeFiles/rstudio-core.dir/Exec.cpp.o -c /tmp/B.aveFcX/BUILD/rstudio-1.1.143/src/cpp/core/Exec.cpp
make[2]: Leaving directory '/tmp/B.aveFcX/BUILD/rstudio-1.1.143/build'
make[2]: Entering directory '/tmp/B.aveFcX/BUILD/rstudio-1.1.143/build'
[  5%] Building CXX object src/cpp/core/CMakeFiles/rstudio-core.dir/FileInfo.cpp.o
cd /tmp/B.aveFcX/BUILD/rstudio-1.1.143/build/src/cpp/core && /usr/bin/i686-pld-linux-g++  -DBOOST_ASIO_DISABLE_KQUEUE -DBOOST_ENABLE_ASSERT_HANDLER -DBOOST_SIGNALS_NO_DEPRECATION_WARNING -DRSTUDIO_BOOST_NAMESPACE=boost -D_FORTIFY_SOURCE=2 -I/tmp/B.aveFcX/BUILD/rstudio-1.1.143/src/cpp/core/include -I/tmp/B.aveFcX/BUILD/rstudio-1.1.143/build/src/cpp/core -I/tmp/B.aveFcX/BUILD/rstudio-1.1.143/src/cpp/tests/cpp  -O2 -fwrapv -pipe -Wformat -Werror=format-security -gdwarf-4 -fno-debug-types-section -fvar-tracking-assignments -g2 -Wp,-D_FORTIFY_SOURCE=2 -fstack-protector-strong --param=ssp-buffer-size=4 -Werror=trampolines -fomit-frame-pointer -march=i686 -fasynchronous-unwind-tables -mtune=pentium4 -gdwarf-4 -fno-debug-types-section -fvar-tracking-assignments -g2  -DNDEBUG -DQT_NO_DEBUG   -Wall -pthread -Wformat -Wformat-security -fstack-protector --param ssp-buffer-size=4 -pie -fPIE -o CMakeFiles/rstudio-core.dir/FileInfo.cpp.o -c /tmp/B.aveFcX/BUILD/rstudio-1.1.143/src/cpp/core/FileInfo.cpp
make[2]: Leaving directory '/tmp/B.aveFcX/BUILD/rstudio-1.1.143/build'
make[2]: Entering directory '/tmp/B.aveFcX/BUILD/rstudio-1.1.143/build'
[  3%] Building CXX object src/cpp/core/CMakeFiles/rstudio-core.dir/BoostErrors.cpp.o
cd /tmp/B.aveFcX/BUILD/rstudio-1.1.143/build/src/cpp/core && /usr/bin/i686-pld-linux-g++  -DBOOST_ASIO_DISABLE_KQUEUE -DBOOST_ENABLE_ASSERT_HANDLER -DBOOST_SIGNALS_NO_DEPRECATION_WARNING -DRSTUDIO_BOOST_NAMESPACE=boost -D_FORTIFY_SOURCE=2 -I/tmp/B.aveFcX/BUILD/rstudio-1.1.143/src/cpp/core/include -I/tmp/B.aveFcX/BUILD/rstudio-1.1.143/build/src/cpp/core -I/tmp/B.aveFcX/BUILD/rstudio-1.1.143/src/cpp/tests/cpp  -O2 -fwrapv -pipe -Wformat -Werror=format-security -gdwarf-4 -fno-debug-types-section -fvar-tracking-assignments -g2 -Wp,-D_FORTIFY_SOURCE=2 -fstack-protector-strong --param=ssp-buffer-size=4 -Werror=trampolines -fomit-frame-pointer -march=i686 -fasynchronous-unwind-tables -mtune=pentium4 -gdwarf-4 -fno-debug-types-section -fvar-tracking-assignments -g2  -DNDEBUG -DQT_NO_DEBUG   -Wall -pthread -Wformat -Wformat-security -fstack-protector --param ssp-buffer-size=4 -pie -fPIE -o CMakeFiles/rstudio-core.dir/BoostErrors.cpp.o -c /tmp/B.aveFcX/BUILD/rstudio-1.1.143/src/cpp/core/BoostErrors.cpp
make[2]: Leaving directory '/tmp/B.aveFcX/BUILD/rstudio-1.1.143/build'
make[2]: Entering directory '/tmp/B.aveFcX/BUILD/rstudio-1.1.143/build'
[  4%] Building CXX object src/cpp/core/CMakeFiles/rstudio-core.dir/Error.cpp.o
cd /tmp/B.aveFcX/BUILD/rstudio-1.1.143/build/src/cpp/core && /usr/bin/i686-pld-linux-g++  -DBOOST_ASIO_DISABLE_KQUEUE -DBOOST_ENABLE_ASSERT_HANDLER -DBOOST_SIGNALS_NO_DEPRECATION_WARNING -DRSTUDIO_BOOST_NAMESPACE=boost -D_FORTIFY_SOURCE=2 -I/tmp/B.aveFcX/BUILD/rstudio-1.1.143/src/cpp/core/include -I/tmp/B.aveFcX/BUILD/rstudio-1.1.143/build/src/cpp/core -I/tmp/B.aveFcX/BUILD/rstudio-1.1.143/src/cpp/tests/cpp  -O2 -fwrapv -pipe -Wformat -Werror=format-security -gdwarf-4 -fno-debug-types-section -fvar-tracking-assignments -g2 -Wp,-D_FORTIFY_SOURCE=2 -fstack-protector-strong --param=ssp-buffer-size=4 -Werror=trampolines -fomit-frame-pointer -march=i686 -fasynchronous-unwind-tables -mtune=pentium4 -gdwarf-4 -fno-debug-types-section -fvar-tracking-assignments -g2  -DNDEBUG -DQT_NO_DEBUG   -Wall -pthread -Wformat -Wformat-security -fstack-protector --param ssp-buffer-size=4 -pie -fPIE -o CMakeFiles/rstudio-core.dir/Error.cpp.o -c /tmp/B.aveFcX/BUILD/rstudio-1.1.143/src/cpp/core/Error.cpp
make[2]: Leaving directory '/tmp/B.aveFcX/BUILD/rstudio-1.1.143/build'
make[2]: Entering directory '/tmp/B.aveFcX/BUILD/rstudio-1.1.143/build'
[  4%] Building CXX object src/cpp/core/CMakeFiles/rstudio-core.dir/DateTime.cpp.o
cd /tmp/B.aveFcX/BUILD/rstudio-1.1.143/build/src/cpp/core && /usr/bin/i686-pld-linux-g++  -DBOOST_ASIO_DISABLE_KQUEUE -DBOOST_ENABLE_ASSERT_HANDLER -DBOOST_SIGNALS_NO_DEPRECATION_WARNING -DRSTUDIO_BOOST_NAMESPACE=boost -D_FORTIFY_SOURCE=2 -I/tmp/B.aveFcX/BUILD/rstudio-1.1.143/src/cpp/core/include -I/tmp/B.aveFcX/BUILD/rstudio-1.1.143/build/src/cpp/core -I/tmp/B.aveFcX/BUILD/rstudio-1.1.143/src/cpp/tests/cpp  -O2 -fwrapv -pipe -Wformat -Werror=format-security -gdwarf-4 -fno-debug-types-section -fvar-tracking-assignments -g2 -Wp,-D_FORTIFY_SOURCE=2 -fstack-protector-strong --param=ssp-buffer-size=4 -Werror=trampolines -fomit-frame-pointer -march=i686 -fasynchronous-unwind-tables -mtune=pentium4 -gdwarf-4 -fno-debug-types-section -fvar-tracking-assignments -g2  -DNDEBUG -DQT_NO_DEBUG   -Wall -pthread -Wformat -Wformat-security -fstack-protector --param ssp-buffer-size=4 -pie -fPIE -o CMakeFiles/rstudio-core.dir/DateTime.cpp.o -c /tmp/B.aveFcX/BUILD/rstudio-1.1.143/src/cpp/core/DateTime.cpp
make[2]: Leaving directory '/tmp/B.aveFcX/BUILD/rstudio-1.1.143/build'
make[2]: Entering directory '/tmp/B.aveFcX/BUILD/rstudio-1.1.143/build'
[  6%] Building CXX object src/cpp/core/CMakeFiles/rstudio-core.dir/FilePath.cpp.o
cd /tmp/B.aveFcX/BUILD/rstudio-1.1.143/build/src/cpp/core && /usr/bin/i686-pld-linux-g++  -DBOOST_ASIO_DISABLE_KQUEUE -DBOOST_ENABLE_ASSERT_HANDLER -DBOOST_SIGNALS_NO_DEPRECATION_WARNING -DRSTUDIO_BOOST_NAMESPACE=boost -D_FORTIFY_SOURCE=2 -I/tmp/B.aveFcX/BUILD/rstudio-1.1.143/src/cpp/core/include -I/tmp/B.aveFcX/BUILD/rstudio-1.1.143/build/src/cpp/core -I/tmp/B.aveFcX/BUILD/rstudio-1.1.143/src/cpp/tests/cpp  -O2 -fwrapv -pipe -Wformat -Werror=format-security -gdwarf-4 -fno-debug-types-section -fvar-tracking-assignments -g2 -Wp,-D_FORTIFY_SOURCE=2 -fstack-protector-strong --param=ssp-buffer-size=4 -Werror=trampolines -fomit-frame-pointer -march=i686 -fasynchronous-unwind-tables -mtune=pentium4 -gdwarf-4 -fno-debug-types-section -fvar-tracking-assignments -g2  -DNDEBUG -DQT_NO_DEBUG   -Wall -pthread -Wformat -Wformat-security -fstack-protector --param ssp-buffer-size=4 -pie -fPIE -o CMakeFiles/rstudio-core.dir/FilePath.cpp.o -c /tmp/B.aveFcX/BUILD/rstudio-1.1.143/src/cpp/core/FilePath.cpp
In file included from /usr/include/boost/bind.hpp:30,
                 from /tmp/B.aveFcX/BUILD/rstudio-1.1.143/src/cpp/core/FilePath.cpp:33:
/usr/include/boost/bind.hpp:36:1: note: '#pragma message: The practice of declaring the Bind placeholders (_1, _2, ...) in the global namespace is deprecated. Please use <boost/bind/bind.hpp> + using namespace boost::placeholders, or define BOOST_BIND_GLOBAL_PLACEHOLDERS to retain the current behavior.'
   36 | BOOST_PRAGMA_MESSAGE(
      | ^~~~~~~~~~~~~~~~~~~~
/tmp/B.aveFcX/BUILD/rstudio-1.1.143/src/cpp/core/FilePath.cpp: In member function 'rstudio::core::Error rstudio::core::FilePath::childrenRecursive(rstudio::core::FilePath::RecursiveIterationFunction) const':
/tmp/B.aveFcX/BUILD/rstudio-1.1.143/src/cpp/core/FilePath.cpp:1023:37: error: 'rstudio::core::{anonymous}::recursive_dir_iterator' {aka 'class boost::filesystem::recursive_directory_iterator'} has no member named 'level'
 1023 |          if (!iterationFunction(itr.level(),
      |                                     ^~~~~
make[2]: *** [src/cpp/core/CMakeFiles/rstudio-core.dir/build.make:229: src/cpp/core/CMakeFiles/rstudio-core.dir/FilePath.cpp.o] Error 1
make[2]: Leaving directory '/tmp/B.aveFcX/BUILD/rstudio-1.1.143/build'
make[2]: *** Waiting for unfinished jobs....
make[2]: Entering directory '/tmp/B.aveFcX/BUILD/rstudio-1.1.143/build'
[  5%] Building CXX object src/cpp/core/CMakeFiles/rstudio-core.dir/FileLogWriter.cpp.o
cd /tmp/B.aveFcX/BUILD/rstudio-1.1.143/build/src/cpp/core && /usr/bin/i686-pld-linux-g++  -DBOOST_ASIO_DISABLE_KQUEUE -DBOOST_ENABLE_ASSERT_HANDLER -DBOOST_SIGNALS_NO_DEPRECATION_WARNING -DRSTUDIO_BOOST_NAMESPACE=boost -D_FORTIFY_SOURCE=2 -I/tmp/B.aveFcX/BUILD/rstudio-1.1.143/src/cpp/core/include -I/tmp/B.aveFcX/BUILD/rstudio-1.1.143/build/src/cpp/core -I/tmp/B.aveFcX/BUILD/rstudio-1.1.143/src/cpp/tests/cpp  -O2 -fwrapv -pipe -Wformat -Werror=format-security -gdwarf-4 -fno-debug-types-section -fvar-tracking-assignments -g2 -Wp,-D_FORTIFY_SOURCE=2 -fstack-protector-strong --param=ssp-buffer-size=4 -Werror=trampolines -fomit-frame-pointer -march=i686 -fasynchronous-unwind-tables -mtune=pentium4 -gdwarf-4 -fno-debug-types-section -fvar-tracking-assignments -g2  -DNDEBUG -DQT_NO_DEBUG   -Wall -pthread -Wformat -Wformat-security -fstack-protector --param ssp-buffer-size=4 -pie -fPIE -o CMakeFiles/rstudio-core.dir/FileLogWriter.cpp.o -c /tmp/B.aveFcX/BUILD/rstudio-1.1.143/src/cpp/core/FileLogWriter.cpp
In file included from /usr/include/boost/bind.hpp:30,
                 from /usr/include/boost/iostreams/copy.hpp:26,
                 from /tmp/B.aveFcX/BUILD/rstudio-1.1.143/src/cpp/core/include/core/FileSerializer.hpp:25,
                 from /tmp/B.aveFcX/BUILD/rstudio-1.1.143/src/cpp/core/FileLogWriter.cpp:20:
/usr/include/boost/bind.hpp:36:1: note: '#pragma message: The practice of declaring the Bind placeholders (_1, _2, ...) in the global namespace is deprecated. Please use <boost/bind/bind.hpp> + using namespace boost::placeholders, or define BOOST_BIND_GLOBAL_PLACEHOLDERS to retain the current behavior.'
   36 | BOOST_PRAGMA_MESSAGE(
      | ^~~~~~~~~~~~~~~~~~~~
make[2]: Leaving directory '/tmp/B.aveFcX/BUILD/rstudio-1.1.143/build'
make[2]: Entering directory '/tmp/B.aveFcX/BUILD/rstudio-1.1.143/build'
[  6%] Building CXX object src/cpp/core/CMakeFiles/rstudio-core.dir/FileUtils.cpp.o
cd /tmp/B.aveFcX/BUILD/rstudio-1.1.143/build/src/cpp/core && /usr/bin/i686-pld-linux-g++  -DBOOST_ASIO_DISABLE_KQUEUE -DBOOST_ENABLE_ASSERT_HANDLER -DBOOST_SIGNALS_NO_DEPRECATION_WARNING -DRSTUDIO_BOOST_NAMESPACE=boost -D_FORTIFY_SOURCE=2 -I/tmp/B.aveFcX/BUILD/rstudio-1.1.143/src/cpp/core/include -I/tmp/B.aveFcX/BUILD/rstudio-1.1.143/build/src/cpp/core -I/tmp/B.aveFcX/BUILD/rstudio-1.1.143/src/cpp/tests/cpp  -O2 -fwrapv -pipe -Wformat -Werror=format-security -gdwarf-4 -fno-debug-types-section -fvar-tracking-assignments -g2 -Wp,-D_FORTIFY_SOURCE=2 -fstack-protector-strong --param=ssp-buffer-size=4 -Werror=trampolines -fomit-frame-pointer -march=i686 -fasynchronous-unwind-tables -mtune=pentium4 -gdwarf-4 -fno-debug-types-section -fvar-tracking-assignments -g2  -DNDEBUG -DQT_NO_DEBUG   -Wall -pthread -Wformat -Wformat-security -fstack-protector --param ssp-buffer-size=4 -pie -fPIE -o CMakeFiles/rstudio-core.dir/FileUtils.cpp.o -c /tmp/B.aveFcX/BUILD/rstudio-1.1.143/src/cpp/core/FileUtils.cpp
In file included from /usr/include/boost/bind.hpp:30,
                 from /tmp/B.aveFcX/BUILD/rstudio-1.1.143/src/cpp/core/FileUtils.cpp:19:
/usr/include/boost/bind.hpp:36:1: note: '#pragma message: The practice of declaring the Bind placeholders (_1, _2, ...) in the global namespace is deprecated. Please use <boost/bind/bind.hpp> + using namespace boost::placeholders, or define BOOST_BIND_GLOBAL_PLACEHOLDERS to retain the current behavior.'
   36 | BOOST_PRAGMA_MESSAGE(
      | ^~~~~~~~~~~~~~~~~~~~
make[2]: Leaving directory '/tmp/B.aveFcX/BUILD/rstudio-1.1.143/build'
make[2]: Entering directory '/tmp/B.aveFcX/BUILD/rstudio-1.1.143/build'
[  3%] Building CXX object src/cpp/core/CMakeFiles/rstudio-core.dir/ConfigUtils.cpp.o
cd /tmp/B.aveFcX/BUILD/rstudio-1.1.143/build/src/cpp/core && /usr/bin/i686-pld-linux-g++  -DBOOST_ASIO_DISABLE_KQUEUE -DBOOST_ENABLE_ASSERT_HANDLER -DBOOST_SIGNALS_NO_DEPRECATION_WARNING -DRSTUDIO_BOOST_NAMESPACE=boost -D_FORTIFY_SOURCE=2 -I/tmp/B.aveFcX/BUILD/rstudio-1.1.143/src/cpp/core/include -I/tmp/B.aveFcX/BUILD/rstudio-1.1.143/build/src/cpp/core -I/tmp/B.aveFcX/BUILD/rstudio-1.1.143/src/cpp/tests/cpp  -O2 -fwrapv -pipe -Wformat -Werror=format-security -gdwarf-4 -fno-debug-types-section -fvar-tracking-assignments -g2 -Wp,-D_FORTIFY_SOURCE=2 -fstack-protector-strong --param=ssp-buffer-size=4 -Werror=trampolines -fomit-frame-pointer -march=i686 -fasynchronous-unwind-tables -mtune=pentium4 -gdwarf-4 -fno-debug-types-section -fvar-tracking-assignments -g2  -DNDEBUG -DQT_NO_DEBUG   -Wall -pthread -Wformat -Wformat-security -fstack-protector --param ssp-buffer-size=4 -pie -fPIE -o CMakeFiles/rstudio-core.dir/ConfigUtils.cpp.o -c /tmp/B.aveFcX/BUILD/rstudio-1.1.143/src/cpp/core/ConfigUtils.cpp
In file included from /usr/include/boost/bind.hpp:30,
                 from /tmp/B.aveFcX/BUILD/rstudio-1.1.143/src/cpp/core/ConfigUtils.cpp:21:
/usr/include/boost/bind.hpp:36:1: note: '#pragma message: The practice of declaring the Bind placeholders (_1, _2, ...) in the global namespace is deprecated. Please use <boost/bind/bind.hpp> + using namespace boost::placeholders, or define BOOST_BIND_GLOBAL_PLACEHOLDERS to retain the current behavior.'
   36 | BOOST_PRAGMA_MESSAGE(
      | ^~~~~~~~~~~~~~~~~~~~
make[2]: Leaving directory '/tmp/B.aveFcX/BUILD/rstudio-1.1.143/build'
make[2]: Entering directory '/tmp/B.aveFcX/BUILD/rstudio-1.1.143/build'
[  6%] Building CXX object src/cpp/core/CMakeFiles/rstudio-core.dir/FileSerializer.cpp.o
cd /tmp/B.aveFcX/BUILD/rstudio-1.1.143/build/src/cpp/core && /usr/bin/i686-pld-linux-g++  -DBOOST_ASIO_DISABLE_KQUEUE -DBOOST_ENABLE_ASSERT_HANDLER -DBOOST_SIGNALS_NO_DEPRECATION_WARNING -DRSTUDIO_BOOST_NAMESPACE=boost -D_FORTIFY_SOURCE=2 -I/tmp/B.aveFcX/BUILD/rstudio-1.1.143/src/cpp/core/include -I/tmp/B.aveFcX/BUILD/rstudio-1.1.143/build/src/cpp/core -I/tmp/B.aveFcX/BUILD/rstudio-1.1.143/src/cpp/tests/cpp  -O2 -fwrapv -pipe -Wformat -Werror=format-security -gdwarf-4 -fno-debug-types-section -fvar-tracking-assignments -g2 -Wp,-D_FORTIFY_SOURCE=2 -fstack-protector-strong --param=ssp-buffer-size=4 -Werror=trampolines -fomit-frame-pointer -march=i686 -fasynchronous-unwind-tables -mtune=pentium4 -gdwarf-4 -fno-debug-types-section -fvar-tracking-assignments -g2  -DNDEBUG -DQT_NO_DEBUG   -Wall -pthread -Wformat -Wformat-security -fstack-protector --param ssp-buffer-size=4 -pie -fPIE -o CMakeFiles/rstudio-core.dir/FileSerializer.cpp.o -c /tmp/B.aveFcX/BUILD/rstudio-1.1.143/src/cpp/core/FileSerializer.cpp
In file included from /usr/include/boost/bind.hpp:30,
                 from /usr/include/boost/iostreams/copy.hpp:26,
                 from /tmp/B.aveFcX/BUILD/rstudio-1.1.143/src/cpp/core/include/core/FileSerializer.hpp:25,
                 from /tmp/B.aveFcX/BUILD/rstudio-1.1.143/src/cpp/core/FileSerializer.cpp:16:
/usr/include/boost/bind.hpp:36:1: note: '#pragma message: The practice of declaring the Bind placeholders (_1, _2, ...) in the global namespace is deprecated. Please use <boost/bind/bind.hpp> + using namespace boost::placeholders, or define BOOST_BIND_GLOBAL_PLACEHOLDERS to retain the current behavior.'
   36 | BOOST_PRAGMA_MESSAGE(
      | ^~~~~~~~~~~~~~~~~~~~
make[2]: Leaving directory '/tmp/B.aveFcX/BUILD/rstudio-1.1.143/build'
make[2]: Entering directory '/tmp/B.aveFcX/BUILD/rstudio-1.1.143/build'
[  3%] Building CXX object src/cpp/core/CMakeFiles/rstudio-core.dir/BrowserUtils.cpp.o
cd /tmp/B.aveFcX/BUILD/rstudio-1.1.143/build/src/cpp/core && /usr/bin/i686-pld-linux-g++  -DBOOST_ASIO_DISABLE_KQUEUE -DBOOST_ENABLE_ASSERT_HANDLER -DBOOST_SIGNALS_NO_DEPRECATION_WARNING -DRSTUDIO_BOOST_NAMESPACE=boost -D_FORTIFY_SOURCE=2 -I/tmp/B.aveFcX/BUILD/rstudio-1.1.143/src/cpp/core/include -I/tmp/B.aveFcX/BUILD/rstudio-1.1.143/build/src/cpp/core -I/tmp/B.aveFcX/BUILD/rstudio-1.1.143/src/cpp/tests/cpp  -O2 -fwrapv -pipe -Wformat -Werror=format-security -gdwarf-4 -fno-debug-types-section -fvar-tracking-assignments -g2 -Wp,-D_FORTIFY_SOURCE=2 -fstack-protector-strong --param=ssp-buffer-size=4 -Werror=trampolines -fomit-frame-pointer -march=i686 -fasynchronous-unwind-tables -mtune=pentium4 -gdwarf-4 -fno-debug-types-section -fvar-tracking-assignments -g2  -DNDEBUG -DQT_NO_DEBUG   -Wall -pthread -Wformat -Wformat-security -fstack-protector --param ssp-buffer-size=4 -pie -fPIE -o CMakeFiles/rstudio-core.dir/BrowserUtils.cpp.o -c /tmp/B.aveFcX/BUILD/rstudio-1.1.143/src/cpp/core/BrowserUtils.cpp
make[2]: Leaving directory '/tmp/B.aveFcX/BUILD/rstudio-1.1.143/build'
make[2]: Entering directory '/tmp/B.aveFcX/BUILD/rstudio-1.1.143/build'
[  6%] Building CXX object src/cpp/core/CMakeFiles/rstudio-core.dir/GitGraph.cpp.o
cd /tmp/B.aveFcX/BUILD/rstudio-1.1.143/build/src/cpp/core && /usr/bin/i686-pld-linux-g++  -DBOOST_ASIO_DISABLE_KQUEUE -DBOOST_ENABLE_ASSERT_HANDLER -DBOOST_SIGNALS_NO_DEPRECATION_WARNING -DRSTUDIO_BOOST_NAMESPACE=boost -D_FORTIFY_SOURCE=2 -I/tmp/B.aveFcX/BUILD/rstudio-1.1.143/src/cpp/core/include -I/tmp/B.aveFcX/BUILD/rstudio-1.1.143/build/src/cpp/core -I/tmp/B.aveFcX/BUILD/rstudio-1.1.143/src/cpp/tests/cpp  -O2 -fwrapv -pipe -Wformat -Werror=format-security -gdwarf-4 -fno-debug-types-section -fvar-tracking-assignments -g2 -Wp,-D_FORTIFY_SOURCE=2 -fstack-protector-strong --param=ssp-buffer-size=4 -Werror=trampolines -fomit-frame-pointer -march=i686 -fasynchronous-unwind-tables -mtune=pentium4 -gdwarf-4 -fno-debug-types-section -fvar-tracking-assignments -g2  -DNDEBUG -DQT_NO_DEBUG   -Wall -pthread -Wformat -Wformat-security -fstack-protector --param ssp-buffer-size=4 -pie -fPIE -o CMakeFiles/rstudio-core.dir/GitGraph.cpp.o -c /tmp/B.aveFcX/BUILD/rstudio-1.1.143/src/cpp/core/GitGraph.cpp
In file included from /usr/include/boost/bind.hpp:30,
                 from /tmp/B.aveFcX/BUILD/rstudio-1.1.143/src/cpp/core/GitGraph.cpp:21:
/usr/include/boost/bind.hpp:36:1: note: '#pragma message: The practice of declaring the Bind placeholders (_1, _2, ...) in the global namespace is deprecated. Please use <boost/bind/bind.hpp> + using namespace boost::placeholders, or define BOOST_BIND_GLOBAL_PLACEHOLDERS to retain the current behavior.'
   36 | BOOST_PRAGMA_MESSAGE(
      | ^~~~~~~~~~~~~~~~~~~~
make[2]: Leaving directory '/tmp/B.aveFcX/BUILD/rstudio-1.1.143/build'
make[2]: Entering directory '/tmp/B.aveFcX/BUILD/rstudio-1.1.143/build'
[  2%] Building CXX object src/cpp/core/CMakeFiles/rstudio-core.dir/Backtrace.cpp.o
cd /tmp/B.aveFcX/BUILD/rstudio-1.1.143/build/src/cpp/core && /usr/bin/i686-pld-linux-g++  -DBOOST_ASIO_DISABLE_KQUEUE -DBOOST_ENABLE_ASSERT_HANDLER -DBOOST_SIGNALS_NO_DEPRECATION_WARNING -DRSTUDIO_BOOST_NAMESPACE=boost -D_FORTIFY_SOURCE=2 -I/tmp/B.aveFcX/BUILD/rstudio-1.1.143/src/cpp/core/include -I/tmp/B.aveFcX/BUILD/rstudio-1.1.143/build/src/cpp/core -I/tmp/B.aveFcX/BUILD/rstudio-1.1.143/src/cpp/tests/cpp  -O2 -fwrapv -pipe -Wformat -Werror=format-security -gdwarf-4 -fno-debug-types-section -fvar-tracking-assignments -g2 -Wp,-D_FORTIFY_SOURCE=2 -fstack-protector-strong --param=ssp-buffer-size=4 -Werror=trampolines -fomit-frame-pointer -march=i686 -fasynchronous-unwind-tables -mtune=pentium4 -gdwarf-4 -fno-debug-types-section -fvar-tracking-assignments -g2  -DNDEBUG -DQT_NO_DEBUG   -Wall -pthread -Wformat -Wformat-security -fstack-protector --param ssp-buffer-size=4 -pie -fPIE -o CMakeFiles/rstudio-core.dir/Backtrace.cpp.o -c /tmp/B.aveFcX/BUILD/rstudio-1.1.143/src/cpp/core/Backtrace.cpp
make[2]: Leaving directory '/tmp/B.aveFcX/BUILD/rstudio-1.1.143/build'
make[1]: *** [CMakeFiles/Makefile2:448: src/cpp/core/CMakeFiles/rstudio-core.dir/all] Error 2
make[1]: *** Waiting for unfinished jobs....
make[2]: Entering directory '/tmp/B.aveFcX/BUILD/rstudio-1.1.143/build'
cd /tmp/B.aveFcX/BUILD/rstudio-1.1.143/src/gwt && ant
Buildfile: /tmp/B.aveFcX/BUILD/rstudio-1.1.143/src/gwt/build.xml

ext:
   [jscomp] Compiling 54 file(s) with 41 extern(s)
   [jscomp] 0 error(s), 0 warning(s)

javac:
    [mkdir] Created dir: /tmp/B.aveFcX/BUILD/rstudio-1.1.143/src/gwt/bin
    [javac] Compiling 10 source files to /tmp/B.aveFcX/BUILD/rstudio-1.1.143/src/gwt/bin
    [javac] Note: Some input files use or override a deprecated API.
    [javac] Note: Recompile with -Xlint:deprecation for details.
    [javac] Compiling 2029 source files to /tmp/B.aveFcX/BUILD/rstudio-1.1.143/src/gwt/bin
     [copy] Copying 1423 files to /tmp/B.aveFcX/BUILD/rstudio-1.1.143/src/gwt/bin

gwtc:
     [java] Compiling module org.rstudio.studio.RStudio
     [java]    Compiling 4 permutations
     [java]       Compiling permutation 0...
     [java]       Process output
     [java]          Compiling
     [java]             Compiling permutation 1...
     [java]       Compiling permutation 2...
     [java]          Compiling
     [java]             Compiling permutation 3...
     [java]    Compile of permutations succeeded
     [java]    Compilation succeeded -- 168.870s
     [java] Linking into /tmp/B.aveFcX/BUILD/rstudio-1.1.143/src/gwt/www/rstudio; Writing extras to /tmp/B.aveFcX/BUILD/rstudio-1.1.143/src/gwt/extras/rstudio
     [java]    Link succeeded
     [java]    Linking succeeded -- 3.518s

build:

BUILD SUCCESSFUL
Total time: 3 minutes 17 seconds
make[2]: Leaving directory '/tmp/B.aveFcX/BUILD/rstudio-1.1.143/build'
make[1]: Entering directory '/tmp/B.aveFcX/BUILD/rstudio-1.1.143/build'
[  6%] Built target gwt_build
make[1]: Leaving directory '/tmp/B.aveFcX/BUILD/rstudio-1.1.143/build'
make: *** [Makefile:175: all] Error 2
error: Bad exit status from /tmp/B.aveFcX/BUILD/tmp/rpm-tmp.12542 (%build)


RPM build errors:
    Bad exit status from /tmp/B.aveFcX/BUILD/tmp/rpm-tmp.12542 (%build)
ended at: Sat Aug  1 11:05:43 2020, done in 0:03:25.462430
error: No files produced.
+ chmod -R u+rwX /tmp/B.aveFcX/BUILD
+ rm -rf /tmp/B.aveFcX/tmp /tmp/B.aveFcX/BUILD
+ rm -rf /tmp/B.aveFcX
Begin-PLD-Builder-Info
Build-Time: user:650.05s sys:26.31s real:243.29s (faults io:0 non-io:1372089)

End-PLD-Builder-Info
[Back to list of logs] [View rpm -qa of builder]