FailedOk

th/SRPMS[OK]
th/x32[OK]
th/i686[OK]
th/x86_64[OK]

ac/SRPMS[OK]
ac/i386[OK]
ac/i586[OK]
ac/i686[OK]
ac/alpha[OK]
ac/amd64[OK]
ac/athlon[OK]
ac/ppc[OK]
ac/sparc[OK]
ac/sparc64[OK]

Advanced Search
main()
Powered by PLD Linux
(c) 2002-2020 PLD Team
$Revision: 1.37 $
Powered by sfistak.
Your IP: 3.89.87.12

rsyslog 34c4aa16-1f41-4a8d-82ae-c933c70690d5

Status:Failed
Source URL:https://buildlogs.pld-linux.org/pld/th/i686/FAIL/rsyslog,34c4aa16-1f41-4a8d-82ae-c933c70690d5.bz2
text/plain URL:View!
full text:View!
rpm -qa of builder:View!
Date:2020/10/08 21:13:53
Runtime:0:00:41.302801

Toc:

  • error 1
  • omczmq.c:260:10: error: implicit declaration of function 'zframe_set_group'; did you mean 'zframe_set_more'? [-Werror=implicit-function-declaration]
  • error 2
  • make[2]: *** [Makefile:550: omczmq_la-omczmq.lo] Error 1
  • error 3
  • make[1]: *** [Makefile:938: all-recursive] Error 1
  • error 4
  • error: Bad exit status from /tmp/B.HOF1_A/BUILD/tmp/rpm-tmp.70400 (%build)
  • error 5
  • RPM build errors:
  • error 6
  • error: No files produced.

Content:

make[2]: Leaving directory '/tmp/B.HOF1_A/BUILD/rsyslog-8.2004.0/plugins/pmnormalize'
make[2]: Entering directory '/tmp/B.HOF1_A/BUILD/rsyslog-8.2004.0/plugins/pmnormalize'
/bin/sh ../../libtool  --tag=CC   --mode=link i686-pld-linux-gcc  -O2 -fwrapv -pipe -Wformat -Werror=format-security -gdwarf-4 -fno-debug-types-section -fvar-tracking-assignments -g2 -Wp,-D_FORTIFY_SOURCE=2 -fstack-protector-strong --param=ssp-buffer-size=4 -Werror=trampolines -fomit-frame-pointer -march=i686 -fasynchronous-unwind-tables -mtune=pentium4 -gdwarf-4 -fno-debug-types-section -fvar-tracking-assignments -g2  -module -avoid-version -llognorm -lfastjson -Wl,--as-needed -Wl,--no-copy-dt-needed-entries -Wl,-z,relro -Wl,-z,combreloc  -o pmnormalize.la -rpath /usr/lib/rsyslog pmnormalize_la-pmnormalize.lo  
libtool: link: i686-pld-linux-gcc -shared  -fPIC -DPIC  .libs/pmnormalize_la-pmnormalize.o   -llognorm -lfastjson  -O2 -gdwarf-4 -g2 -fstack-protector-strong -march=i686 -mtune=pentium4 -gdwarf-4 -g2 -Wl,--as-needed -Wl,--no-copy-dt-needed-entries -Wl,-z -Wl,relro -Wl,-z -Wl,combreloc   -Wl,-soname -Wl,pmnormalize.so -o .libs/pmnormalize.so
libtool: link: ( cd ".libs" && rm -f "pmnormalize.la" && ln -s "../pmnormalize.la" "pmnormalize.la" )
make[2]: Leaving directory '/tmp/B.HOF1_A/BUILD/rsyslog-8.2004.0/plugins/pmnormalize'
Making all in contrib/pmaixforwardedfrom
make[2]: Entering directory '/tmp/B.HOF1_A/BUILD/rsyslog-8.2004.0/contrib/pmaixforwardedfrom'
/bin/sh ../../libtool  --tag=CC   --mode=compile i686-pld-linux-gcc -DHAVE_CONFIG_H -I. -I../..  -I../../runtime -I../.. -I../../grammar  -I/usr/include/libfastjson  -W -Wall -Wformat-security -Wshadow -Wcast-align -Wpointer-arith -Wmissing-format-attribute -Werror=implicit-function-declaration -g -fno-strict-aliasing -Wall -Wextra -Wundef -Wnested-externs -Wwrite-strings -Wpointer-arith -Wmissing-declarations -Wmissing-prototypes -Wstrict-prototypes -Wredundant-decls -Wno-unused-parameter -Wno-missing-field-initializers -Wdeclaration-after-statement -Wformat=2 -Wold-style-definition -Wcast-align -Wformat-nonliteral -Wformat-security -Wsign-compare -Wstrict-aliasing -Wshadow -Winline -Wpacked -Wmissing-format-attribute -Wmissing-noreturn -Winit-self -Wmissing-include-dirs -Wunused-but-set-variable -Warray-bounds -Wimplicit-function-declaration -Wreturn-type -Wswitch-enum -Wswitch-default -Wunused-parameter -Wmissing-field-initializers -Wunused-parameter -Wmissing-field-initializers -pthread -I ../../tools   -O2 -fwrapv -pipe -Wformat -Werror=format-security -gdwarf-4 -fno-debug-types-section -fvar-tracking-assignments -g2 -Wp,-D_FORTIFY_SOURCE=2 -fstack-protector-strong --param=ssp-buffer-size=4 -Werror=trampolines -fomit-frame-pointer -march=i686 -fasynchronous-unwind-tables -mtune=pentium4 -gdwarf-4 -fno-debug-types-section -fvar-tracking-assignments -g2  -MT pmaixforwardedfrom_la-pmaixforwardedfrom.lo -MD -MP -MF .deps/pmaixforwardedfrom_la-pmaixforwardedfrom.Tpo -c -o pmaixforwardedfrom_la-pmaixforwardedfrom.lo `test -f 'pmaixforwardedfrom.c' || echo './'`pmaixforwardedfrom.c
libtool: compile:  i686-pld-linux-gcc -DHAVE_CONFIG_H -I. -I../.. -I../../runtime -I../.. -I../../grammar -I/usr/include/libfastjson -W -Wall -Wformat-security -Wshadow -Wcast-align -Wpointer-arith -Wmissing-format-attribute -Werror=implicit-function-declaration -g -fno-strict-aliasing -Wall -Wextra -Wundef -Wnested-externs -Wwrite-strings -Wpointer-arith -Wmissing-declarations -Wmissing-prototypes -Wstrict-prototypes -Wredundant-decls -Wno-unused-parameter -Wno-missing-field-initializers -Wdeclaration-after-statement -Wformat=2 -Wold-style-definition -Wcast-align -Wformat-nonliteral -Wformat-security -Wsign-compare -Wstrict-aliasing -Wshadow -Winline -Wpacked -Wmissing-format-attribute -Wmissing-noreturn -Winit-self -Wmissing-include-dirs -Wunused-but-set-variable -Warray-bounds -Wimplicit-function-declaration -Wreturn-type -Wswitch-enum -Wswitch-default -Wunused-parameter -Wmissing-field-initializers -Wunused-parameter -Wmissing-field-initializers -pthread -I ../../tools -O2 -fwrapv -pipe -Wformat -Werror=format-security -gdwarf-4 -fno-debug-types-section -fvar-tracking-assignments -g2 -Wp,-D_FORTIFY_SOURCE=2 -fstack-protector-strong --param=ssp-buffer-size=4 -Werror=trampolines -fomit-frame-pointer -march=i686 -fasynchronous-unwind-tables -mtune=pentium4 -gdwarf-4 -fno-debug-types-section -fvar-tracking-assignments -g2 -MT pmaixforwardedfrom_la-pmaixforwardedfrom.lo -MD -MP -MF .deps/pmaixforwardedfrom_la-pmaixforwardedfrom.Tpo -c pmaixforwardedfrom.c  -fPIC -DPIC -o .libs/pmaixforwardedfrom_la-pmaixforwardedfrom.o
mv -f .deps/pmaixforwardedfrom_la-pmaixforwardedfrom.Tpo .deps/pmaixforwardedfrom_la-pmaixforwardedfrom.Plo
make[2]: Leaving directory '/tmp/B.HOF1_A/BUILD/rsyslog-8.2004.0/contrib/pmaixforwardedfrom'
make[2]: Entering directory '/tmp/B.HOF1_A/BUILD/rsyslog-8.2004.0/contrib/pmaixforwardedfrom'
/bin/sh ../../libtool  --tag=CC   --mode=link i686-pld-linux-gcc  -O2 -fwrapv -pipe -Wformat -Werror=format-security -gdwarf-4 -fno-debug-types-section -fvar-tracking-assignments -g2 -Wp,-D_FORTIFY_SOURCE=2 -fstack-protector-strong --param=ssp-buffer-size=4 -Werror=trampolines -fomit-frame-pointer -march=i686 -fasynchronous-unwind-tables -mtune=pentium4 -gdwarf-4 -fno-debug-types-section -fvar-tracking-assignments -g2  -module -avoid-version -Wl,--as-needed -Wl,--no-copy-dt-needed-entries -Wl,-z,relro -Wl,-z,combreloc  -o pmaixforwardedfrom.la -rpath /usr/lib/rsyslog pmaixforwardedfrom_la-pmaixforwardedfrom.lo  
libtool: link: i686-pld-linux-gcc -shared  -fPIC -DPIC  .libs/pmaixforwardedfrom_la-pmaixforwardedfrom.o    -O2 -gdwarf-4 -g2 -fstack-protector-strong -march=i686 -mtune=pentium4 -gdwarf-4 -g2 -Wl,--as-needed -Wl,--no-copy-dt-needed-entries -Wl,-z -Wl,relro -Wl,-z -Wl,combreloc   -Wl,-soname -Wl,pmaixforwardedfrom.so -o .libs/pmaixforwardedfrom.so
libtool: link: ( cd ".libs" && rm -f "pmaixforwardedfrom.la" && ln -s "../pmaixforwardedfrom.la" "pmaixforwardedfrom.la" )
make[2]: Leaving directory '/tmp/B.HOF1_A/BUILD/rsyslog-8.2004.0/contrib/pmaixforwardedfrom'
Making all in contrib/pmsnare
make[2]: Entering directory '/tmp/B.HOF1_A/BUILD/rsyslog-8.2004.0/contrib/pmsnare'
/bin/sh ../../libtool  --tag=CC   --mode=compile i686-pld-linux-gcc -DHAVE_CONFIG_H -I. -I../..  -I../../runtime -I../.. -I../../grammar  -I/usr/include/libfastjson  -W -Wall -Wformat-security -Wshadow -Wcast-align -Wpointer-arith -Wmissing-format-attribute -Werror=implicit-function-declaration -g -fno-strict-aliasing -Wall -Wextra -Wundef -Wnested-externs -Wwrite-strings -Wpointer-arith -Wmissing-declarations -Wmissing-prototypes -Wstrict-prototypes -Wredundant-decls -Wno-unused-parameter -Wno-missing-field-initializers -Wdeclaration-after-statement -Wformat=2 -Wold-style-definition -Wcast-align -Wformat-nonliteral -Wformat-security -Wsign-compare -Wstrict-aliasing -Wshadow -Winline -Wpacked -Wmissing-format-attribute -Wmissing-noreturn -Winit-self -Wmissing-include-dirs -Wunused-but-set-variable -Warray-bounds -Wimplicit-function-declaration -Wreturn-type -Wswitch-enum -Wswitch-default -Wunused-parameter -Wmissing-field-initializers -Wunused-parameter -Wmissing-field-initializers -pthread -I ../../tools   -O2 -fwrapv -pipe -Wformat -Werror=format-security -gdwarf-4 -fno-debug-types-section -fvar-tracking-assignments -g2 -Wp,-D_FORTIFY_SOURCE=2 -fstack-protector-strong --param=ssp-buffer-size=4 -Werror=trampolines -fomit-frame-pointer -march=i686 -fasynchronous-unwind-tables -mtune=pentium4 -gdwarf-4 -fno-debug-types-section -fvar-tracking-assignments -g2  -MT pmsnare_la-pmsnare.lo -MD -MP -MF .deps/pmsnare_la-pmsnare.Tpo -c -o pmsnare_la-pmsnare.lo `test -f 'pmsnare.c' || echo './'`pmsnare.c
libtool: compile:  i686-pld-linux-gcc -DHAVE_CONFIG_H -I. -I../.. -I../../runtime -I../.. -I../../grammar -I/usr/include/libfastjson -W -Wall -Wformat-security -Wshadow -Wcast-align -Wpointer-arith -Wmissing-format-attribute -Werror=implicit-function-declaration -g -fno-strict-aliasing -Wall -Wextra -Wundef -Wnested-externs -Wwrite-strings -Wpointer-arith -Wmissing-declarations -Wmissing-prototypes -Wstrict-prototypes -Wredundant-decls -Wno-unused-parameter -Wno-missing-field-initializers -Wdeclaration-after-statement -Wformat=2 -Wold-style-definition -Wcast-align -Wformat-nonliteral -Wformat-security -Wsign-compare -Wstrict-aliasing -Wshadow -Winline -Wpacked -Wmissing-format-attribute -Wmissing-noreturn -Winit-self -Wmissing-include-dirs -Wunused-but-set-variable -Warray-bounds -Wimplicit-function-declaration -Wreturn-type -Wswitch-enum -Wswitch-default -Wunused-parameter -Wmissing-field-initializers -Wunused-parameter -Wmissing-field-initializers -pthread -I ../../tools -O2 -fwrapv -pipe -Wformat -Werror=format-security -gdwarf-4 -fno-debug-types-section -fvar-tracking-assignments -g2 -Wp,-D_FORTIFY_SOURCE=2 -fstack-protector-strong --param=ssp-buffer-size=4 -Werror=trampolines -fomit-frame-pointer -march=i686 -fasynchronous-unwind-tables -mtune=pentium4 -gdwarf-4 -fno-debug-types-section -fvar-tracking-assignments -g2 -MT pmsnare_la-pmsnare.lo -MD -MP -MF .deps/pmsnare_la-pmsnare.Tpo -c pmsnare.c  -fPIC -DPIC -o .libs/pmsnare_la-pmsnare.o
mv -f .deps/pmsnare_la-pmsnare.Tpo .deps/pmsnare_la-pmsnare.Plo
make[2]: Leaving directory '/tmp/B.HOF1_A/BUILD/rsyslog-8.2004.0/contrib/pmsnare'
make[2]: Entering directory '/tmp/B.HOF1_A/BUILD/rsyslog-8.2004.0/contrib/pmsnare'
/bin/sh ../../libtool  --tag=CC   --mode=link i686-pld-linux-gcc  -O2 -fwrapv -pipe -Wformat -Werror=format-security -gdwarf-4 -fno-debug-types-section -fvar-tracking-assignments -g2 -Wp,-D_FORTIFY_SOURCE=2 -fstack-protector-strong --param=ssp-buffer-size=4 -Werror=trampolines -fomit-frame-pointer -march=i686 -fasynchronous-unwind-tables -mtune=pentium4 -gdwarf-4 -fno-debug-types-section -fvar-tracking-assignments -g2  -module -avoid-version -Wl,--as-needed -Wl,--no-copy-dt-needed-entries -Wl,-z,relro -Wl,-z,combreloc  -o pmsnare.la -rpath /usr/lib/rsyslog pmsnare_la-pmsnare.lo  
libtool: link: i686-pld-linux-gcc -shared  -fPIC -DPIC  .libs/pmsnare_la-pmsnare.o    -O2 -gdwarf-4 -g2 -fstack-protector-strong -march=i686 -mtune=pentium4 -gdwarf-4 -g2 -Wl,--as-needed -Wl,--no-copy-dt-needed-entries -Wl,-z -Wl,relro -Wl,-z -Wl,combreloc   -Wl,-soname -Wl,pmsnare.so -o .libs/pmsnare.so
libtool: link: ( cd ".libs" && rm -f "pmsnare.la" && ln -s "../pmsnare.la" "pmsnare.la" )
make[2]: Leaving directory '/tmp/B.HOF1_A/BUILD/rsyslog-8.2004.0/contrib/pmsnare'
Making all in contrib/pmpanngfw
make[2]: Entering directory '/tmp/B.HOF1_A/BUILD/rsyslog-8.2004.0/contrib/pmpanngfw'
/bin/sh ../../libtool  --tag=CC   --mode=compile i686-pld-linux-gcc -DHAVE_CONFIG_H -I. -I../..  -I../../runtime -I../.. -I../../grammar  -I/usr/include/libfastjson  -W -Wall -Wformat-security -Wshadow -Wcast-align -Wpointer-arith -Wmissing-format-attribute -Werror=implicit-function-declaration -g -fno-strict-aliasing -Wall -Wextra -Wundef -Wnested-externs -Wwrite-strings -Wpointer-arith -Wmissing-declarations -Wmissing-prototypes -Wstrict-prototypes -Wredundant-decls -Wno-unused-parameter -Wno-missing-field-initializers -Wdeclaration-after-statement -Wformat=2 -Wold-style-definition -Wcast-align -Wformat-nonliteral -Wformat-security -Wsign-compare -Wstrict-aliasing -Wshadow -Winline -Wpacked -Wmissing-format-attribute -Wmissing-noreturn -Winit-self -Wmissing-include-dirs -Wunused-but-set-variable -Warray-bounds -Wimplicit-function-declaration -Wreturn-type -Wswitch-enum -Wswitch-default -Wunused-parameter -Wmissing-field-initializers -Wunused-parameter -Wmissing-field-initializers -pthread -I ../../tools   -O2 -fwrapv -pipe -Wformat -Werror=format-security -gdwarf-4 -fno-debug-types-section -fvar-tracking-assignments -g2 -Wp,-D_FORTIFY_SOURCE=2 -fstack-protector-strong --param=ssp-buffer-size=4 -Werror=trampolines -fomit-frame-pointer -march=i686 -fasynchronous-unwind-tables -mtune=pentium4 -gdwarf-4 -fno-debug-types-section -fvar-tracking-assignments -g2  -MT pmpanngfw_la-pmpanngfw.lo -MD -MP -MF .deps/pmpanngfw_la-pmpanngfw.Tpo -c -o pmpanngfw_la-pmpanngfw.lo `test -f 'pmpanngfw.c' || echo './'`pmpanngfw.c
libtool: compile:  i686-pld-linux-gcc -DHAVE_CONFIG_H -I. -I../.. -I../../runtime -I../.. -I../../grammar -I/usr/include/libfastjson -W -Wall -Wformat-security -Wshadow -Wcast-align -Wpointer-arith -Wmissing-format-attribute -Werror=implicit-function-declaration -g -fno-strict-aliasing -Wall -Wextra -Wundef -Wnested-externs -Wwrite-strings -Wpointer-arith -Wmissing-declarations -Wmissing-prototypes -Wstrict-prototypes -Wredundant-decls -Wno-unused-parameter -Wno-missing-field-initializers -Wdeclaration-after-statement -Wformat=2 -Wold-style-definition -Wcast-align -Wformat-nonliteral -Wformat-security -Wsign-compare -Wstrict-aliasing -Wshadow -Winline -Wpacked -Wmissing-format-attribute -Wmissing-noreturn -Winit-self -Wmissing-include-dirs -Wunused-but-set-variable -Warray-bounds -Wimplicit-function-declaration -Wreturn-type -Wswitch-enum -Wswitch-default -Wunused-parameter -Wmissing-field-initializers -Wunused-parameter -Wmissing-field-initializers -pthread -I ../../tools -O2 -fwrapv -pipe -Wformat -Werror=format-security -gdwarf-4 -fno-debug-types-section -fvar-tracking-assignments -g2 -Wp,-D_FORTIFY_SOURCE=2 -fstack-protector-strong --param=ssp-buffer-size=4 -Werror=trampolines -fomit-frame-pointer -march=i686 -fasynchronous-unwind-tables -mtune=pentium4 -gdwarf-4 -fno-debug-types-section -fvar-tracking-assignments -g2 -MT pmpanngfw_la-pmpanngfw.lo -MD -MP -MF .deps/pmpanngfw_la-pmpanngfw.Tpo -c pmpanngfw.c  -fPIC -DPIC -o .libs/pmpanngfw_la-pmpanngfw.o
mv -f .deps/pmpanngfw_la-pmpanngfw.Tpo .deps/pmpanngfw_la-pmpanngfw.Plo
make[2]: Leaving directory '/tmp/B.HOF1_A/BUILD/rsyslog-8.2004.0/contrib/pmpanngfw'
make[2]: Entering directory '/tmp/B.HOF1_A/BUILD/rsyslog-8.2004.0/contrib/pmpanngfw'
/bin/sh ../../libtool  --tag=CC   --mode=link i686-pld-linux-gcc  -O2 -fwrapv -pipe -Wformat -Werror=format-security -gdwarf-4 -fno-debug-types-section -fvar-tracking-assignments -g2 -Wp,-D_FORTIFY_SOURCE=2 -fstack-protector-strong --param=ssp-buffer-size=4 -Werror=trampolines -fomit-frame-pointer -march=i686 -fasynchronous-unwind-tables -mtune=pentium4 -gdwarf-4 -fno-debug-types-section -fvar-tracking-assignments -g2  -module -avoid-version -Wl,--as-needed -Wl,--no-copy-dt-needed-entries -Wl,-z,relro -Wl,-z,combreloc  -o pmpanngfw.la -rpath /usr/lib/rsyslog pmpanngfw_la-pmpanngfw.lo  
libtool: link: i686-pld-linux-gcc -shared  -fPIC -DPIC  .libs/pmpanngfw_la-pmpanngfw.o    -O2 -gdwarf-4 -g2 -fstack-protector-strong -march=i686 -mtune=pentium4 -gdwarf-4 -g2 -Wl,--as-needed -Wl,--no-copy-dt-needed-entries -Wl,-z -Wl,relro -Wl,-z -Wl,combreloc   -Wl,-soname -Wl,pmpanngfw.so -o .libs/pmpanngfw.so
libtool: link: ( cd ".libs" && rm -f "pmpanngfw.la" && ln -s "../pmpanngfw.la" "pmpanngfw.la" )
make[2]: Leaving directory '/tmp/B.HOF1_A/BUILD/rsyslog-8.2004.0/contrib/pmpanngfw'
Making all in plugins/pmlastmsg
make[2]: Entering directory '/tmp/B.HOF1_A/BUILD/rsyslog-8.2004.0/plugins/pmlastmsg'
/bin/sh ../../libtool  --tag=CC   --mode=compile i686-pld-linux-gcc -DHAVE_CONFIG_H -I. -I../..  -I../../runtime -I../.. -I../../grammar  -I/usr/include/libfastjson  -W -Wall -Wformat-security -Wshadow -Wcast-align -Wpointer-arith -Wmissing-format-attribute -Werror=implicit-function-declaration -g -fno-strict-aliasing -Wall -Wextra -Wundef -Wnested-externs -Wwrite-strings -Wpointer-arith -Wmissing-declarations -Wmissing-prototypes -Wstrict-prototypes -Wredundant-decls -Wno-unused-parameter -Wno-missing-field-initializers -Wdeclaration-after-statement -Wformat=2 -Wold-style-definition -Wcast-align -Wformat-nonliteral -Wformat-security -Wsign-compare -Wstrict-aliasing -Wshadow -Winline -Wpacked -Wmissing-format-attribute -Wmissing-noreturn -Winit-self -Wmissing-include-dirs -Wunused-but-set-variable -Warray-bounds -Wimplicit-function-declaration -Wreturn-type -Wswitch-enum -Wswitch-default -Wunused-parameter -Wmissing-field-initializers -Wunused-parameter -Wmissing-field-initializers -pthread -I ../../tools   -O2 -fwrapv -pipe -Wformat -Werror=format-security -gdwarf-4 -fno-debug-types-section -fvar-tracking-assignments -g2 -Wp,-D_FORTIFY_SOURCE=2 -fstack-protector-strong --param=ssp-buffer-size=4 -Werror=trampolines -fomit-frame-pointer -march=i686 -fasynchronous-unwind-tables -mtune=pentium4 -gdwarf-4 -fno-debug-types-section -fvar-tracking-assignments -g2  -MT pmlastmsg_la-pmlastmsg.lo -MD -MP -MF .deps/pmlastmsg_la-pmlastmsg.Tpo -c -o pmlastmsg_la-pmlastmsg.lo `test -f 'pmlastmsg.c' || echo './'`pmlastmsg.c
libtool: compile:  i686-pld-linux-gcc -DHAVE_CONFIG_H -I. -I../.. -I../../runtime -I../.. -I../../grammar -I/usr/include/libfastjson -W -Wall -Wformat-security -Wshadow -Wcast-align -Wpointer-arith -Wmissing-format-attribute -Werror=implicit-function-declaration -g -fno-strict-aliasing -Wall -Wextra -Wundef -Wnested-externs -Wwrite-strings -Wpointer-arith -Wmissing-declarations -Wmissing-prototypes -Wstrict-prototypes -Wredundant-decls -Wno-unused-parameter -Wno-missing-field-initializers -Wdeclaration-after-statement -Wformat=2 -Wold-style-definition -Wcast-align -Wformat-nonliteral -Wformat-security -Wsign-compare -Wstrict-aliasing -Wshadow -Winline -Wpacked -Wmissing-format-attribute -Wmissing-noreturn -Winit-self -Wmissing-include-dirs -Wunused-but-set-variable -Warray-bounds -Wimplicit-function-declaration -Wreturn-type -Wswitch-enum -Wswitch-default -Wunused-parameter -Wmissing-field-initializers -Wunused-parameter -Wmissing-field-initializers -pthread -I ../../tools -O2 -fwrapv -pipe -Wformat -Werror=format-security -gdwarf-4 -fno-debug-types-section -fvar-tracking-assignments -g2 -Wp,-D_FORTIFY_SOURCE=2 -fstack-protector-strong --param=ssp-buffer-size=4 -Werror=trampolines -fomit-frame-pointer -march=i686 -fasynchronous-unwind-tables -mtune=pentium4 -gdwarf-4 -fno-debug-types-section -fvar-tracking-assignments -g2 -MT pmlastmsg_la-pmlastmsg.lo -MD -MP -MF .deps/pmlastmsg_la-pmlastmsg.Tpo -c pmlastmsg.c  -fPIC -DPIC -o .libs/pmlastmsg_la-pmlastmsg.o
mv -f .deps/pmlastmsg_la-pmlastmsg.Tpo .deps/pmlastmsg_la-pmlastmsg.Plo
make[2]: Leaving directory '/tmp/B.HOF1_A/BUILD/rsyslog-8.2004.0/plugins/pmlastmsg'
make[2]: Entering directory '/tmp/B.HOF1_A/BUILD/rsyslog-8.2004.0/plugins/pmlastmsg'
/bin/sh ../../libtool  --tag=CC   --mode=link i686-pld-linux-gcc  -O2 -fwrapv -pipe -Wformat -Werror=format-security -gdwarf-4 -fno-debug-types-section -fvar-tracking-assignments -g2 -Wp,-D_FORTIFY_SOURCE=2 -fstack-protector-strong --param=ssp-buffer-size=4 -Werror=trampolines -fomit-frame-pointer -march=i686 -fasynchronous-unwind-tables -mtune=pentium4 -gdwarf-4 -fno-debug-types-section -fvar-tracking-assignments -g2  -module -avoid-version -Wl,--as-needed -Wl,--no-copy-dt-needed-entries -Wl,-z,relro -Wl,-z,combreloc  -o pmlastmsg.la -rpath /usr/lib/rsyslog pmlastmsg_la-pmlastmsg.lo  
libtool: link: i686-pld-linux-gcc -shared  -fPIC -DPIC  .libs/pmlastmsg_la-pmlastmsg.o    -O2 -gdwarf-4 -g2 -fstack-protector-strong -march=i686 -mtune=pentium4 -gdwarf-4 -g2 -Wl,--as-needed -Wl,--no-copy-dt-needed-entries -Wl,-z -Wl,relro -Wl,-z -Wl,combreloc   -Wl,-soname -Wl,pmlastmsg.so -o .libs/pmlastmsg.so
libtool: link: ( cd ".libs" && rm -f "pmlastmsg.la" && ln -s "../pmlastmsg.la" "pmlastmsg.la" )
make[2]: Leaving directory '/tmp/B.HOF1_A/BUILD/rsyslog-8.2004.0/plugins/pmlastmsg'
Making all in plugins/omruleset
make[2]: Entering directory '/tmp/B.HOF1_A/BUILD/rsyslog-8.2004.0/plugins/omruleset'
/bin/sh ../../libtool  --tag=CC   --mode=compile i686-pld-linux-gcc -DHAVE_CONFIG_H -I. -I../..  -I../../runtime -I../.. -I../../grammar  -I/usr/include/libfastjson  -W -Wall -Wformat-security -Wshadow -Wcast-align -Wpointer-arith -Wmissing-format-attribute -Werror=implicit-function-declaration -g -fno-strict-aliasing -Wall -Wextra -Wundef -Wnested-externs -Wwrite-strings -Wpointer-arith -Wmissing-declarations -Wmissing-prototypes -Wstrict-prototypes -Wredundant-decls -Wno-unused-parameter -Wno-missing-field-initializers -Wdeclaration-after-statement -Wformat=2 -Wold-style-definition -Wcast-align -Wformat-nonliteral -Wformat-security -Wsign-compare -Wstrict-aliasing -Wshadow -Winline -Wpacked -Wmissing-format-attribute -Wmissing-noreturn -Winit-self -Wmissing-include-dirs -Wunused-but-set-variable -Warray-bounds -Wimplicit-function-declaration -Wreturn-type -Wswitch-enum -Wswitch-default -Wunused-parameter -Wmissing-field-initializers -Wunused-parameter -Wmissing-field-initializers -pthread   -O2 -fwrapv -pipe -Wformat -Werror=format-security -gdwarf-4 -fno-debug-types-section -fvar-tracking-assignments -g2 -Wp,-D_FORTIFY_SOURCE=2 -fstack-protector-strong --param=ssp-buffer-size=4 -Werror=trampolines -fomit-frame-pointer -march=i686 -fasynchronous-unwind-tables -mtune=pentium4 -gdwarf-4 -fno-debug-types-section -fvar-tracking-assignments -g2  -MT omruleset_la-omruleset.lo -MD -MP -MF .deps/omruleset_la-omruleset.Tpo -c -o omruleset_la-omruleset.lo `test -f 'omruleset.c' || echo './'`omruleset.c
libtool: compile:  i686-pld-linux-gcc -DHAVE_CONFIG_H -I. -I../.. -I../../runtime -I../.. -I../../grammar -I/usr/include/libfastjson -W -Wall -Wformat-security -Wshadow -Wcast-align -Wpointer-arith -Wmissing-format-attribute -Werror=implicit-function-declaration -g -fno-strict-aliasing -Wall -Wextra -Wundef -Wnested-externs -Wwrite-strings -Wpointer-arith -Wmissing-declarations -Wmissing-prototypes -Wstrict-prototypes -Wredundant-decls -Wno-unused-parameter -Wno-missing-field-initializers -Wdeclaration-after-statement -Wformat=2 -Wold-style-definition -Wcast-align -Wformat-nonliteral -Wformat-security -Wsign-compare -Wstrict-aliasing -Wshadow -Winline -Wpacked -Wmissing-format-attribute -Wmissing-noreturn -Winit-self -Wmissing-include-dirs -Wunused-but-set-variable -Warray-bounds -Wimplicit-function-declaration -Wreturn-type -Wswitch-enum -Wswitch-default -Wunused-parameter -Wmissing-field-initializers -Wunused-parameter -Wmissing-field-initializers -pthread -O2 -fwrapv -pipe -Wformat -Werror=format-security -gdwarf-4 -fno-debug-types-section -fvar-tracking-assignments -g2 -Wp,-D_FORTIFY_SOURCE=2 -fstack-protector-strong --param=ssp-buffer-size=4 -Werror=trampolines -fomit-frame-pointer -march=i686 -fasynchronous-unwind-tables -mtune=pentium4 -gdwarf-4 -fno-debug-types-section -fvar-tracking-assignments -g2 -MT omruleset_la-omruleset.lo -MD -MP -MF .deps/omruleset_la-omruleset.Tpo -c omruleset.c  -fPIC -DPIC -o .libs/omruleset_la-omruleset.o
mv -f .deps/omruleset_la-omruleset.Tpo .deps/omruleset_la-omruleset.Plo
make[2]: Leaving directory '/tmp/B.HOF1_A/BUILD/rsyslog-8.2004.0/plugins/omruleset'
make[2]: Entering directory '/tmp/B.HOF1_A/BUILD/rsyslog-8.2004.0/plugins/omruleset'
/bin/sh ../../libtool  --tag=CC   --mode=link i686-pld-linux-gcc  -O2 -fwrapv -pipe -Wformat -Werror=format-security -gdwarf-4 -fno-debug-types-section -fvar-tracking-assignments -g2 -Wp,-D_FORTIFY_SOURCE=2 -fstack-protector-strong --param=ssp-buffer-size=4 -Werror=trampolines -fomit-frame-pointer -march=i686 -fasynchronous-unwind-tables -mtune=pentium4 -gdwarf-4 -fno-debug-types-section -fvar-tracking-assignments -g2  -module -avoid-version -Wl,--as-needed -Wl,--no-copy-dt-needed-entries -Wl,-z,relro -Wl,-z,combreloc  -o omruleset.la -rpath /usr/lib/rsyslog omruleset_la-omruleset.lo  
libtool: link: i686-pld-linux-gcc -shared  -fPIC -DPIC  .libs/omruleset_la-omruleset.o    -O2 -gdwarf-4 -g2 -fstack-protector-strong -march=i686 -mtune=pentium4 -gdwarf-4 -g2 -Wl,--as-needed -Wl,--no-copy-dt-needed-entries -Wl,-z -Wl,relro -Wl,-z -Wl,combreloc   -Wl,-soname -Wl,omruleset.so -o .libs/omruleset.so
libtool: link: ( cd ".libs" && rm -f "omruleset.la" && ln -s "../omruleset.la" "omruleset.la" )
make[2]: Leaving directory '/tmp/B.HOF1_A/BUILD/rsyslog-8.2004.0/plugins/omruleset'
Making all in plugins/omudpspoof
make[2]: Entering directory '/tmp/B.HOF1_A/BUILD/rsyslog-8.2004.0/plugins/omudpspoof'
/bin/sh ../../libtool  --tag=CC   --mode=compile i686-pld-linux-gcc -DHAVE_CONFIG_H -I. -I../..  -I../../runtime -I../.. -I../../grammar  -I/usr/include/libfastjson  -W -Wall -Wformat-security -Wshadow -Wcast-align -Wpointer-arith -Wmissing-format-attribute -Werror=implicit-function-declaration -g -fno-strict-aliasing -Wall -Wextra -Wundef -Wnested-externs -Wwrite-strings -Wpointer-arith -Wmissing-declarations -Wmissing-prototypes -Wstrict-prototypes -Wredundant-decls -Wno-unused-parameter -Wno-missing-field-initializers -Wdeclaration-after-statement -Wformat=2 -Wold-style-definition -Wcast-align -Wformat-nonliteral -Wformat-security -Wsign-compare -Wstrict-aliasing -Wshadow -Winline -Wpacked -Wmissing-format-attribute -Wmissing-noreturn -Winit-self -Wmissing-include-dirs -Wunused-but-set-variable -Warray-bounds -Wimplicit-function-declaration -Wreturn-type -Wswitch-enum -Wswitch-default -Wunused-parameter -Wmissing-field-initializers -Wunused-parameter -Wmissing-field-initializers -pthread    -O2 -fwrapv -pipe -Wformat -Werror=format-security -gdwarf-4 -fno-debug-types-section -fvar-tracking-assignments -g2 -Wp,-D_FORTIFY_SOURCE=2 -fstack-protector-strong --param=ssp-buffer-size=4 -Werror=trampolines -fomit-frame-pointer -march=i686 -fasynchronous-unwind-tables -mtune=pentium4 -gdwarf-4 -fno-debug-types-section -fvar-tracking-assignments -g2  -MT omudpspoof_la-omudpspoof.lo -MD -MP -MF .deps/omudpspoof_la-omudpspoof.Tpo -c -o omudpspoof_la-omudpspoof.lo `test -f 'omudpspoof.c' || echo './'`omudpspoof.c
libtool: compile:  i686-pld-linux-gcc -DHAVE_CONFIG_H -I. -I../.. -I../../runtime -I../.. -I../../grammar -I/usr/include/libfastjson -W -Wall -Wformat-security -Wshadow -Wcast-align -Wpointer-arith -Wmissing-format-attribute -Werror=implicit-function-declaration -g -fno-strict-aliasing -Wall -Wextra -Wundef -Wnested-externs -Wwrite-strings -Wpointer-arith -Wmissing-declarations -Wmissing-prototypes -Wstrict-prototypes -Wredundant-decls -Wno-unused-parameter -Wno-missing-field-initializers -Wdeclaration-after-statement -Wformat=2 -Wold-style-definition -Wcast-align -Wformat-nonliteral -Wformat-security -Wsign-compare -Wstrict-aliasing -Wshadow -Winline -Wpacked -Wmissing-format-attribute -Wmissing-noreturn -Winit-self -Wmissing-include-dirs -Wunused-but-set-variable -Warray-bounds -Wimplicit-function-declaration -Wreturn-type -Wswitch-enum -Wswitch-default -Wunused-parameter -Wmissing-field-initializers -Wunused-parameter -Wmissing-field-initializers -pthread -O2 -fwrapv -pipe -Wformat -Werror=format-security -gdwarf-4 -fno-debug-types-section -fvar-tracking-assignments -g2 -Wp,-D_FORTIFY_SOURCE=2 -fstack-protector-strong --param=ssp-buffer-size=4 -Werror=trampolines -fomit-frame-pointer -march=i686 -fasynchronous-unwind-tables -mtune=pentium4 -gdwarf-4 -fno-debug-types-section -fvar-tracking-assignments -g2 -MT omudpspoof_la-omudpspoof.lo -MD -MP -MF .deps/omudpspoof_la-omudpspoof.Tpo -c omudpspoof.c  -fPIC -DPIC -o .libs/omudpspoof_la-omudpspoof.o
mv -f .deps/omudpspoof_la-omudpspoof.Tpo .deps/omudpspoof_la-omudpspoof.Plo
make[2]: Leaving directory '/tmp/B.HOF1_A/BUILD/rsyslog-8.2004.0/plugins/omudpspoof'
make[2]: Entering directory '/tmp/B.HOF1_A/BUILD/rsyslog-8.2004.0/plugins/omudpspoof'
/bin/sh ../../libtool  --tag=CC   --mode=link i686-pld-linux-gcc  -O2 -fwrapv -pipe -Wformat -Werror=format-security -gdwarf-4 -fno-debug-types-section -fvar-tracking-assignments -g2 -Wp,-D_FORTIFY_SOURCE=2 -fstack-protector-strong --param=ssp-buffer-size=4 -Werror=trampolines -fomit-frame-pointer -march=i686 -fasynchronous-unwind-tables -mtune=pentium4 -gdwarf-4 -fno-debug-types-section -fvar-tracking-assignments -g2  -module -avoid-version -Wl,--as-needed -Wl,--no-copy-dt-needed-entries -Wl,-z,relro -Wl,-z,combreloc  -o omudpspoof.la -rpath /usr/lib/rsyslog omudpspoof_la-omudpspoof.lo -lnet 
libtool: link: i686-pld-linux-gcc -shared  -fPIC -DPIC  .libs/omudpspoof_la-omudpspoof.o   -lnet  -O2 -gdwarf-4 -g2 -fstack-protector-strong -march=i686 -mtune=pentium4 -gdwarf-4 -g2 -Wl,--as-needed -Wl,--no-copy-dt-needed-entries -Wl,-z -Wl,relro -Wl,-z -Wl,combreloc   -Wl,-soname -Wl,omudpspoof.so -o .libs/omudpspoof.so
libtool: link: ( cd ".libs" && rm -f "omudpspoof.la" && ln -s "../omudpspoof.la" "omudpspoof.la" )
make[2]: Leaving directory '/tmp/B.HOF1_A/BUILD/rsyslog-8.2004.0/plugins/omudpspoof'
Making all in plugins/ommongodb
make[2]: Entering directory '/tmp/B.HOF1_A/BUILD/rsyslog-8.2004.0/plugins/ommongodb'
/bin/sh ../../libtool  --tag=CC   --mode=compile i686-pld-linux-gcc -DHAVE_CONFIG_H -I. -I../..  -I../../runtime -I../.. -I../../grammar  -I/usr/include/libfastjson  -W -Wall -Wformat-security -Wshadow -Wcast-align -Wpointer-arith -Wmissing-format-attribute -Werror=implicit-function-declaration -g -fno-strict-aliasing -Wall -Wextra -Wundef -Wnested-externs -Wwrite-strings -Wpointer-arith -Wmissing-declarations -Wmissing-prototypes -Wstrict-prototypes -Wredundant-decls -Wno-unused-parameter -Wno-missing-field-initializers -Wdeclaration-after-statement -Wformat=2 -Wold-style-definition -Wcast-align -Wformat-nonliteral -Wformat-security -Wsign-compare -Wstrict-aliasing -Wshadow -Winline -Wpacked -Wmissing-format-attribute -Wmissing-noreturn -Winit-self -Wmissing-include-dirs -Wunused-but-set-variable -Warray-bounds -Wimplicit-function-declaration -Wreturn-type -Wswitch-enum -Wswitch-default -Wunused-parameter -Wmissing-field-initializers -Wunused-parameter -Wmissing-field-initializers -pthread -I/usr/include/libmongoc-1.0 -I/usr/include/libbson-1.0   -O2 -fwrapv -pipe -Wformat -Werror=format-security -gdwarf-4 -fno-debug-types-section -fvar-tracking-assignments -g2 -Wp,-D_FORTIFY_SOURCE=2 -fstack-protector-strong --param=ssp-buffer-size=4 -Werror=trampolines -fomit-frame-pointer -march=i686 -fasynchronous-unwind-tables -mtune=pentium4 -gdwarf-4 -fno-debug-types-section -fvar-tracking-assignments -g2  -MT ommongodb_la-ommongodb.lo -MD -MP -MF .deps/ommongodb_la-ommongodb.Tpo -c -o ommongodb_la-ommongodb.lo `test -f 'ommongodb.c' || echo './'`ommongodb.c
libtool: compile:  i686-pld-linux-gcc -DHAVE_CONFIG_H -I. -I../.. -I../../runtime -I../.. -I../../grammar -I/usr/include/libfastjson -W -Wall -Wformat-security -Wshadow -Wcast-align -Wpointer-arith -Wmissing-format-attribute -Werror=implicit-function-declaration -g -fno-strict-aliasing -Wall -Wextra -Wundef -Wnested-externs -Wwrite-strings -Wpointer-arith -Wmissing-declarations -Wmissing-prototypes -Wstrict-prototypes -Wredundant-decls -Wno-unused-parameter -Wno-missing-field-initializers -Wdeclaration-after-statement -Wformat=2 -Wold-style-definition -Wcast-align -Wformat-nonliteral -Wformat-security -Wsign-compare -Wstrict-aliasing -Wshadow -Winline -Wpacked -Wmissing-format-attribute -Wmissing-noreturn -Winit-self -Wmissing-include-dirs -Wunused-but-set-variable -Warray-bounds -Wimplicit-function-declaration -Wreturn-type -Wswitch-enum -Wswitch-default -Wunused-parameter -Wmissing-field-initializers -Wunused-parameter -Wmissing-field-initializers -pthread -I/usr/include/libmongoc-1.0 -I/usr/include/libbson-1.0 -O2 -fwrapv -pipe -Wformat -Werror=format-security -gdwarf-4 -fno-debug-types-section -fvar-tracking-assignments -g2 -Wp,-D_FORTIFY_SOURCE=2 -fstack-protector-strong --param=ssp-buffer-size=4 -Werror=trampolines -fomit-frame-pointer -march=i686 -fasynchronous-unwind-tables -mtune=pentium4 -gdwarf-4 -fno-debug-types-section -fvar-tracking-assignments -g2 -MT ommongodb_la-ommongodb.lo -MD -MP -MF .deps/ommongodb_la-ommongodb.Tpo -c ommongodb.c  -fPIC -DPIC -o .libs/ommongodb_la-ommongodb.o
mv -f .deps/ommongodb_la-ommongodb.Tpo .deps/ommongodb_la-ommongodb.Plo
make[2]: Leaving directory '/tmp/B.HOF1_A/BUILD/rsyslog-8.2004.0/plugins/ommongodb'
make[2]: Entering directory '/tmp/B.HOF1_A/BUILD/rsyslog-8.2004.0/plugins/ommongodb'
/bin/sh ../../libtool  --tag=CC   --mode=link i686-pld-linux-gcc  -O2 -fwrapv -pipe -Wformat -Werror=format-security -gdwarf-4 -fno-debug-types-section -fvar-tracking-assignments -g2 -Wp,-D_FORTIFY_SOURCE=2 -fstack-protector-strong --param=ssp-buffer-size=4 -Werror=trampolines -fomit-frame-pointer -march=i686 -fasynchronous-unwind-tables -mtune=pentium4 -gdwarf-4 -fno-debug-types-section -fvar-tracking-assignments -g2  -module -avoid-version -Wl,--as-needed -Wl,--no-copy-dt-needed-entries -Wl,-z,relro -Wl,-z,combreloc  -o ommongodb.la -rpath /usr/lib/rsyslog ommongodb_la-ommongodb.lo -L/usr//usr/lib -lmongoc-1.0 -lbson-1.0 
libtool: link: i686-pld-linux-gcc -shared  -fPIC -DPIC  .libs/ommongodb_la-ommongodb.o   -L/usr//usr/lib -lmongoc-1.0 -lbson-1.0  -O2 -gdwarf-4 -g2 -fstack-protector-strong -march=i686 -mtune=pentium4 -gdwarf-4 -g2 -Wl,--as-needed -Wl,--no-copy-dt-needed-entries -Wl,-z -Wl,relro -Wl,-z -Wl,combreloc   -Wl,-soname -Wl,ommongodb.so -o .libs/ommongodb.so
libtool: link: ( cd ".libs" && rm -f "ommongodb.la" && ln -s "../ommongodb.la" "ommongodb.la" )
make[2]: Leaving directory '/tmp/B.HOF1_A/BUILD/rsyslog-8.2004.0/plugins/ommongodb'
Making all in contrib/omhiredis
make[2]: Entering directory '/tmp/B.HOF1_A/BUILD/rsyslog-8.2004.0/contrib/omhiredis'
/bin/sh ../../libtool  --tag=CC   --mode=compile i686-pld-linux-gcc -DHAVE_CONFIG_H -I. -I../..  -I../../runtime -I../.. -I../../grammar  -I/usr/include/libfastjson  -W -Wall -Wformat-security -Wshadow -Wcast-align -Wpointer-arith -Wmissing-format-attribute -Werror=implicit-function-declaration -g -fno-strict-aliasing -Wall -Wextra -Wundef -Wnested-externs -Wwrite-strings -Wpointer-arith -Wmissing-declarations -Wmissing-prototypes -Wstrict-prototypes -Wredundant-decls -Wno-unused-parameter -Wno-missing-field-initializers -Wdeclaration-after-statement -Wformat=2 -Wold-style-definition -Wcast-align -Wformat-nonliteral -Wformat-security -Wsign-compare -Wstrict-aliasing -Wshadow -Winline -Wpacked -Wmissing-format-attribute -Wmissing-noreturn -Winit-self -Wmissing-include-dirs -Wunused-but-set-variable -Warray-bounds -Wimplicit-function-declaration -Wreturn-type -Wswitch-enum -Wswitch-default -Wunused-parameter -Wmissing-field-initializers -Wunused-parameter -Wmissing-field-initializers -pthread -D_FILE_OFFSET_BITS=64 -I/usr/include/hiredis   -O2 -fwrapv -pipe -Wformat -Werror=format-security -gdwarf-4 -fno-debug-types-section -fvar-tracking-assignments -g2 -Wp,-D_FORTIFY_SOURCE=2 -fstack-protector-strong --param=ssp-buffer-size=4 -Werror=trampolines -fomit-frame-pointer -march=i686 -fasynchronous-unwind-tables -mtune=pentium4 -gdwarf-4 -fno-debug-types-section -fvar-tracking-assignments -g2  -MT omhiredis_la-omhiredis.lo -MD -MP -MF .deps/omhiredis_la-omhiredis.Tpo -c -o omhiredis_la-omhiredis.lo `test -f 'omhiredis.c' || echo './'`omhiredis.c
libtool: compile:  i686-pld-linux-gcc -DHAVE_CONFIG_H -I. -I../.. -I../../runtime -I../.. -I../../grammar -I/usr/include/libfastjson -W -Wall -Wformat-security -Wshadow -Wcast-align -Wpointer-arith -Wmissing-format-attribute -Werror=implicit-function-declaration -g -fno-strict-aliasing -Wall -Wextra -Wundef -Wnested-externs -Wwrite-strings -Wpointer-arith -Wmissing-declarations -Wmissing-prototypes -Wstrict-prototypes -Wredundant-decls -Wno-unused-parameter -Wno-missing-field-initializers -Wdeclaration-after-statement -Wformat=2 -Wold-style-definition -Wcast-align -Wformat-nonliteral -Wformat-security -Wsign-compare -Wstrict-aliasing -Wshadow -Winline -Wpacked -Wmissing-format-attribute -Wmissing-noreturn -Winit-self -Wmissing-include-dirs -Wunused-but-set-variable -Warray-bounds -Wimplicit-function-declaration -Wreturn-type -Wswitch-enum -Wswitch-default -Wunused-parameter -Wmissing-field-initializers -Wunused-parameter -Wmissing-field-initializers -pthread -D_FILE_OFFSET_BITS=64 -I/usr/include/hiredis -O2 -fwrapv -pipe -Wformat -Werror=format-security -gdwarf-4 -fno-debug-types-section -fvar-tracking-assignments -g2 -Wp,-D_FORTIFY_SOURCE=2 -fstack-protector-strong --param=ssp-buffer-size=4 -Werror=trampolines -fomit-frame-pointer -march=i686 -fasynchronous-unwind-tables -mtune=pentium4 -gdwarf-4 -fno-debug-types-section -fvar-tracking-assignments -g2 -MT omhiredis_la-omhiredis.lo -MD -MP -MF .deps/omhiredis_la-omhiredis.Tpo -c omhiredis.c  -fPIC -DPIC -o .libs/omhiredis_la-omhiredis.o
mv -f .deps/omhiredis_la-omhiredis.Tpo .deps/omhiredis_la-omhiredis.Plo
make[2]: Leaving directory '/tmp/B.HOF1_A/BUILD/rsyslog-8.2004.0/contrib/omhiredis'
make[2]: Entering directory '/tmp/B.HOF1_A/BUILD/rsyslog-8.2004.0/contrib/omhiredis'
/bin/sh ../../libtool  --tag=CC   --mode=link i686-pld-linux-gcc  -O2 -fwrapv -pipe -Wformat -Werror=format-security -gdwarf-4 -fno-debug-types-section -fvar-tracking-assignments -g2 -Wp,-D_FORTIFY_SOURCE=2 -fstack-protector-strong --param=ssp-buffer-size=4 -Werror=trampolines -fomit-frame-pointer -march=i686 -fasynchronous-unwind-tables -mtune=pentium4 -gdwarf-4 -fno-debug-types-section -fvar-tracking-assignments -g2  -module -avoid-version -Wl,--as-needed -Wl,--no-copy-dt-needed-entries -Wl,-z,relro -Wl,-z,combreloc  -o omhiredis.la -rpath /usr/lib/rsyslog omhiredis_la-omhiredis.lo -lhiredis 
libtool: link: i686-pld-linux-gcc -shared  -fPIC -DPIC  .libs/omhiredis_la-omhiredis.o   -lhiredis  -O2 -gdwarf-4 -g2 -fstack-protector-strong -march=i686 -mtune=pentium4 -gdwarf-4 -g2 -Wl,--as-needed -Wl,--no-copy-dt-needed-entries -Wl,-z -Wl,relro -Wl,-z -Wl,combreloc   -Wl,-soname -Wl,omhiredis.so -o .libs/omhiredis.so
libtool: link: ( cd ".libs" && rm -f "omhiredis.la" && ln -s "../omhiredis.la" "omhiredis.la" )
make[2]: Leaving directory '/tmp/B.HOF1_A/BUILD/rsyslog-8.2004.0/contrib/omhiredis'
Making all in contrib/omczmq
make[2]: Entering directory '/tmp/B.HOF1_A/BUILD/rsyslog-8.2004.0/contrib/omczmq'
/bin/sh ../../libtool  --tag=CC   --mode=compile i686-pld-linux-gcc -DHAVE_CONFIG_H -I. -I../..  -I../../runtime -I../.. -I../../grammar  -I/usr/include/libfastjson  -W -Wall -Wformat-security -Wshadow -Wcast-align -Wpointer-arith -Wmissing-format-attribute -Werror=implicit-function-declaration -g -fno-strict-aliasing -Wall -Wextra -Wundef -Wnested-externs -Wwrite-strings -Wpointer-arith -Wmissing-declarations -Wmissing-prototypes -Wstrict-prototypes -Wredundant-decls -Wno-unused-parameter -Wno-missing-field-initializers -Wdeclaration-after-statement -Wformat=2 -Wold-style-definition -Wcast-align -Wformat-nonliteral -Wformat-security -Wsign-compare -Wstrict-aliasing -Wshadow -Winline -Wpacked -Wmissing-format-attribute -Wmissing-noreturn -Winit-self -Wmissing-include-dirs -Wunused-but-set-variable -Warray-bounds -Wimplicit-function-declaration -Wreturn-type -Wswitch-enum -Wswitch-default -Wunused-parameter -Wmissing-field-initializers -Wunused-parameter -Wmissing-field-initializers -pthread -DZMQ_BUILD_DRAFT_API=1 -I/usr/include/czmq -I/usr/include/pgm-5.3 -I/usr/include/uuid -I/usr/include/p11-kit-1   -O2 -fwrapv -pipe -Wformat -Werror=format-security -gdwarf-4 -fno-debug-types-section -fvar-tracking-assignments -g2 -Wp,-D_FORTIFY_SOURCE=2 -fstack-protector-strong --param=ssp-buffer-size=4 -Werror=trampolines -fomit-frame-pointer -march=i686 -fasynchronous-unwind-tables -mtune=pentium4 -gdwarf-4 -fno-debug-types-section -fvar-tracking-assignments -g2  -MT omczmq_la-omczmq.lo -MD -MP -MF .deps/omczmq_la-omczmq.Tpo -c -o omczmq_la-omczmq.lo `test -f 'omczmq.c' || echo './'`omczmq.c
libtool: compile:  i686-pld-linux-gcc -DHAVE_CONFIG_H -I. -I../.. -I../../runtime -I../.. -I../../grammar -I/usr/include/libfastjson -W -Wall -Wformat-security -Wshadow -Wcast-align -Wpointer-arith -Wmissing-format-attribute -Werror=implicit-function-declaration -g -fno-strict-aliasing -Wall -Wextra -Wundef -Wnested-externs -Wwrite-strings -Wpointer-arith -Wmissing-declarations -Wmissing-prototypes -Wstrict-prototypes -Wredundant-decls -Wno-unused-parameter -Wno-missing-field-initializers -Wdeclaration-after-statement -Wformat=2 -Wold-style-definition -Wcast-align -Wformat-nonliteral -Wformat-security -Wsign-compare -Wstrict-aliasing -Wshadow -Winline -Wpacked -Wmissing-format-attribute -Wmissing-noreturn -Winit-self -Wmissing-include-dirs -Wunused-but-set-variable -Warray-bounds -Wimplicit-function-declaration -Wreturn-type -Wswitch-enum -Wswitch-default -Wunused-parameter -Wmissing-field-initializers -Wunused-parameter -Wmissing-field-initializers -pthread -DZMQ_BUILD_DRAFT_API=1 -I/usr/include/czmq -I/usr/include/pgm-5.3 -I/usr/include/uuid -I/usr/include/p11-kit-1 -O2 -fwrapv -pipe -Wformat -Werror=format-security -gdwarf-4 -fno-debug-types-section -fvar-tracking-assignments -g2 -Wp,-D_FORTIFY_SOURCE=2 -fstack-protector-strong --param=ssp-buffer-size=4 -Werror=trampolines -fomit-frame-pointer -march=i686 -fasynchronous-unwind-tables -mtune=pentium4 -gdwarf-4 -fno-debug-types-section -fvar-tracking-assignments -g2 -MT omczmq_la-omczmq.lo -MD -MP -MF .deps/omczmq_la-omczmq.Tpo -c omczmq.c  -fPIC -DPIC -o .libs/omczmq_la-omczmq.o
omczmq.c: In function 'outputCZMQ':
omczmq.c:260:10: error: implicit declaration of function 'zframe_set_group'; did you mean 'zframe_set_more'? [-Werror=implicit-function-declaration]
  260 |     rc = zframe_set_group(frame, topic);
      |          ^~~~~~~~~~~~~~~~
      |          zframe_set_more
omczmq.c:260:10: warning: nested extern declaration of 'zframe_set_group' [-Wnested-externs]
cc1: some warnings being treated as errors
make[2]: *** [Makefile:550: omczmq_la-omczmq.lo] Error 1
make[2]: Leaving directory '/tmp/B.HOF1_A/BUILD/rsyslog-8.2004.0/contrib/omczmq'
make[1]: *** [Makefile:938: all-recursive] Error 1
make: *** [Makefile:765: all] Error 2
error: Bad exit status from /tmp/B.HOF1_A/BUILD/tmp/rpm-tmp.70400 (%build)


RPM build errors:
    Bad exit status from /tmp/B.HOF1_A/BUILD/tmp/rpm-tmp.70400 (%build)
ended at: Thu Oct  8 21:13:52 2020, done in 0:00:41.302801
error: No files produced.
+ chmod -R u+rwX /tmp/B.HOF1_A/BUILD
+ rm -rf /tmp/B.HOF1_A/tmp /tmp/B.HOF1_A/BUILD
+ rm -rf /tmp/B.HOF1_A
Begin-PLD-Builder-Info
Build-Time: user:55.85s sys:6.77s real:44.92s (faults io:0 non-io:3725165)

End-PLD-Builder-Info
[Back to list of logs] [View rpm -qa of builder]