FailedOk

th/SRPMS[OK]
th/x32[OK]
th/i686[OK]
th/x86_64[OK]

ac/SRPMS[OK]
ac/i386[OK]
ac/i586[OK]
ac/i686[OK]
ac/alpha[OK]
ac/amd64[OK]
ac/athlon[OK]
ac/ppc[OK]
ac/sparc[OK]
ac/sparc64[OK]

Advanced Search
main()
Powered by PLD Linux
(c) 2002-2017 PLD Team
$Revision: 1.37 $
Powered by Star Treck.
Your IP: 54.80.70.8

rtl8812au 7657096e-01f2-4dc0-839d-3efaa3fd09d0

Status:Failed
Source URL:ftp://buildlogs.pld-linux.org/th/i686/FAIL/rtl8812au,7657096e-01f2-4dc0-839d-3efaa3fd09d0.bz2
text/plain URL:View!
rpm -qa of builder:View!
Date:2017/08/01 18:32:37
Runtime:0:00:09.128193

Toc:

  • prep
  • Executing(%prep): /bin/sh -e /tmp/B.Rzjqfy/BUILD/tmp/rpm-tmp.28872
  • build
  • Executing(%build): /bin/sh -e /tmp/B.Rzjqfy/BUILD/tmp/rpm-tmp.28872
  • error 1
  • /tmp/B.Rzjqfy/BUILD/rtl8812au_linux-master/os_dep/linux/ioctl_cfg80211.c:809:6: error: passing argument 2 of 'cfg80211_roamed' from incompatible pointer type [-Werror=incompatible-pointer-types]
  • error 2
  • /tmp/B.Rzjqfy/BUILD/rtl8812au_linux-master/os_dep/linux/ioctl_cfg80211.c:807:3: error: too many arguments to function 'cfg80211_roamed'
  • error 3
  • /tmp/B.Rzjqfy/BUILD/rtl8812au_linux-master/os_dep/linux/ioctl_cfg80211.c:5994:18: error: 'WIPHY_FLAG_SUPPORTS_SCHED_SCAN' undeclared (first use in this function)
  • error 4
  • /tmp/B.Rzjqfy/BUILD/rtl8812au_linux-master/os_dep/linux/ioctl_cfg80211.c:6024:25: error: initialization from incompatible pointer type [-Werror=incompatible-pointer-types]
  • error 5
  • /tmp/B.Rzjqfy/BUILD/rtl8812au_linux-master/os_dep/linux/ioctl_cfg80211.c:6044:22: error: initialization from incompatible pointer type [-Werror=incompatible-pointer-types]
  • error 6
  • error: Bad exit status from /tmp/B.Rzjqfy/BUILD/tmp/rpm-tmp.28872 (%build)
  • error 7
  • RPM build errors:
  • error 8
  • error: No files produced.

Content:

request from: baggins
checking if we should skip the build
started at: Tue Aug  1 18:32:17 2017
fetching https://srcbuilder.pld-linux.org/th//srpms/7657096e-01f2-4dc0-839d-3efaa3fd09d0/rtl8812au-4.3.2_11100.20140411-0.20140901.15%404.12.4_1.src.rpm
fetched 1699700 bytes, 639.7 K/s
installing srpm: rtl8812au-4.3.2_11100.20140411-0.20140901.15@4.12.4_1.src.rpm
+ install -d /tmp/B.Rzjqfy/BUILD /tmp/B.Rzjqfy/RPMS
+ LC_ALL=en_US.UTF-8
+ rpm -qp --changelog rtl8812au-4.3.2_11100.20140411-0.20140901.15@4.12.4_1.src.rpm
* Tue Aug 01 2017 PLD Linux Team <feedback@pld-linux.org>
- For complete changelog see: http://git.pld-linux.org/?p=packages/rtl8812au.git;a=log;h=auto/th/rtl8812au-4.3.2_11100.20140411-0.20140901.15
* Sat Jul 15 2017 Jan Rękorajski <baggins@pld-linux.org> babdf2c
- fix building with kernel 4.11.9+ - rel 15 * Tue May 09 2017 Jan Rękorajski <baggins@pld-linux.org> 10d0176
- fix building with kernel 4.11 - rel 14 * Tue Oct 11 2016 Jan Rękorajski <baggins@pld-linux.org> 4c684a7
- fix building with linux 4.8 - rel 13 + rpm -Uhv --nodeps --define '_topdir /tmp/B.Rzjqfy' --define '_specdir %{_topdir}' --define '_sourcedir %{_specdir}' --define '_rpmdir %{_topdir}/RPMS' --define '_builddir %{_topdir}/BUILD' --without userspace --define 'build_kernels head,4.9,4.4,4.1' rtl8812au-4.3.2_11100.20140411-0.20140901.15@4.12.4_1.src.rpm Preparing... ################################################## rtl8812au ################################################## + rm -f rtl8812au-4.3.2_11100.20140411-0.20140901.15@4.12.4_1.src.rpm + install -m 700 -d /tmp/B.Rzjqfy/BUILD/tmp + TMPDIR=/tmp/B.Rzjqfy/BUILD/tmp + exec nice -n 0 rpmbuild -bp --short-circuit --nodeps --define '_topdir /tmp/B.Rzjqfy' --define '_specdir %{_topdir}' --define '_sourcedir %{_specdir}' --define '_rpmdir %{_topdir}/RPMS' --define '_builddir %{_topdir}/BUILD' --without userspace --target i686-pld-linux --define 'build_kernels head,4.9,4.4,4.1' --define 'prep exit 0' /tmp/B.Rzjqfy/rtl8812au.spec Building target platforms: i686-pld-linux checking BuildConflict-ing packages no BuildConflicts found checking BR rpm: Building target platforms: i686-pld-linux no BR needed building RPM using: set -ex; : build-id: 7657096e-01f2-4dc0-839d-3efaa3fd09d0; TMPDIR=/tmp/B.Rzjqfy/BUILD/tmp exec nice -n 0 rpmbuild -bb --define '_smp_mflags -j9' --define '_make_opts -Otarget' --define '_pld_builder 1' --define '_topdir /tmp/B.Rzjqfy' --define '_specdir %{_topdir}' --define '_sourcedir %{_specdir}' --define '_rpmdir %{_topdir}/RPMS' --define '_builddir %{_topdir}/BUILD' --without userspace --target i686-pld-linux --define 'build_kernels head,4.9,4.4,4.1' /tmp/B.Rzjqfy/rtl8812au.spec + : build-id: 7657096e-01f2-4dc0-839d-3efaa3fd09d0 + TMPDIR=/tmp/B.Rzjqfy/BUILD/tmp + exec nice -n 0 rpmbuild -bb --define '_smp_mflags -j9' --define '_make_opts -Otarget' --define '_pld_builder 1' --define '_topdir /tmp/B.Rzjqfy' --define '_specdir %{_topdir}' --define '_sourcedir %{_specdir}' --define '_rpmdir %{_topdir}/RPMS' --define '_builddir %{_topdir}/BUILD' --without userspace --target i686-pld-linux --define 'build_kernels head,4.9,4.4,4.1' /tmp/B.Rzjqfy/rtl8812au.spec Building target platforms: i686-pld-linux Executing(%prep): /bin/sh -e /tmp/B.Rzjqfy/BUILD/tmp/rpm-tmp.28872 + umask 022 + cd /tmp/B.Rzjqfy/BUILD + cd /tmp/B.Rzjqfy/BUILD + rm -rf rtl8812au_linux-master + /usr/bin/gzip -dc /tmp/B.Rzjqfy/rtl8812au-4.3.2_11100.20140411-20140901.tar.gz + /bin/tar -xf - + STATUS=0 + '[' 0 -ne 0 ']' + cd rtl8812au_linux-master + /bin/id -u + '[' 1001 '=' 0 ']' + /bin/id -u + '[' 1001 '=' 0 ']' + /bin/chmod -Rf a+rX,u+w,g-w,o-w . + echo 'Patch #0 (linux-3.11.patch):' Patch #0 (linux-3.11.patch): + '[' -f /tmp/B.Rzjqfy/linux-3.11.patch ']' + /bin/cat /tmp/B.Rzjqfy/linux-3.11.patch + /usr/bin/patch -s -p1 + echo 'Patch #1 (disable-debug.patch):' Patch #1 (disable-debug.patch): + '[' -f /tmp/B.Rzjqfy/disable-debug.patch ']' + /bin/cat /tmp/B.Rzjqfy/disable-debug.patch + /usr/bin/patch -s -p1 + echo 'Patch #2 (enable-cfg80211-support.patch):' Patch #2 (enable-cfg80211-support.patch): + '[' -f /tmp/B.Rzjqfy/enable-cfg80211-support.patch ']' + /bin/cat /tmp/B.Rzjqfy/enable-cfg80211-support.patch + /usr/bin/patch -s -p1 + echo 'Patch #3 (update-cfg80211-support.patch):' Patch #3 (update-cfg80211-support.patch): + '[' -f /tmp/B.Rzjqfy/update-cfg80211-support.patch ']' + /bin/cat /tmp/B.Rzjqfy/update-cfg80211-support.patch + /usr/bin/patch -s -p1 + echo 'Patch #4 (warnings.patch):' Patch #4 (warnings.patch): + '[' -f /tmp/B.Rzjqfy/warnings.patch ']' + /bin/cat /tmp/B.Rzjqfy/warnings.patch + /usr/bin/patch -s -p1 + echo 'Patch #5 (gcc-4.9.patch):' Patch #5 (gcc-4.9.patch): + '[' -f /tmp/B.Rzjqfy/gcc-4.9.patch ']' + /bin/cat /tmp/B.Rzjqfy/gcc-4.9.patch + /usr/bin/patch -s -p1 + echo 'Patch #6 (linux-3.18.patch):' Patch #6 (linux-3.18.patch): + '[' -f /tmp/B.Rzjqfy/linux-3.18.patch ']' + /bin/cat /tmp/B.Rzjqfy/linux-3.18.patch + /usr/bin/patch -s -p1 + echo 'Patch #7 (linux-4.0.patch):' Patch #7 (linux-4.0.patch): + '[' -f /tmp/B.Rzjqfy/linux-4.0.patch ']' + /bin/cat /tmp/B.Rzjqfy/linux-4.0.patch + /usr/bin/patch -s -p1 + echo 'Patch #8 (linux-4.1.patch):' Patch #8 (linux-4.1.patch): + '[' -f /tmp/B.Rzjqfy/linux-4.1.patch ']' + /bin/cat /tmp/B.Rzjqfy/linux-4.1.patch + /usr/bin/patch -s -p1 + echo 'Patch #9 (linux-4.2.patch):' Patch #9 (linux-4.2.patch): + '[' -f /tmp/B.Rzjqfy/linux-4.2.patch ']' + /bin/cat /tmp/B.Rzjqfy/linux-4.2.patch + /usr/bin/patch -s -p1 + echo 'Patch #10 (linux-4.3.patch):' Patch #10 (linux-4.3.patch): + '[' -f /tmp/B.Rzjqfy/linux-4.3.patch ']' + /bin/cat /tmp/B.Rzjqfy/linux-4.3.patch + /usr/bin/patch -s -p1 + echo 'Patch #11 (linux-4.6.patch):' Patch #11 (linux-4.6.patch): + '[' -f /tmp/B.Rzjqfy/linux-4.6.patch ']' + /bin/cat /tmp/B.Rzjqfy/linux-4.6.patch + /usr/bin/patch -s -p1 + echo 'Patch #12 (linux-4.7.patch):' Patch #12 (linux-4.7.patch): + '[' -f /tmp/B.Rzjqfy/linux-4.7.patch ']' + /bin/cat /tmp/B.Rzjqfy/linux-4.7.patch + /usr/bin/patch -s -p1 + echo 'Patch #13 (linux-4.8.patch):' Patch #13 (linux-4.8.patch): + '[' -f /tmp/B.Rzjqfy/linux-4.8.patch ']' + /bin/cat /tmp/B.Rzjqfy/linux-4.8.patch + /usr/bin/patch -s -p1 + echo 'Patch #14 (linux-4.11.patch):' Patch #14 (linux-4.11.patch): + '[' -f /tmp/B.Rzjqfy/linux-4.11.patch ']' + /bin/cat /tmp/B.Rzjqfy/linux-4.11.patch + /usr/bin/patch -s -p1 + echo 'Patch #15 (linux-4.11.9.patch):' Patch #15 (linux-4.11.9.patch): + '[' -f /tmp/B.Rzjqfy/linux-4.11.9.patch ']' + /bin/cat /tmp/B.Rzjqfy/linux-4.11.9.patch + /usr/bin/patch -s -p1 + exit 0 Executing(%build): /bin/sh -e /tmp/B.Rzjqfy/BUILD/tmp/rpm-tmp.28872 TMP=/home/users/builder/tmp HOME=/home/users/builder PATH=/home/users/builder/GNUstep/Tools:/usr/local/bin:/usr/bin:/bin:/home/users/builder/bin TMPDIR=/tmp/B.Rzjqfy/BUILD/tmp + umask 022 + cd /tmp/B.Rzjqfy/BUILD + cd rtl8812au_linux-master + /usr/bin/make -Otarget -j9 clean 'KVER=4.12.4-1' 'KSRC=/usr/src/linux' cd hal/OUTSRC/ ; rm -fr */*.mod.c */*.mod */*.o */.*.cmd */*.ko cd hal/OUTSRC/ ; rm -fr *.mod.c *.mod *.o .*.cmd *.ko cd hal/led ; rm -fr *.mod.c *.mod *.o .*.cmd *.ko cd hal ; rm -fr */*/*.mod.c */*/*.mod */*/*.o */*/.*.cmd */*/*.ko cd hal ; rm -fr */*.mod.c */*.mod */*.o */.*.cmd */*.ko cd hal ; rm -fr *.mod.c *.mod *.o .*.cmd *.ko cd core/efuse ; rm -fr *.mod.c *.mod *.o .*.cmd *.ko cd core ; rm -fr *.mod.c *.mod *.o .*.cmd *.ko cd os_dep/linux ; rm -fr *.mod.c *.mod *.o .*.cmd *.ko cd os_dep ; rm -fr *.mod.c *.mod *.o .*.cmd *.ko cd platform ; rm -fr *.mod.c *.mod *.o .*.cmd *.ko rm -fr Module.symvers ; rm -fr Module.markers ; rm -fr modules.order rm -fr *.mod.c *.mod *.o .*.cmd *.ko *~ rm -fr .tmp_versions + /usr/bin/make -Otarget -j9 modules 'KVER=4.12.4-1' 'KSRC=/usr/src/linux' /usr/bin/make ARCH=i386 CROSS_COMPILE= -C /usr/src/linux M=/tmp/B.Rzjqfy/BUILD/rtl8812au_linux-master modules CC [M] /tmp/B.Rzjqfy/BUILD/rtl8812au_linux-master/core/rtw_io.o CC [M] /tmp/B.Rzjqfy/BUILD/rtl8812au_linux-master/core/rtw_cmd.o CC [M] /tmp/B.Rzjqfy/BUILD/rtl8812au_linux-master/core/rtw_security.o /tmp/B.Rzjqfy/BUILD/rtl8812au_linux-master/core/rtw_security.c: In function 'aes_cipher': /tmp/B.Rzjqfy/BUILD/rtl8812au_linux-master/core/rtw_security.c:1540:5: warning: this 'for' clause does not guard... [-Wmisleading-indentation] for (j = 0; j < 8; j++) ^~~ /tmp/B.Rzjqfy/BUILD/rtl8812au_linux-master/core/rtw_security.c:1543:2: note: ...this statement, but the latter is misleadingly indented as if it is guarded by the 'for' payload_index = hdrlen + 8; ^~~~~~~~~~~~~ /tmp/B.Rzjqfy/BUILD/rtl8812au_linux-master/core/rtw_security.c: In function 'aes_decipher': /tmp/B.Rzjqfy/BUILD/rtl8812au_linux-master/core/rtw_security.c:1925:5: warning: this 'for' clause does not guard... [-Wmisleading-indentation] for (j = 0; j < 8; j++) ^~~ /tmp/B.Rzjqfy/BUILD/rtl8812au_linux-master/core/rtw_security.c:1928:2: note: ...this statement, but the latter is misleadingly indented as if it is guarded by the 'for' payload_index = hdrlen + 8; ^~~~~~~~~~~~~ CC [M] /tmp/B.Rzjqfy/BUILD/rtl8812au_linux-master/core/rtw_debug.o CC [M] /tmp/B.Rzjqfy/BUILD/rtl8812au_linux-master/core/rtw_ioctl_query.o CC [M] /tmp/B.Rzjqfy/BUILD/rtl8812au_linux-master/core/rtw_ioctl_set.o CC [M] /tmp/B.Rzjqfy/BUILD/rtl8812au_linux-master/core/rtw_ieee80211.o CC [M] /tmp/B.Rzjqfy/BUILD/rtl8812au_linux-master/core/rtw_mlme.o /tmp/B.Rzjqfy/BUILD/rtl8812au_linux-master/core/rtw_mlme.c: In function 'rtw_restructure_ht_ie': /tmp/B.Rzjqfy/BUILD/rtl8812au_linux-master/core/rtw_mlme.c:3925:3: warning: this 'if' clause does not guard... [-Wmisleading-indentation] if (stbc_rx_enable) ^~ /tmp/B.Rzjqfy/BUILD/rtl8812au_linux-master/core/rtw_mlme.c:3928:18: note: ...this statement, but the latter is misleadingly indented as if it is guarded by the 'if' set_mcs_rate_by_mask(ht_capie.supp_mcs_set, MCS_RATE_1R); ^~~~~~~~~~~~~~~~~~~~ CC [M] /tmp/B.Rzjqfy/BUILD/rtl8812au_linux-master/core/rtw_rf.o CC [M] /tmp/B.Rzjqfy/BUILD/rtl8812au_linux-master/core/rtw_vht.o CC [M] /tmp/B.Rzjqfy/BUILD/rtl8812au_linux-master/core/rtw_sta_mgt.o CC [M] /tmp/B.Rzjqfy/BUILD/rtl8812au_linux-master/core/rtw_pwrctrl.o CC [M] /tmp/B.Rzjqfy/BUILD/rtl8812au_linux-master/core/rtw_recv.o CC [M] /tmp/B.Rzjqfy/BUILD/rtl8812au_linux-master/core/rtw_wlan_util.o CC [M] /tmp/B.Rzjqfy/BUILD/rtl8812au_linux-master/core/rtw_mlme_ext.o CC [M] /tmp/B.Rzjqfy/BUILD/rtl8812au_linux-master/core/rtw_btcoex.o CC [M] /tmp/B.Rzjqfy/BUILD/rtl8812au_linux-master/core/rtw_ap.o CC [M] /tmp/B.Rzjqfy/BUILD/rtl8812au_linux-master/core/rtw_xmit.o CC [M] /tmp/B.Rzjqfy/BUILD/rtl8812au_linux-master/core/rtw_tdls.o CC [M] /tmp/B.Rzjqfy/BUILD/rtl8812au_linux-master/core/rtw_iol.o CC [M] /tmp/B.Rzjqfy/BUILD/rtl8812au_linux-master/core/rtw_br_ext.o CC [M] /tmp/B.Rzjqfy/BUILD/rtl8812au_linux-master/core/rtw_p2p.o CC [M] /tmp/B.Rzjqfy/BUILD/rtl8812au_linux-master/core/rtw_odm.o CC [M] /tmp/B.Rzjqfy/BUILD/rtl8812au_linux-master/core/rtw_sreset.o CC [M] /tmp/B.Rzjqfy/BUILD/rtl8812au_linux-master/core/rtw_beamforming.o CC [M] /tmp/B.Rzjqfy/BUILD/rtl8812au_linux-master/core/efuse/rtw_efuse.o CC [M] /tmp/B.Rzjqfy/BUILD/rtl8812au_linux-master/os_dep/osdep_service.o CC [M] /tmp/B.Rzjqfy/BUILD/rtl8812au_linux-master/os_dep/linux/os_intfs.o CC [M] /tmp/B.Rzjqfy/BUILD/rtl8812au_linux-master/os_dep/linux/usb_intf.o CC [M] /tmp/B.Rzjqfy/BUILD/rtl8812au_linux-master/os_dep/linux/usb_ops_linux.o CC [M] /tmp/B.Rzjqfy/BUILD/rtl8812au_linux-master/os_dep/linux/xmit_linux.o CC [M] /tmp/B.Rzjqfy/BUILD/rtl8812au_linux-master/os_dep/linux/mlme_linux.o CC [M] /tmp/B.Rzjqfy/BUILD/rtl8812au_linux-master/os_dep/linux/ioctl_cfg80211.o /tmp/B.Rzjqfy/BUILD/rtl8812au_linux-master/os_dep/linux/ioctl_cfg80211.c: In function 'rtw_cfg80211_indicate_connect': /tmp/B.Rzjqfy/BUILD/rtl8812au_linux-master/os_dep/linux/ioctl_cfg80211.c:809:6: error: passing argument 2 of 'cfg80211_roamed' from incompatible pointer type [-Werror=incompatible-pointer-types] , notify_channel ^~~~~~~~~~~~~~ In file included from /tmp/B.Rzjqfy/BUILD/rtl8812au_linux-master/include/osdep_service_linux.h:78:0, from /tmp/B.Rzjqfy/BUILD/rtl8812au_linux-master/include/osdep_service.h:41, from /tmp/B.Rzjqfy/BUILD/rtl8812au_linux-master/include/drv_types.h:32, from /tmp/B.Rzjqfy/BUILD/rtl8812au_linux-master/os_dep/linux/ioctl_cfg80211.c:22: ./include/net/cfg80211.h:5435:6: note: expected 'struct cfg80211_roam_info *' but argument is of type 'struct ieee80211_channel *' void cfg80211_roamed(struct net_device *dev, struct cfg80211_roam_info *info, ^~~~~~~~~~~~~~~ /tmp/B.Rzjqfy/BUILD/rtl8812au_linux-master/os_dep/linux/ioctl_cfg80211.c:811:6: warning: passing argument 3 of 'cfg80211_roamed' makes integer from pointer without a cast [-Wint-conversion] , cur_network->network.MacAddress ^~~~~~~~~~~ In file included from /tmp/B.Rzjqfy/BUILD/rtl8812au_linux-master/include/osdep_service_linux.h:78:0, from /tmp/B.Rzjqfy/BUILD/rtl8812au_linux-master/include/osdep_service.h:41, from /tmp/B.Rzjqfy/BUILD/rtl8812au_linux-master/include/drv_types.h:32, from /tmp/B.Rzjqfy/BUILD/rtl8812au_linux-master/os_dep/linux/ioctl_cfg80211.c:22: ./include/net/cfg80211.h:5435:6: note: expected 'gfp_t {aka unsigned int}' but argument is of type 'unsigned char *' void cfg80211_roamed(struct net_device *dev, struct cfg80211_roam_info *info, ^~~~~~~~~~~~~~~ /tmp/B.Rzjqfy/BUILD/rtl8812au_linux-master/os_dep/linux/ioctl_cfg80211.c:807:3: error: too many arguments to function 'cfg80211_roamed' cfg80211_roamed(padapter->pnetdev ^~~~~~~~~~~~~~~ In file included from /tmp/B.Rzjqfy/BUILD/rtl8812au_linux-master/include/osdep_service_linux.h:78:0, from /tmp/B.Rzjqfy/BUILD/rtl8812au_linux-master/include/osdep_service.h:41, from /tmp/B.Rzjqfy/BUILD/rtl8812au_linux-master/include/drv_types.h:32, from /tmp/B.Rzjqfy/BUILD/rtl8812au_linux-master/os_dep/linux/ioctl_cfg80211.c:22: ./include/net/cfg80211.h:5435:6: note: declared here void cfg80211_roamed(struct net_device *dev, struct cfg80211_roam_info *info, ^~~~~~~~~~~~~~~ /tmp/B.Rzjqfy/BUILD/rtl8812au_linux-master/os_dep/linux/ioctl_cfg80211.c: In function 'rtw_cfg80211_preinit_wiphy': /tmp/B.Rzjqfy/BUILD/rtl8812au_linux-master/os_dep/linux/ioctl_cfg80211.c:5994:18: error: 'WIPHY_FLAG_SUPPORTS_SCHED_SCAN' undeclared (first use in this function) wiphy->flags |= WIPHY_FLAG_SUPPORTS_SCHED_SCAN; ^~~~~~~~~~~~~~~~~~~~~~~~~~~~~~ /tmp/B.Rzjqfy/BUILD/rtl8812au_linux-master/os_dep/linux/ioctl_cfg80211.c:5994:18: note: each undeclared identifier is reported only once for each function it appears in /tmp/B.Rzjqfy/BUILD/rtl8812au_linux-master/os_dep/linux/ioctl_cfg80211.c: At top level: /tmp/B.Rzjqfy/BUILD/rtl8812au_linux-master/os_dep/linux/ioctl_cfg80211.c:6024:25: error: initialization from incompatible pointer type [-Werror=incompatible-pointer-types] .change_virtual_intf = cfg80211_rtw_change_iface, ^~~~~~~~~~~~~~~~~~~~~~~~~ /tmp/B.Rzjqfy/BUILD/rtl8812au_linux-master/os_dep/linux/ioctl_cfg80211.c:6024:25: note: (near initialization for 'rtw_cfg80211_ops.change_virtual_intf') /tmp/B.Rzjqfy/BUILD/rtl8812au_linux-master/os_dep/linux/ioctl_cfg80211.c:6044:22: error: initialization from incompatible pointer type [-Werror=incompatible-pointer-types] .add_virtual_intf = cfg80211_rtw_add_virtual_intf, ^~~~~~~~~~~~~~~~~~~~~~~~~~~~~ /tmp/B.Rzjqfy/BUILD/rtl8812au_linux-master/os_dep/linux/ioctl_cfg80211.c:6044:22: note: (near initialization for 'rtw_cfg80211_ops.add_virtual_intf') cc1: some warnings being treated as errors make[2]: *** [scripts/Makefile.build:302: /tmp/B.Rzjqfy/BUILD/rtl8812au_linux-master/os_dep/linux/ioctl_cfg80211.o] Error 1 make[2]: *** Waiting for unfinished jobs.... CC [M] /tmp/B.Rzjqfy/BUILD/rtl8812au_linux-master/os_dep/linux/recv_linux.o CC [M] /tmp/B.Rzjqfy/BUILD/rtl8812au_linux-master/os_dep/linux/wifi_regd.o CC [M] /tmp/B.Rzjqfy/BUILD/rtl8812au_linux-master/os_dep/linux/rtw_android.o CC [M] /tmp/B.Rzjqfy/BUILD/rtl8812au_linux-master/os_dep/linux/rtw_proc.o CC [M] /tmp/B.Rzjqfy/BUILD/rtl8812au_linux-master/hal/hal_intf.o CC [M] /tmp/B.Rzjqfy/BUILD/rtl8812au_linux-master/hal/hal_com.o CC [M] /tmp/B.Rzjqfy/BUILD/rtl8812au_linux-master/os_dep/linux/ioctl_linux.o /tmp/B.Rzjqfy/BUILD/rtl8812au_linux-master/os_dep/linux/ioctl_linux.c: In function 'rtw_mp_read_reg': /tmp/B.Rzjqfy/BUILD/rtl8812au_linux-master/os_dep/linux/ioctl_linux.c:10643:8: warning: this 'if' clause does not guard... [-Wmisleading-indentation] if ( data[i] != '\0' ) ^~ /tmp/B.Rzjqfy/BUILD/rtl8812au_linux-master/os_dep/linux/ioctl_linux.c:10646:10: note: ...this statement, but the latter is misleadingly indented as if it is guarded by the 'if' j++; ^ CC [M] /tmp/B.Rzjqfy/BUILD/rtl8812au_linux-master/hal/hal_com_phycfg.o make[1]: *** [Makefile:1515: _module_/tmp/B.Rzjqfy/BUILD/rtl8812au_linux-master] Error 2 make: *** [Makefile:1350: modules] Error 2 error: Bad exit status from /tmp/B.Rzjqfy/BUILD/tmp/rpm-tmp.28872 (%build) RPM build errors: Bad exit status from /tmp/B.Rzjqfy/BUILD/tmp/rpm-tmp.28872 (%build) ended at: Tue Aug 1 18:32:37 2017, done in 0:00:09.128193 error: No files produced. + chmod -R u+rwX /tmp/B.Rzjqfy/BUILD + rm -rf /tmp/B.Rzjqfy/tmp /tmp/B.Rzjqfy/BUILD + rm -rf /tmp/B.Rzjqfy Begin-PLD-Builder-Info Build-Time: user:36.98s sys:3.47s real:20.41s (faults io:0 non-io:954753) End-PLD-Builder-Info
[Back to list of logs] [View rpm -qa of builder]