FailedOk

th/SRPMS[OK]
th/x32[OK]
th/i686[OK]
th/x86_64[OK]

ac/SRPMS[OK]
ac/i386[OK]
ac/i586[OK]
ac/i686[OK]
ac/alpha[OK]
ac/amd64[OK]
ac/athlon[OK]
ac/ppc[OK]
ac/sparc[OK]
ac/sparc64[OK]

Advanced Search
main()
Powered by PLD Linux
(c) 2002-2018 PLD Team
$Revision: 1.37 $
Powered by PDP-7.
Your IP: 54.224.133.152

ruby ccb97596-fae7-42ba-8b53-0cf3fd75a953

Status:Failed
Source URL:ftp://buildlogs.pld-linux.org/th/i686/FAIL/ruby,ccb97596-fae7-42ba-8b53-0cf3fd75a953.bz2
text/plain URL:View!
rpm -qa of builder:View!
Date:2018/05/30 16:44:48
Runtime:0:00:39.789765

Toc:

  • prep
  • Executing(%prep): /bin/sh -e /tmp/B.EbfvlD/BUILD/tmp/rpm-tmp.91740
  • build
  • Executing(%build): /bin/sh -e /tmp/B.EbfvlD/BUILD/tmp/rpm-tmp.42478
  • error 1
  • make[1]: *** [uncommon.mk:1086: enc/unicode/data/9.0.0/UnicodeData.txt] Error 1
  • error 2
  • error: Bad exit status from /tmp/B.EbfvlD/BUILD/tmp/rpm-tmp.42478 (%build)
  • error 3
  • RPM build errors:
  • error 4
  • error: No files produced.

Content:

request from: baggins
checking if we should skip the build
started at: Wed May 30 16:43:56 2018
killing old processes on a builder
sending signal 9 to pid -1
Killed
fetching https://srcbuilder.pld-linux.org/th//srpms/ccb97596-fae7-42ba-8b53-0cf3fd75a953/ruby-2.4.4-1.src.rpm
fetched 55065653 bytes, 6791.8 K/s
installing srpm: ruby-2.4.4-1.src.rpm
+ install -d /tmp/B.EbfvlD/BUILD /tmp/B.EbfvlD/RPMS
+ LC_ALL=en_US.UTF-8
+ rpm -qp --changelog ruby-2.4.4-1.src.rpm
* Wed May 30 2018 PLD Linux Team <feedback@pld-linux.org>
- For complete changelog see: http://git.pld-linux.org/?p=packages/ruby.git;a=log;h=master
* Wed May 30 2018 Jan Rękorajski <baggins@pld-linux.org> 67f2673
- updated to 2.4.4 * Wed May 23 2018 Jakub Bogusz <qboosh@pld-linux.org> 245a0d1
- adjusted rubygems_ver * Fri Apr 27 2018 Elan Ruusamäe <glen@pld-linux.org> f9cc3f3
- up to 2.3.7 * Thu Oct 26 2017 Elan Ruusamäe <glen@pld-linux.org> 68055c6
- ruby-devel R: gmp-devel * Mon Oct 23 2017 Jan Rękorajski <baggins@pld-linux.org> c846f21
- don't add empty patchlevel to ruby_version - rel 3 * Sun Oct 22 2017 Jan Rękorajski <baggins@pld-linux.org> 1648a12
- bigdecimal and io-console are not noarch - rel 2 * Sun Sep 17 2017 mis <mistoo@gmail.com> 7742b54
- up to 2.3.5 * Sun Aug 13 2017 Elan Ruusamäe <glen@pld-linux.org> 505dcb9
- macros cleanup * Sun Aug 13 2017 Elan Ruusamäe <glen@pld-linux.org> e52e77e
- Merge branch 'dev-2.3' + rpm -Uhv --nodeps --define '_topdir /tmp/B.EbfvlD' --define '_specdir %{_topdir}' --define '_sourcedir %{_specdir}' --define '_rpmdir %{_topdir}/RPMS' --define '_builddir %{_topdir}/BUILD' ruby-2.4.4-1.src.rpm Preparing... ################################################## ruby ################################################## + rm -f ruby-2.4.4-1.src.rpm + install -m 700 -d /tmp/B.EbfvlD/BUILD/tmp + TMPDIR=/tmp/B.EbfvlD/BUILD/tmp + exec nice -n 0 rpmbuild -bp --short-circuit --nodeps --define '_topdir /tmp/B.EbfvlD' --define '_specdir %{_topdir}' --define '_sourcedir %{_specdir}' --define '_rpmdir %{_topdir}/RPMS' --define '_builddir %{_topdir}/BUILD' --target i686-pld-linux --define 'prep exit 0' /tmp/B.EbfvlD/ruby.spec Building target platforms: i686-pld-linux checking BuildConflict-ing packages no BuildConflicts found checking BR rpm: Building target platforms: i686-pld-linux no BR needed building RPM using: set -ex; : build-id: ccb97596-fae7-42ba-8b53-0cf3fd75a953; TMPDIR=/tmp/B.EbfvlD/BUILD/tmp exec nice -n 0 rpmbuild -bb --define '_smp_mflags -j9' --define '_make_opts -Otarget' --define '_pld_builder 1' --define '_topdir /tmp/B.EbfvlD' --define '_specdir %{_topdir}' --define '_sourcedir %{_specdir}' --define '_rpmdir %{_topdir}/RPMS' --define '_builddir %{_topdir}/BUILD' --target i686-pld-linux /tmp/B.EbfvlD/ruby.spec + : build-id: ccb97596-fae7-42ba-8b53-0cf3fd75a953 + TMPDIR=/tmp/B.EbfvlD/BUILD/tmp + exec nice -n 0 rpmbuild -bb --define '_smp_mflags -j9' --define '_make_opts -Otarget' --define '_pld_builder 1' --define '_topdir /tmp/B.EbfvlD' --define '_specdir %{_topdir}' --define '_sourcedir %{_specdir}' --define '_rpmdir %{_topdir}/RPMS' --define '_builddir %{_topdir}/BUILD' --target i686-pld-linux /tmp/B.EbfvlD/ruby.spec Building target platforms: i686-pld-linux Executing(%prep): /bin/sh -e /tmp/B.EbfvlD/BUILD/tmp/rpm-tmp.91740 + umask 022 + cd /tmp/B.EbfvlD/BUILD + cd /tmp/B.EbfvlD/BUILD + rm -rf ruby-2.4.4 + /usr/bin/xz -dc /tmp/B.EbfvlD/ruby-2.4.4.tar.xz + /bin/tar -xf - + STATUS=0 + '[' 0 -ne 0 ']' + cd ruby-2.4.4 + /usr/bin/gzip -dc /tmp/B.EbfvlD/ruby_2_4_3_stdlib_rdocs.tgz + /bin/tar -xf - + STATUS=0 + '[' 0 -ne 0 ']' + /usr/bin/gzip -dc /tmp/B.EbfvlD/ruby_2_4_3_core_rdocs.tgz + /bin/tar -xf - + STATUS=0 + '[' 0 -ne 0 ']' + /bin/id -u + '[' 1001 '=' 0 ']' + /bin/id -u + '[' 1001 '=' 0 ']' + /bin/chmod -Rf a+rX,u+w,g-w,o-w . + echo 'Patch #2 (fix-bison-invocation.patch):' Patch #2 (fix-bison-invocation.patch): + '[' -f /tmp/B.EbfvlD/fix-bison-invocation.patch ']' + /bin/cat /tmp/B.EbfvlD/fix-bison-invocation.patch + /usr/bin/patch -s -p1 + echo 'Patch #3 (mkmf-verbose.patch):' Patch #3 (mkmf-verbose.patch): + '[' -f /tmp/B.EbfvlD/mkmf-verbose.patch ']' + /bin/cat /tmp/B.EbfvlD/mkmf-verbose.patch + /usr/bin/patch -s -p1 + echo 'Patch #4 (strip-ccache.patch):' Patch #4 (strip-ccache.patch): + '[' -f /tmp/B.EbfvlD/strip-ccache.patch ']' + /bin/cat /tmp/B.EbfvlD/strip-ccache.patch + /usr/bin/patch -s -p1 + echo 'Patch #5 (ruby-version.patch):' Patch #5 (ruby-version.patch): + '[' -f /tmp/B.EbfvlD/ruby-version.patch ']' + /bin/cat /tmp/B.EbfvlD/ruby-version.patch + /usr/bin/patch -s -p1 + echo 'Patch #6 (duplicated-paths.patch):' Patch #6 (duplicated-paths.patch): + '[' -f /tmp/B.EbfvlD/duplicated-paths.patch ']' + /bin/cat /tmp/B.EbfvlD/duplicated-paths.patch + /usr/bin/patch -s -p1 + echo 'Patch #9 (custom-rubygems-location.patch):' Patch #9 (custom-rubygems-location.patch): + '[' -f /tmp/B.EbfvlD/custom-rubygems-location.patch ']' + /bin/cat /tmp/B.EbfvlD/custom-rubygems-location.patch + /usr/bin/patch -s -p1 + echo 'Patch #12 (archlibdir.patch):' Patch #12 (archlibdir.patch): + '[' -f /tmp/B.EbfvlD/archlibdir.patch ']' + /bin/cat /tmp/B.EbfvlD/archlibdir.patch + /usr/bin/patch -s -p1 + /bin/rm '--interactive=never' parse.c parse.h + /bin/rm '--interactive=never' -r ext/psych/yaml + /bin/rm '--interactive=never' -r ext/fiddle/libffi-3.2.1 + install -d lib/rubygems/defaults + cp -p /tmp/B.EbfvlD/operating_system.rb lib/rubygems/defaults + xargs -0 -r -l512 rm -f + find '(' -name '*~' -o -name '*.orig' ')' -print0 + find -type f '(' -name '*.rb' -o -name '*.cgi' -o -name '*.test' -o -name ruby.1 -o -name '*.html' -o -name '*.tcl' ')' + xargs /bin/sed -i s,/usr/local/bin/,/usr/bin/, + exit 0 Executing(%build): /bin/sh -e /tmp/B.EbfvlD/BUILD/tmp/rpm-tmp.42478 TMP=/home/users/builder/tmp HOME=/home/users/builder PATH=/home/users/builder/GNUstep/Tools:/usr/local/bin:/usr/bin:/bin:/home/users/builder/bin TMPDIR=/tmp/B.EbfvlD/BUILD/tmp + umask 022 + cd /tmp/B.EbfvlD/BUILD + cd ruby-2.4.4 + awk '/VERSION =/ && $1 == "VERSION" {print $3}' lib/rubygems.rb + xargs + rubygems_ver=2.6.14.1 + '[' 2.6.14.1 '!=' 2.6.14.1 ']' + xargs + awk '/VERSION =/ && $1 == "VERSION" {print $3}' lib/rdoc.rb + rdoc_ver=5.0.0 + '[' 5.0.0 '!=' 5.0.0 ']' + cp -f /usr/share/automake/config.sub . + autoconf + ./configure 'LDFLAGS=-Wl,--as-needed -Wl,--no-copy-dt-needed-entries -Wl,-z,relro -Wl,-z,combreloc ' 'CFLAGS=-O2 -fwrapv -pipe -Wformat -Werror=format-security -gdwarf-4 -fno-debug-types-section -fvar-tracking-assignments -g2 -Wp,-D_FORTIFY_SOURCE=2 -fstack-protector-strong --param=ssp-buffer-size=4 -fomit-frame-pointer -march=i686 -fasynchronous-unwind-tables -mtune=pentium4 -fno-omit-frame-pointer -gdwarf-4 -fno-debug-types-section -fvar-tracking-assignments -g2 ' 'CXXFLAGS=-O2 -fwrapv -pipe -Wformat -Werror=format-security -gdwarf-4 -fno-debug-types-section -fvar-tracking-assignments -g2 -Wp,-D_FORTIFY_SOURCE=2 -fstack-protector-strong --param=ssp-buffer-size=4 -fomit-frame-pointer -march=i686 -fasynchronous-unwind-tables -mtune=pentium4 -fno-omit-frame-pointer -gdwarf-4 -fno-debug-types-section -fvar-tracking-assignments -g2 ' 'FFLAGS=-O2 -fwrapv -pipe -Wformat -Werror=format-security -gdwarf-4 -fno-debug-types-section -fvar-tracking-assignments -g2 -Wp,-D_FORTIFY_SOURCE=2 -fstack-protector-strong --param=ssp-buffer-size=4 -fomit-frame-pointer -march=i686 -fasynchronous-unwind-tables -mtune=pentium4 -fno-omit-frame-pointer -gdwarf-4 -fno-debug-types-section -fvar-tracking-assignments -g2 ' 'FCFLAGS=-O2 -fwrapv -pipe -Wformat -Werror=format-security -gdwarf-4 -fno-debug-types-section -fvar-tracking-assignments -g2 -Wp,-D_FORTIFY_SOURCE=2 -fstack-protector-strong --param=ssp-buffer-size=4 -fomit-frame-pointer -march=i686 -fasynchronous-unwind-tables -mtune=pentium4 -fno-omit-frame-pointer -gdwarf-4 -fno-debug-types-section -fvar-tracking-assignments -g2 ' 'CPPFLAGS=' 'CC=i686-pld-linux-gcc' 'CXX=i686-pld-linux-g++' '--host=i686-pld-linux' '--build=i686-pld-linux' '--prefix=/usr' '--exec-prefix=/usr' '--bindir=/usr/bin' '--sbindir=/usr/sbin' '--sysconfdir=/etc' '--datadir=/usr/share' '--includedir=/usr/include' '--libdir=/usr/lib' '--libexecdir=/usr/libexec' '--localstatedir=/var' '--sharedstatedir=/var/lib' '--mandir=/usr/share/man' '--infodir=/usr/share/info' '--x-libraries=/usr/lib' '--program-suffix=' '--with-archlibdir=/usr/lib' '--with-rubygemsdir=/usr/share/ruby/2.4' '--with-rubylibprefix=/usr/share/ruby/2.4' '--with-rubyarchprefix=/usr/lib/ruby/2.4' '--with-sitedir=/usr/local/share/ruby/site_ruby' '--with-sitearchdir=/usr/local/lib/ruby/site_ruby/2.4' '--with-vendordir=/usr/share/ruby/vendor_ruby' '--with-vendorarchdir=/usr/lib/ruby/vendor_ruby/2.4' '--with-rubyhdrdir=/usr/include/ruby-2.4' '--with-rubyarchhdrdir=/usr/include/ruby-2.4' '--with-sitearchhdrdir=$(sitehdrdir)/$(arch)' '--with-vendorarchhdrdir=$(vendorhdrdir)/$(arch)' --enable-multiarch --enable-shared --disable-install-doc --disable-rpath --disable-rubygems '--with-ruby-version=' checking for ruby... /usr/bin/ruby config.guess already exists config.sub already exists checking build system type... i686-pld-linux-gnu checking host system type... i686-pld-linux-gnu checking target system type... i686-pld-linux-gnu checking for i686-pld-linux-gcc... (cached) i686-pld-linux-gcc checking whether the C compiler works... yes checking for C compiler default output file name... a.out checking for suffix of executables... checking whether we are cross compiling... no checking for suffix of object files... o checking whether we are using the GNU C compiler... yes checking whether i686-pld-linux-gcc accepts -g... yes checking for i686-pld-linux-gcc option to accept ISO C89... none needed checking whether we are using the GNU C++ compiler... yes checking whether i686-pld-linux-g++ accepts -g... yes checking how to run the C preprocessor... i686-pld-linux-gcc -E checking for grep that handles long lines and -e... /bin/grep checking for egrep... /bin/grep -E checking whether i686-pld-linux-gcc needs -traditional... no checking for i686-pld-linux-ld... no checking for ld... ld checking whether the linker is GNU ld... yes checking whether i686-pld-linux-gcc -E accepts -o... yes checking for __sync_val_compare_and_swap... yes checking for i686-pld-linux-ranlib... no checking for ranlib... ranlib checking for i686-pld-linux-ar... no checking for ar... ar checking for ar flags... rcD checking for i686-pld-linux-as... no checking for as... as checking for i686-pld-linux-objdump... no checking for i686-pld-linux-gobjdump... no checking for objdump... objdump checking for i686-pld-linux-objcopy... no checking for i686-pld-linux-gobjcopy... no checking for objcopy... objcopy checking for i686-pld-linux-nm... no checking for nm... nm checking whether ln -s works... yes checking whether make sets $(MAKE)... yes checking for a BSD-compatible install... /usr/bin/install -c checking for a thread-safe mkdir -p... /bin/mkdir -p checking for i686-pld-linux-dtrace... no checking for dtrace... dtrace checking for dot... no checking for doxygen... doxygen checking for pkg-config... pkg-config checking for ANSI C header files... yes checking for sys/types.h... yes checking for sys/stat.h... yes checking for stdlib.h... yes checking for string.h... yes checking for memory.h... yes checking for strings.h... yes checking for inttypes.h... yes checking for stdint.h... yes checking for unistd.h... yes checking minix/config.h usability... no checking minix/config.h presence... no checking for minix/config.h... no checking whether it is safe to define __EXTENSIONS__... yes checking for cd using physical directory... cd -P checking whether CFLAGS is valid... yes checking whether LDFLAGS is valid... yes checking whether -Wl,-R. is accepted as LDFLAGS... yes checking whether -Wl,-rpath,. is accepted as LDFLAGS... yes checking whether -Wno-unused-parameter is accepted as CFLAGS... yes checking whether -Wno-parentheses is accepted as CFLAGS... yes checking whether -Wno-long-long is accepted as CFLAGS... yes checking whether -diag-disable=2259 is accepted as CFLAGS... no checking whether -Wno-missing-field-initializers is accepted as CFLAGS... yes checking whether -Wno-tautological-compare is accepted as CFLAGS... yes checking whether -Wno-parentheses-equality is accepted as CFLAGS... yes checking whether -Wno-constant-logical-operand is accepted as CFLAGS... yes checking whether -Wno-self-assign is accepted as CFLAGS... yes checking whether -Wunused-variable is accepted as CFLAGS... yes checking whether -Wimplicit-int is accepted as CFLAGS... yes checking whether -Wpointer-arith is accepted as CFLAGS... yes checking whether -Wwrite-strings is accepted as CFLAGS... yes checking whether -Wdeclaration-after-statement is accepted as CFLAGS... yes checking whether -Wshorten-64-to-32 is accepted as CFLAGS... no checking whether -Wimplicit-function-declaration is accepted as CFLAGS... yes checking whether -Wdivision-by-zero is accepted as CFLAGS... no checking whether -Wdeprecated-declarations is accepted as CFLAGS... yes checking whether -Wno-packed-bitfield-compat is accepted as CFLAGS... yes checking whether -Wsuggest-attribute=noreturn is accepted as CFLAGS... yes checking whether -Wsuggest-attribute=format is accepted as CFLAGS... yes checking whether -Wimplicit-fallthrough=0 is accepted as CFLAGS... yes checking whether -Wextra-tokens is accepted as CFLAGS... no checking whether -Wall -Wextra is accepted as CFLAGS... yes checking whether -Qunused-arguments is accepted as CFLAGS... no checking whether INFINITY is available without C99 option... yes checking whether NAN is available without C99 option... yes checking whether -D_FORTIFY_SOURCE=2 is accepted as CFLAGS... yes checking whether -fstack-protector is accepted as CFLAGS... yes checking whether -fstack-protector is accepted as LDFLAGS... yes checking whether -Wl,--compress-debug-sections=zlib is accepted as LDFLAGS... yes checking whether -std=gnu99 is accepted as CFLAGS... yes checking whether -fno-strict-overflow is accepted as CFLAGS... yes checking whether -ggdb3 is accepted as CFLAGS... yes checking whether -fvisibility=hidden is accepted as CFLAGS... yes checking whether -fno-fast-math is accepted as CFLAGS... yes checking whether -fexcess-precision=standard is accepted as CFLAGS... yes checking whether -fp-model precise is accepted as CFLAGS... no checking for crypt in -lcrypt... yes checking for dlopen in -ldl... yes checking for shl_load in -ldld... no checking for shutdown in -lsocket... no checking for dirent.h that defines DIR... yes checking for library containing opendir... none required checking for stdbool.h that conforms to C99... yes checking for _Bool... yes checking for sys/wait.h that is POSIX.1 compatible... yes checking a.out.h usability... yes checking a.out.h presence... yes checking for a.out.h... yes checking atomic.h usability... no checking atomic.h presence... no checking for atomic.h... no checking direct.h usability... no checking direct.h presence... no checking for direct.h... no checking grp.h usability... yes checking grp.h presence... yes checking for grp.h... yes checking fcntl.h usability... yes checking fcntl.h presence... yes checking for fcntl.h... yes checking float.h usability... yes checking float.h presence... yes checking for float.h... yes checking ieeefp.h usability... no checking ieeefp.h presence... no checking for ieeefp.h... no checking intrinsics.h usability... no checking intrinsics.h presence... no checking for intrinsics.h... no checking langinfo.h usability... yes checking langinfo.h presence... yes checking for langinfo.h... yes checking limits.h usability... yes checking limits.h presence... yes checking for limits.h... yes checking locale.h usability... yes checking locale.h presence... yes checking for locale.h... yes checking malloc.h usability... yes checking malloc.h presence... yes checking for malloc.h... yes checking malloc/malloc.h usability... no checking malloc/malloc.h presence... no checking for malloc/malloc.h... no checking malloc_np.h usability... no checking malloc_np.h presence... no checking for malloc_np.h... no checking net/socket.h usability... no checking net/socket.h presence... no checking for net/socket.h... no checking process.h usability... no checking process.h presence... no checking for process.h... no checking pwd.h usability... yes checking pwd.h presence... yes checking for pwd.h... yes checking setjmpex.h usability... no checking setjmpex.h presence... no checking for setjmpex.h... no checking sys/attr.h usability... no checking sys/attr.h presence... no checking for sys/attr.h... no checking sys/fcntl.h usability... yes checking sys/fcntl.h presence... yes checking for sys/fcntl.h... yes checking sys/file.h usability... yes checking sys/file.h presence... yes checking for sys/file.h... yes checking sys/id.h usability... no checking sys/id.h presence... no checking for sys/id.h... no checking sys/ioctl.h usability... yes checking sys/ioctl.h presence... yes checking for sys/ioctl.h... yes checking sys/mkdev.h usability... no checking sys/mkdev.h presence... no checking for sys/mkdev.h... no checking sys/param.h usability... yes checking sys/param.h presence... yes checking for sys/param.h... yes checking sys/prctl.h usability... yes checking sys/prctl.h presence... yes checking for sys/prctl.h... yes checking sys/resource.h usability... yes checking sys/resource.h presence... yes checking for sys/resource.h... yes checking sys/select.h usability... yes checking sys/select.h presence... yes checking for sys/select.h... yes checking sys/sendfile.h usability... yes checking sys/sendfile.h presence... yes checking for sys/sendfile.h... yes checking sys/socket.h usability... yes checking sys/socket.h presence... yes checking for sys/socket.h... yes checking sys/syscall.h usability... yes checking sys/syscall.h presence... yes checking for sys/syscall.h... yes checking sys/sysmacros.h usability... yes checking sys/sysmacros.h presence... yes checking for sys/sysmacros.h... yes checking sys/time.h usability... yes checking sys/time.h presence... yes checking for sys/time.h... yes checking sys/times.h usability... yes checking sys/times.h presence... yes checking for sys/times.h... yes checking sys/uio.h usability... yes checking sys/uio.h presence... yes checking for sys/uio.h... yes checking sys/utime.h usability... no checking sys/utime.h presence... no checking for sys/utime.h... no checking syscall.h usability... yes checking syscall.h presence... yes checking for syscall.h... yes checking time.h usability... yes checking time.h presence... yes checking for time.h... yes checking ucontext.h usability... yes checking ucontext.h presence... yes checking for ucontext.h... yes checking utime.h usability... yes checking utime.h presence... yes checking for utime.h... yes checking gmp.h usability... yes checking gmp.h presence... yes checking for gmp.h... yes checking for library containing __gmpz_init... -lgmp checking for special C compiler options needed for large files... no checking for _FILE_OFFSET_BITS value needed for large files... 64 checking whether byte ordering is bigendian... no checking for an ANSI C-conforming const... yes checking whether char is unsigned... no checking for inline... inline checking for working volatile... yes checking for typeof syntax and keyword spelling... typeof checking for long long... yes checking for off_t... yes checking char bit... 8 checking size of int... 4 checking size of short... 2 checking size of long... 4 checking size of long long... 8 checking size of __int64... 0 checking size of __int128... 0 checking size of off_t... 8 checking size of void*... 4 checking size of float... 4 checking size of double... 8 checking size of time_t... 4 checking size of clock_t... 4 checking packed struct attribute... x __attribute__((packed)) checking for printf prefix for long long... ll checking for pid_t... yes checking for convertible type of pid_t... INT checking for uid_t... yes checking for convertible type of uid_t... UINT checking for gid_t... yes checking for convertible type of gid_t... UINT checking for time_t... yes checking for convertible type of time_t... LONG checking for dev_t... yes checking for convertible type of dev_t... ULL checking for mode_t... yes checking for convertible type of mode_t... UINT checking for rlim_t... yes checking for convertible type of rlim_t... ULL checking for off_t... (cached) yes checking for convertible type of off_t... LL checking for clockid_t... yes checking for convertible type of clockid_t... INT checking for prototypes... yes checking token paste string... ansi checking stringization... #expr checking string literal concatenation... yes checking for variable length prototypes and stdarg.h... yes checking for variable length macro... yes checking for CONSTFUNC function attribute... __attribute__ ((__const__)) x checking for PUREFUNC function attribute... __attribute__ ((__pure__)) x checking for NORETURN function attribute... __attribute__ ((__noreturn__)) x checking for DEPRECATED function attribute... __attribute__ ((__deprecated__)) x checking for DEPRECATED_BY function attribute... __attribute__ ((__deprecated__("by "#n))) x checking for DEPRECATED_TYPE type attribute... __attribute__ ((__deprecated__ mesg)) x checking for NOINLINE function attribute... __attribute__ ((__noinline__)) x checking for ALWAYS_INLINE function attribute... __attribute__ ((__always_inline__)) x checking for WARN_UNUSED_RESULT function attribute... __attribute__ ((__warn_unused_result__)) x checking for MAYBE_UNUSED function attribute... __attribute__ ((__unused__)) x checking for ERRORFUNC function attribute... __attribute__ ((__error__ mesg)) x checking for WARNINGFUNC function attribute... __attribute__ ((__warning__ mesg)) x checking for WEAK function attribute... __attribute__ ((__weak__)) x checking for FUNC_STDCALL function attribute... __attribute__ ((__stdcall__)) x checking for FUNC_CDECL function attribute... __attribute__ ((__cdecl__)) x checking for FUNC_FASTCALL function attribute... __attribute__ ((__fastcall__)) x checking for FUNC_UNOPTIMIZED function attribute... __attribute__ ((__optimize__("O0"))) x checking for FUNC_MINIMIZED function attribute... __attribute__ ((__optimize__("-Os","-fomit-frame-pointer"))) x checking for function alias... alias checking for __atomic builtins... yes checking for __sync builtins... yes checking for __builtin_unreachable... yes checking for exported function attribute... __attribute__ ((__visibility__("default"))) checking for function name string predefined identifier... __func__ checking if enum over int is allowed... yes checking whether sys_nerr is declared... yes checking whether getenv is declared... yes checking for size_t... yes checking size of size_t... 4 checking size of ptrdiff_t... 4 checking for printf prefix for size_t... z checking for printf prefix for ptrdiff_t... t checking for struct stat.st_blksize... yes checking for struct stat.st_blocks... yes checking for struct stat.st_rdev... yes checking size of struct stat.st_size... SIZEOF_OFF_T checking size of struct stat.st_blocks... SIZEOF_OFF_T checking size of struct stat.st_ino... SIZEOF_LONG_LONG checking for struct stat.st_atim... yes checking for struct stat.st_atimespec... no checking for struct stat.st_atimensec... no checking for struct stat.st_mtim... yes checking for struct stat.st_mtimespec... no checking for struct stat.st_mtimensec... no checking for struct stat.st_ctim... yes checking for struct stat.st_ctimespec... no checking for struct stat.st_ctimensec... no checking for struct stat.st_birthtimespec... no checking for struct timeval... yes checking size of struct timeval.tv_sec... SIZEOF_TIME_T checking for struct timespec... yes checking for struct timezone... yes checking for clockid_t... (cached) yes checking for fd_mask... yes checking for int8_t... yes checking size of int8_t... 1 checking for uint8_t... yes checking size of uint8_t... 1 checking for int16_t... yes checking size of int16_t... 2 checking for uint16_t... yes checking size of uint16_t... 2 checking for int32_t... yes checking size of int32_t... 4 checking for uint32_t... yes checking size of uint32_t... 4 checking for int64_t... yes checking size of int64_t... 8 checking for uint64_t... yes checking size of uint64_t... 8 checking for int128_t... no checking for uint128_t... no checking for intptr_t... yes checking size of intptr_t... 4 checking for uintptr_t... yes checking size of uintptr_t... 4 checking for ssize_t... yes checking size of ssize_t... 4 checking for stack end address... __libc_stack_end checking for uid_t in sys/types.h... (cached) yes checking type of array argument to getgroups... gid_t checking return type of signal handlers... void checking for working alloca.h... yes checking for alloca... yes checking for dynamic size alloca... ok checking for working memcmp... yes checking for broken erfc of glibc-2.3.6 on IA64... no checking for acosh... yes checking for cbrt... yes checking for crypt... yes checking for dup2... yes checking for erf... yes checking for explicit_bzero... yes checking for ffs... yes checking for finite... yes checking for flock... yes checking for hypot... yes checking for isinf... yes checking for isnan... yes checking for lgamma_r... yes checking for memmove... yes checking for nextafter... yes checking for setproctitle... no checking for strchr... yes checking for strerror... yes checking for strlcat... no checking for strlcpy... no checking for strstr... yes checking for tgamma... yes checking sys/pstat.h usability... no checking sys/pstat.h presence... no checking for sys/pstat.h... no checking for signbit... yes checking for broken memmem... no checking for pid_t... (cached) yes checking vfork.h usability... no checking vfork.h presence... no checking for vfork.h... no checking for fork... yes checking for vfork... yes checking for working fork... yes checking for working vfork... (cached) yes checking for __syscall... no checking for _longjmp... yes checking for arc4random_buf... no checking for atan2l... yes checking for atan2f... yes checking for chroot... yes checking for chsize... no checking for clock_gettime... yes checking for cosh... yes checking for crypt_r... yes checking for daemon... (cached) no checking for dirfd... yes checking for dl_iterate_phdr... yes checking for dlopen... yes checking for dladdr... yes checking for dup... yes checking for dup3... yes checking for eaccess... yes checking for endgrent... yes checking for fchmod... yes checking for fchown... yes checking for fcntl... yes checking for fdatasync... yes checking for fgetattrlist... no checking for fmod... yes checking for fsync... yes checking for ftruncate... yes checking for ftruncate64... yes checking for getattrlist... no checking for getcwd... yes checking for getgidx... no checking for getgrnam... yes checking for getgrnam_r... yes checking for getgroups... yes checking for getpgid... yes checking for getpgrp... yes checking for getpriority... yes checking for getpwnam_r... yes checking for getresgid... yes checking for getresuid... yes checking for getrlimit... yes checking for getsid... yes checking for gettimeofday... yes checking for getuidx... no checking for gmtime_r... yes checking for initgroups... yes checking for ioctl... yes checking for isfinite... no checking for issetugid... no checking for killpg... yes checking for lchmod... no checking for lchown... yes checking for link... yes checking for llabs... yes checking for lockf... yes checking for log2... yes checking for lstat... yes checking for malloc_usable_size... yes checking for malloc_size... no checking for mblen... yes checking for memalign... yes checking for memset_s... no checking for writev... yes checking for memrchr... yes checking for memmem... yes checking for mkfifo... yes checking for mknod... yes checking for mktime... yes checking for pipe2... yes checking for poll... yes checking for posix_fadvise... yes checking for posix_memalign... yes checking for ppoll... yes checking for pread... yes checking for qsort_r... yes checking for qsort_s... no checking for readlink... yes checking for round... yes checking for sched_getaffinity... yes checking for seekdir... yes checking for select_large_fdset... no checking for sendfile... yes checking for setegid... yes checking for setenv... yes checking for seteuid... yes checking for setgid... yes checking for setgroups... yes checking for setpgid... yes checking for setpgrp... yes checking for setregid... yes checking for setresgid... yes checking for setresuid... yes checking for setreuid... yes checking for setrgid... no checking for setrlimit... yes checking for setruid... no checking for setsid... yes checking for setuid... yes checking for shutdown... yes checking for sigaction... yes checking for sigaltstack... yes checking for sigprocmask... yes checking for sinh... yes checking for spawnv... no checking for symlink... yes checking for syscall... yes checking for sysconf... yes checking for tanh... yes checking for telldir... yes checking for timegm... yes checking for times... yes checking for truncate... yes checking for truncate64... yes checking for unsetenv... yes checking for utimensat... yes checking for utimes... yes checking for wait4... yes checking for waitpid... yes checking if getcwd allocates buffer if NULL is given... yes checking crypt.h usability... yes checking crypt.h presence... yes checking for crypt.h... yes checking for struct crypt_data.initialized... yes checking for __builtin_bswap16... yes checking for __builtin_bswap32... yes checking for __builtin_bswap64... yes checking for __builtin_popcount... yes checking for __builtin_popcountll... yes checking for __builtin_clz... yes checking for __builtin_clzl... yes checking for __builtin_clzll... yes checking for __builtin_ctz... yes checking for __builtin_ctzll... yes checking for __builtin_constant_p... yes checking for __builtin_choose_expr... yes checking for __builtin_choose_expr_constant_p... yes checking for __builtin_types_compatible_p... yes checking whether qsort_r is GNU version... yes checking whether qsort_r is BSD version... no checking whether atan2 handles Inf as C99... yes checking whether lgamma_r handles +0.0 and -0.0... yes checking for clock_getres... yes checking for unsetenv returns a value... yes checking whether struct tm is in sys/time.h or time.h... time.h checking for struct tm.tm_zone... yes checking for struct tm.tm_gmtoff... yes checking for external int daylight... yes checking for external timezone... long checking for external altzone... no checking for timezone... yes checking whether timezone requires zero arguments... yes checking for negative time_t for gmtime(3)... yes checking for localtime(3) overflow correctly... yes checking for sig_t... yes checking whether right shift preserve sign bit... yes checking whether _SC_CLK_TCK is supported... yes checking stack growing direction on i686... -1 checking for pthread_kill in -lthr... no checking for pthread_kill in -lpthread... yes checking for pthread_np.h... no checking whether pthread_t is scalar type... yes checking for sched_yield... yes checking for pthread_attr_setinheritsched... yes checking for pthread_attr_get_np... no checking for pthread_attr_getstack... yes checking for pthread_get_stackaddr_np... no checking for pthread_get_stacksize_np... no checking for thr_stksegment... no checking for pthread_stackseg_np... no checking for pthread_getthrds_np... no checking for pthread_cond_init... yes checking for pthread_condattr_setclock... yes checking for pthread_condattr_init... yes checking for pthread_sigmask... yes checking for pthread_setname_np... yes checking for pthread_set_name_np... no checking for pthread_getattr_np... yes checking for pthread_attr_init... yes checking arguments of pthread_setname_np... (pthread_self(), name) checking if mcontext_t is a pointer... no checking for getcontext... yes checking for setcontext... yes checking if fork works with pthread... yes checking whether ELF binaries are produced... yes checking elf.h usability... yes checking elf.h presence... yes checking for elf.h... yes checking elf_abi.h usability... no checking elf_abi.h presence... no checking for elf_abi.h... no checking whether OS depend dynamic link works... yes checking for backtrace... yes checking for broken backtrace... no checking valgrind/memcheck.h usability... yes checking valgrind/memcheck.h presence... yes checking for valgrind/memcheck.h... yes checking for i686-pld-linux-strip... no checking for strip... strip checking whether -Wl,--no-undefined is accepted as LDFLAGS... yes checking whether wrapper for LD_LIBRARY_PATH is needed... no checking whether dtrace USDT is available... yes checking whether dtrace needs post processing... yes checking for __builtin_setjmp... yes with cast () checking for _setjmpex as a macro or function... no checking for _setjmp as a macro or function... yes checking for sigsetjmp as a macro or function... no checking for setjmp type... __builtin_setjmp checking for prefix of external symbols... NONE checking pthread.h usability... yes checking pthread.h presence... yes checking for pthread.h... yes checking if make is GNU make... yes checking for nroff... /usr/bin/nroff .ext/include/i686-linux/ruby/config.h updated configure: ruby library version = 2.4 configure: creating ./config.status config.status: creating GNUmakefile config.status: creating Makefile config.status: creating ruby-2.4.pc --- Configuration summary for ruby version 2.4.4 * Installation prefix: /usr * exec prefix: /usr * arch: i686-linux * site arch: ${arch} * RUBY_BASE_NAME: ruby * enable shared: yes * ruby lib prefix: ${exec_prefix}/share/ruby/2.4 * site libraries path: ${sitearchlibdir}/${RUBY_BASE_NAME} * vendor path: /usr/share/ruby/vendor_ruby * target OS: linux * compiler: i686-pld-linux-gcc * with pthread: yes * enable shared libs: yes * dynamic library ext: so * CFLAGS: ${optflags} ${debugflags} ${warnflags} * LDFLAGS: -L. -Wl,--as-needed \ -Wl,--no-copy-dt-needed-entries -Wl,-z,relro \ -Wl,-z,combreloc -fstack-protector -rdynamic \ -Wl,-export-dynamic * optflags: -O3 -fno-fast-math * debugflags: -ggdb3 * warnflags: -Wall -Wextra -Wno-unused-parameter \ -Wno-parentheses -Wno-long-long \ -Wno-missing-field-initializers \ -Wno-tautological-compare \ -Wno-parentheses-equality \ -Wno-constant-logical-operand -Wno-self-assign \ -Wunused-variable -Wimplicit-int -Wpointer-arith \ -Wwrite-strings -Wdeclaration-after-statement \ -Wimplicit-function-declaration \ -Wdeprecated-declarations \ -Wno-packed-bitfield-compat \ -Wsuggest-attribute=noreturn \ -Wsuggest-attribute=format \ -Wimplicit-fallthrough=0 * strip command: strip -S -x * install doc: no * man page type: doc --- + /usr/bin/make -Otarget -j9 -j1 main 'COPY=cp -p' 'Q=' CC = i686-pld-linux-gcc LD = ld LDSHARED = i686-pld-linux-gcc -shared CFLAGS = -O2 -fwrapv -pipe -Wformat -Werror=format-security -gdwarf-4 -fno-debug-types-section -fvar-tracking-assignments -g2 -Wp,-D_FORTIFY_SOURCE=2 -fstack-protector-strong --param=ssp-buffer-size=4 -fomit-frame-pointer -march=i686 -fasynchronous-unwind-tables -mtune=pentium4 -fno-omit-frame-pointer -gdwarf-4 -fno-debug-types-section -fvar-tracking-assignments -g2 -fPIC XCFLAGS = -D_FORTIFY_SOURCE=2 -fstack-protector -fno-strict-overflow -fvisibility=hidden -fexcess-precision=standard -DRUBY_EXPORT CPPFLAGS = -I. -I.ext/include/i686-linux -I./include -I. -I./enc/unicode/9.0.0 DLDFLAGS = -Wl,--as-needed -Wl,--no-copy-dt-needed-entries -Wl,-z,relro -Wl,-z,combreloc -Wl,--compress-debug-sections=zlib -Wl,-soname,libruby.so.2.4 -fstack-protector SOLIBS = -lpthread -lgmp -ldl -lcrypt -lm i686-pld-linux-gcc (PLD-Linux) 7.3.0 20180125 (release) Copyright (C) 2017 Free Software Foundation, Inc. This is free software; see the source for copying conditions. There is NO warranty; not even for MERCHANTABILITY or FITNESS FOR A PARTICULAR PURPOSE. translating probes probes.d dtrace -o probes.h.tmp -h -C -I. -I.ext/include/i686-linux -I./include -I. -I./enc/unicode/9.0.0 -s probes.d sed -e 's/RUBY_/RUBY_DTRACE_/g' -e 's/PROBES_H_TMP/RUBY_PROBES_H/' -e 's/(char \*/(const char */g' -e 's/, char \*/, const char */g' probes.h.tmp > probes.h rm -f probes.h.tmp generating id.h /usr/bin/ruby --disable=gems ./tool/generic_erb.rb --output=id.h \ ./template/id.h.tmpl id.h updated generating opt_sc.inc /usr/bin/ruby --disable=gems -Ku ./tool/insns2vm.rb --srcdir="." opt_sc.inc generating optinsn.inc /usr/bin/ruby --disable=gems -Ku ./tool/insns2vm.rb --srcdir="." optinsn.inc generating optunifs.inc /usr/bin/ruby --disable=gems -Ku ./tool/insns2vm.rb --srcdir="." optunifs.inc generating insns.inc /usr/bin/ruby --disable=gems -Ku ./tool/insns2vm.rb --srcdir="." insns.inc generating insns_info.inc /usr/bin/ruby --disable=gems -Ku ./tool/insns2vm.rb --srcdir="." insns_info.inc generating vmtc.inc /usr/bin/ruby --disable=gems -Ku ./tool/insns2vm.rb --srcdir="." vmtc.inc generating vm.inc /usr/bin/ruby --disable=gems -Ku ./tool/insns2vm.rb --srcdir="." vm.inc generating vm_call_iseq_optimized.inc /usr/bin/ruby --disable=gems ./tool/mk_call_iseq_optimized.rb > vm_call_iseq_optimized.inc /usr/bin/ruby --disable=gems ./tool/file2lastrev.rb --revision.h "." > revision.tmp file2lastrev.rb: does not seem to be under a vcs: . make: [uncommon.mk:903: .revision.time] Error 1 (ignored) ./tool/ifchange "--timestamp=.revision.time" "./revision.h" revision.tmp ./revision.h unchanged /usr/bin/make Q= UNICODE_VERSION=9.0.0 update-unicode make[1]: Entering directory '/tmp/B.EbfvlD/BUILD/ruby-2.4.4' Downloading Unicode 9.0.0 data files... /bin/mkdir -p "./enc/unicode/data/9.0.0" /usr/bin/ruby --disable=gems -C "." tool/downloader.rb -d enc/unicode/data/9.0.0 -p 9.0.0/ucd -e unicode ./enc/unicode/data/9.0.0/UnicodeData.txt ./enc/unicode/data/9.0.0/CompositionExclusions.txt ./enc/unicode/data/9.0.0/NormalizationTest.txt ./enc/unicode/data/9.0.0/CaseFolding.txt ./enc/unicode/data/9.0.0/SpecialCasing.txt downloading 9.0.0/ucd/UnicodeData.txt ... tool/downloader.rb:183:in `rescue in download': failed to download 9.0.0/ucd/UnicodeData.txt (RuntimeError) Failed to open TCP connection to www.unicode.org:80 (getaddrinfo: Temporary failure in name resolution): http://www.unicode.org/Public/9.0.0/ucd/UnicodeData.txt from tool/downloader.rb:125:in `download' from tool/downloader.rb:75:in `download' from tool/downloader.rb:238:in `block in <main>' from tool/downloader.rb:230:in `each' from tool/downloader.rb:230:in `<main>' make[1]: *** [uncommon.mk:1086: enc/unicode/data/9.0.0/UnicodeData.txt] Error 1 make[1]: Leaving directory '/tmp/B.EbfvlD/BUILD/ruby-2.4.4' make: *** [uncommon.mk:1124: enc/unicode/9.0.0/casefold.h] Error 2 error: Bad exit status from /tmp/B.EbfvlD/BUILD/tmp/rpm-tmp.42478 (%build) RPM build errors: Bad exit status from /tmp/B.EbfvlD/BUILD/tmp/rpm-tmp.42478 (%build) ended at: Wed May 30 16:44:47 2018, done in 0:00:39.789765 error: No files produced. + chmod -R u+rwX /tmp/B.EbfvlD/BUILD + rm -rf /tmp/B.EbfvlD/tmp /tmp/B.EbfvlD/BUILD + rm -rf /tmp/B.EbfvlD Begin-PLD-Builder-Info Build-Time: user:23.93s sys:10.57s real:51.71s (faults io:299 non-io:2174703) End-PLD-Builder-Info
[Back to list of logs] [View rpm -qa of builder]