FailedOk

th/SRPMS[OK]
th/x32[OK]
th/i686[OK]
th/x86_64[OK]

ac/SRPMS[OK]
ac/i386[OK]
ac/i586[OK]
ac/i686[OK]
ac/alpha[OK]
ac/amd64[OK]
ac/athlon[OK]
ac/ppc[OK]
ac/sparc[OK]
ac/sparc64[OK]

Advanced Search
main()
Powered by PLD Linux
(c) 2002-2018 PLD Team
$Revision: 1.37 $
Powered by ed.
Your IP: 54.224.89.34

ruby-ffi-yajl 6af2fa75-315f-45d4-9c52-7e3ed7a39c4f

Status:Failed
Source URL:ftp://buildlogs.pld-linux.org/th/i686/FAIL/ruby-ffi-yajl,6af2fa75-315f-45d4-9c52-7e3ed7a39c4f.bz2
text/plain URL:View!
rpm -qa of builder:View!
Date:2018/06/03 10:00:02
Runtime:0:00:00.887214

Toc:

  • prep
  • Executing(%prep): /bin/sh -e /tmp/B.OBxuPa/BUILD/tmp/rpm-tmp.78866
  • build
  • Executing(%build): /bin/sh -e /tmp/B.OBxuPa/BUILD/tmp/rpm-tmp.78866
  • error 1
  • encoder.c:380:20: error: 'rb_cFixnum' undeclared (first use in this function); did you mean 'rb_isalnum'?
  • error 2
  • encoder.c:381:20: error: 'rb_cBignum' undeclared (first use in this function); did you mean 'rb_cFixnum'?
  • error 3
  • error: Bad exit status from /tmp/B.OBxuPa/BUILD/tmp/rpm-tmp.78866 (%build)
  • error 4
  • RPM build errors:
  • error 5
  • error: No files produced.

Content:

request from: baggins
checking if we should skip the build
started at: Sun Jun  3 09:59:55 2018
killing old processes on a builder
sending signal 9 to pid -1
Killed
fetching https://srcbuilder.pld-linux.org/th//srpms/6af2fa75-315f-45d4-9c52-7e3ed7a39c4f/ruby-ffi-yajl-2.2.3-3.src.rpm
fetched 151008 bytes, 349.8 K/s
installing srpm: ruby-ffi-yajl-2.2.3-3.src.rpm
+ install -d /tmp/B.OBxuPa/BUILD /tmp/B.OBxuPa/RPMS
+ LC_ALL=en_US.UTF-8
+ rpm -qp --changelog ruby-ffi-yajl-2.2.3-3.src.rpm
* Sun Jun 03 2018 PLD Linux Team <feedback@pld-linux.org>
- For complete changelog see: http://git.pld-linux.org/?p=packages/ruby-ffi-yajl.git;a=log;h=master
* Sat Oct 28 2017 Elan Ruusamäe <glen@delfi.ee> 687eafe
- rebuild with fixed ruby(abi) - release 3 (by relup.sh) * Mon Oct 23 2017 Jan Rękorajski <baggins@pld-linux.org> 3949a10
- release 2 (by relup.sh) + rpm -Uhv --nodeps --define '_topdir /tmp/B.OBxuPa' --define '_specdir %{_topdir}' --define '_sourcedir %{_specdir}' --define '_rpmdir %{_topdir}/RPMS' --define '_builddir %{_topdir}/BUILD' ruby-ffi-yajl-2.2.3-3.src.rpm Preparing... ################################################## ruby-ffi-yajl ################################################## + rm -f ruby-ffi-yajl-2.2.3-3.src.rpm + install -m 700 -d /tmp/B.OBxuPa/BUILD/tmp + TMPDIR=/tmp/B.OBxuPa/BUILD/tmp + exec nice -n 0 rpmbuild -bp --short-circuit --nodeps --define '_topdir /tmp/B.OBxuPa' --define '_specdir %{_topdir}' --define '_sourcedir %{_specdir}' --define '_rpmdir %{_topdir}/RPMS' --define '_builddir %{_topdir}/BUILD' --target i686-pld-linux --define 'prep exit 0' /tmp/B.OBxuPa/ruby-ffi-yajl.spec Building target platforms: i686-pld-linux checking BuildConflict-ing packages no BuildConflicts found checking BR rpm: Building target platforms: i686-pld-linux no BR needed building RPM using: set -ex; : build-id: 6af2fa75-315f-45d4-9c52-7e3ed7a39c4f; TMPDIR=/tmp/B.OBxuPa/BUILD/tmp exec nice -n 0 rpmbuild -bb --define '_smp_mflags -j9' --define '_make_opts -Otarget' --define '_pld_builder 1' --define '_topdir /tmp/B.OBxuPa' --define '_specdir %{_topdir}' --define '_sourcedir %{_specdir}' --define '_rpmdir %{_topdir}/RPMS' --define '_builddir %{_topdir}/BUILD' --target i686-pld-linux /tmp/B.OBxuPa/ruby-ffi-yajl.spec + : build-id: 6af2fa75-315f-45d4-9c52-7e3ed7a39c4f + TMPDIR=/tmp/B.OBxuPa/BUILD/tmp + exec nice -n 0 rpmbuild -bb --define '_smp_mflags -j9' --define '_make_opts -Otarget' --define '_pld_builder 1' --define '_topdir /tmp/B.OBxuPa' --define '_specdir %{_topdir}' --define '_sourcedir %{_specdir}' --define '_rpmdir %{_topdir}/RPMS' --define '_builddir %{_topdir}/BUILD' --target i686-pld-linux /tmp/B.OBxuPa/ruby-ffi-yajl.spec Building target platforms: i686-pld-linux Executing(%prep): /bin/sh -e /tmp/B.OBxuPa/BUILD/tmp/rpm-tmp.78866 + umask 022 + cd /tmp/B.OBxuPa/BUILD + cd /tmp/B.OBxuPa/BUILD + rm -rf ffi-yajl-2.2.3 + /bin/mkdir -p ffi-yajl-2.2.3 + cd ffi-yajl-2.2.3 + /bin/tar -xmf /tmp/B.OBxuPa/ffi-yajl-2.2.3.gem + '[' -f data.tar.gz ']' + tar -xmf data.tar.gz + /bin/id -u + '[' 1001 '=' 0 ']' + /bin/id -u + '[' 1001 '=' 0 ']' + /bin/chmod -Rf a+rX,u+w,g-w,o-w . + echo 'Patch #0 (system-yajl.patch):' Patch #0 (system-yajl.patch): + '[' -f /tmp/B.OBxuPa/system-yajl.patch ']' + /bin/cat /tmp/B.OBxuPa/system-yajl.patch + /usr/bin/patch -s -p1 + /bin/sed -i -e '1 s,#!.*ruby,#!/usr/bin/ruby,' bin/ffi-yajl-bench + exit 0 Executing(%build): /bin/sh -e /tmp/B.OBxuPa/BUILD/tmp/rpm-tmp.78866 TMP=/home/users/builder/tmp HOME=/home/users/builder PATH=/home/users/builder/GNUstep/Tools:/usr/local/bin:/usr/bin:/bin:/home/users/builder/bin TMPDIR=/tmp/B.OBxuPa/BUILD/tmp + umask 022 + cd /tmp/B.OBxuPa/BUILD + cd ffi-yajl-2.2.3 + /usr/lib/rpm/gem_helper.rb spec /usr/share/gems/gems/psych-2.2.2/lib/psych.rb:228: warning: already initialized constant Psych::LIBYAML_VERSION /usr/share/ruby/2.4/psych.rb:228: warning: previous definition of LIBYAML_VERSION was here /usr/share/gems/gems/psych-2.2.2/lib/psych.rb:230: warning: already initialized constant Psych::FALLBACK /usr/share/ruby/2.4/psych.rb:230: warning: previous definition of FALLBACK was here Wrote: ffi-yajl-2.2.3.gemspec + /bin/sed -i -e /libyajl2/d ffi-yajl-2.2.3.gemspec + cd ext/ffi_yajl/ext/encoder + /usr/bin/ruby extconf.rb -O2 -fwrapv -pipe -Wformat -Werror=format-security -gdwarf-4 -fno-debug-types-section -fvar-tracking-assignments -g2 -Wp,-D_FORTIFY_SOURCE=2 -fstack-protector-strong --param=ssp-buffer-size=4 -fomit-frame-pointer -march=i686 -fasynchronous-unwind-tables -mtune=pentium4 -fno-omit-frame-pointer -gdwarf-4 -fno-debug-types-section -fvar-tracking-assignments -g2 -fPIC -L. -Wl,--as-needed -Wl,--no-copy-dt-needed-entries -Wl,-z,relro -Wl,-z,combreloc -fstack-protector -rdynamic -Wl,-export-dynamic checking for yajl/yajl_tree.h... yes creating Makefile + /usr/bin/make -Otarget -j9 'V=1' 'CC=i686-pld-linux-gcc' 'LDFLAGS=-Wl,--as-needed -Wl,--no-copy-dt-needed-entries -Wl,-z,relro -Wl,-z,combreloc ' 'CFLAGS=-O2 -fwrapv -pipe -Wformat -Werror=format-security -gdwarf-4 -fno-debug-types-section -fvar-tracking-assignments -g2 -Wp,-D_FORTIFY_SOURCE=2 -fstack-protector-strong --param=ssp-buffer-size=4 -fomit-frame-pointer -march=i686 -fasynchronous-unwind-tables -mtune=pentium4 -gdwarf-4 -fno-debug-types-section -fvar-tracking-assignments -g2 -fPIC' i686-pld-linux-gcc -I. -I/usr/include/ruby-2.4 -I/usr/include/ruby-2.4/ruby/backward -I/usr/include/ruby-2.4 -I. -D_FILE_OFFSET_BITS=64 -O2 -fwrapv -pipe -Wformat -Werror=format-security -gdwarf-4 -fno-debug-types-section -fvar-tracking-assignments -g2 -Wp,-D_FORTIFY_SOURCE=2 -fstack-protector-strong --param=ssp-buffer-size=4 -fomit-frame-pointer -march=i686 -fasynchronous-unwind-tables -mtune=pentium4 -gdwarf-4 -fno-debug-types-section -fvar-tracking-assignments -g2 -fPIC -o encoder.o -c encoder.c encoder.c: In function 'Init_encoder': encoder.c:380:20: error: 'rb_cFixnum' undeclared (first use in this function); did you mean 'rb_isalnum'? rb_define_method(rb_cFixnum, "ffi_yajl", rb_cFixnum_ffi_yajl, 2); ^~~~~~~~~~ rb_isalnum encoder.c:380:20: note: each undeclared identifier is reported only once for each function it appears in encoder.c:381:20: error: 'rb_cBignum' undeclared (first use in this function); did you mean 'rb_cFixnum'? rb_define_method(rb_cBignum, "ffi_yajl", rb_cBignum_ffi_yajl, 2); ^~~~~~~~~~ rb_cFixnum make: *** [Makefile:243: encoder.o] Error 1 error: Bad exit status from /tmp/B.OBxuPa/BUILD/tmp/rpm-tmp.78866 (%build) RPM build errors: Bad exit status from /tmp/B.OBxuPa/BUILD/tmp/rpm-tmp.78866 (%build) ended at: Sun Jun 3 10:00:02 2018, done in 0:00:00.887214 error: No files produced. + chmod -R u+rwX /tmp/B.OBxuPa/BUILD + rm -rf /tmp/B.OBxuPa/tmp /tmp/B.OBxuPa/BUILD + rm -rf /tmp/B.OBxuPa Begin-PLD-Builder-Info Build-Time: user:5.10s sys:0.22s real:6.98s (faults io:0 non-io:121890) End-PLD-Builder-Info
[Back to list of logs] [View rpm -qa of builder]