FailedOk

th/SRPMS[OK]
th/x32[OK]
th/i686[OK]
th/x86_64[OK]

ac/SRPMS[OK]
ac/i386[OK]
ac/i586[OK]
ac/i686[OK]
ac/alpha[OK]
ac/amd64[OK]
ac/athlon[OK]
ac/ppc[OK]
ac/sparc[OK]
ac/sparc64[OK]

Advanced Search
main()
Powered by PLD Linux
(c) 2002-2018 PLD Team
$Revision: 1.37 $
Powered by Joe.
Your IP: 54.92.164.184

ruby-yajl 2b4f7c8f-a3a8-429b-b51e-09e506adcefa

Status:Failed
Source URL:ftp://buildlogs.pld-linux.org/th/i686/FAIL/ruby-yajl,2b4f7c8f-a3a8-429b-b51e-09e506adcefa.bz2
text/plain URL:View!
full text:View!
rpm -qa of builder:View!
Date:2018/06/05 09:02:58
Runtime:0:00:01.179136

Toc:

  • error 1
  • yajl_ext.c:881:22: error: 'rb_cFixnum' undeclared (first use in this function); did you mean 'rb_isalnum'?
  • error 2
  • error: Bad exit status from /tmp/B.NuFB2V/BUILD/tmp/rpm-tmp.27286 (%build)
  • error 3
  • RPM build errors:
  • error 4
  • error: No files produced.

Content:

checking if we should skip the build
started at: Tue Jun  5 09:02:53 2018
killing old processes on a builder
sending signal 9 to pid -1
Killed
fetching https://srcbuilder.pld-linux.org/th//srpms/2b4f7c8f-a3a8-429b-b51e-09e506adcefa/ruby-yajl-1.2.1-4.src.rpm
fetched 550546 bytes, 1052.7 K/s
installing srpm: ruby-yajl-1.2.1-4.src.rpm
+ install -d /tmp/B.NuFB2V/BUILD /tmp/B.NuFB2V/RPMS
+ LC_ALL=en_US.UTF-8
+ rpm -qp --changelog ruby-yajl-1.2.1-4.src.rpm
* Tue Jun 05 2018 PLD Linux Team <feedback@pld-linux.org>
- For complete changelog see: http://git.pld-linux.org/?p=packages/ruby-yajl.git;a=log;h=master
* Wed Oct 25 2017 Jan Rękorajski <baggins@pld-linux.org> f30207c
- rebuild with ruby 2.3 - release 4 (by relup.sh) + rpm -Uhv --nodeps --define '_topdir /tmp/B.NuFB2V' --define '_specdir %{_topdir}' --define '_sourcedir %{_specdir}' --define '_rpmdir %{_topdir}/RPMS' --define '_builddir %{_topdir}/BUILD' ruby-yajl-1.2.1-4.src.rpm Preparing... ################################################## ruby-yajl ################################################## + rm -f ruby-yajl-1.2.1-4.src.rpm + install -m 700 -d /tmp/B.NuFB2V/BUILD/tmp + TMPDIR=/tmp/B.NuFB2V/BUILD/tmp + exec nice -n 0 rpmbuild -bp --short-circuit --nodeps --define '_topdir /tmp/B.NuFB2V' --define '_specdir %{_topdir}' --define '_sourcedir %{_specdir}' --define '_rpmdir %{_topdir}/RPMS' --define '_builddir %{_topdir}/BUILD' --target i686-pld-linux --define 'prep exit 0' /tmp/B.NuFB2V/ruby-yajl.spec Building target platforms: i686-pld-linux checking BuildConflict-ing packages no BuildConflicts found checking BR rpm: Building target platforms: i686-pld-linux no BR needed building RPM using: set -ex; : build-id: 2b4f7c8f-a3a8-429b-b51e-09e506adcefa; TMPDIR=/tmp/B.NuFB2V/BUILD/tmp exec nice -n 0 rpmbuild -bb --define '_smp_mflags -j9' --define '_make_opts -Otarget' --define '_pld_builder 1' --define '_topdir /tmp/B.NuFB2V' --define '_specdir %{_topdir}' --define '_sourcedir %{_specdir}' --define '_rpmdir %{_topdir}/RPMS' --define '_builddir %{_topdir}/BUILD' --target i686-pld-linux /tmp/B.NuFB2V/ruby-yajl.spec + : build-id: 2b4f7c8f-a3a8-429b-b51e-09e506adcefa + TMPDIR=/tmp/B.NuFB2V/BUILD/tmp + exec nice -n 0 rpmbuild -bb --define '_smp_mflags -j9' --define '_make_opts -Otarget' --define '_pld_builder 1' --define '_topdir /tmp/B.NuFB2V' --define '_specdir %{_topdir}' --define '_sourcedir %{_specdir}' --define '_rpmdir %{_topdir}/RPMS' --define '_builddir %{_topdir}/BUILD' --target i686-pld-linux /tmp/B.NuFB2V/ruby-yajl.spec Building target platforms: i686-pld-linux Executing(%prep): /bin/sh -e /tmp/B.NuFB2V/BUILD/tmp/rpm-tmp.27286 + umask 022 + cd /tmp/B.NuFB2V/BUILD + cd /tmp/B.NuFB2V/BUILD + rm -rf ruby-yajl-1.2.1 + /bin/mkdir -p ruby-yajl-1.2.1 + cd ruby-yajl-1.2.1 + /bin/tar -xmf /tmp/B.NuFB2V/yajl-ruby-1.2.1.gem + '[' -f data.tar.gz ']' + tar -xmf data.tar.gz + /bin/id -u + '[' 1001 '=' 0 ']' + /bin/id -u + '[' 1001 '=' 0 ']' + /bin/chmod -Rf a+rX,u+w,g-w,o-w . + exit 0 Executing(%build): /bin/sh -e /tmp/B.NuFB2V/BUILD/tmp/rpm-tmp.27286 TMP=/home/users/builder/tmp HOME=/home/users/builder PATH=/home/users/builder/GNUstep/Tools:/usr/local/bin:/usr/bin:/bin:/home/users/builder/bin TMPDIR=/tmp/B.NuFB2V/BUILD/tmp + umask 022 + cd /tmp/B.NuFB2V/BUILD + cd ruby-yajl-1.2.1 + /usr/lib/rpm/gem_helper.rb spec /usr/share/gems/gems/psych-2.2.2/lib/psych.rb:228: warning: already initialized constant Psych::LIBYAML_VERSION /usr/share/ruby/2.4/psych.rb:228: warning: previous definition of LIBYAML_VERSION was here /usr/share/gems/gems/psych-2.2.2/lib/psych.rb:230: warning: already initialized constant Psych::FALLBACK /usr/share/ruby/2.4/psych.rb:230: warning: previous definition of FALLBACK was here Wrote: yajl-ruby-1.2.1.gemspec + cd ext/yajl + /usr/bin/ruby extconf.rb creating Makefile + /usr/bin/make -Otarget -j9 'V=1' 'CC=i686-pld-linux-gcc' 'LDFLAGS=-Wl,--as-needed -Wl,--no-copy-dt-needed-entries -Wl,-z,relro -Wl,-z,combreloc ' 'CFLAGS=-O2 -fwrapv -pipe -Wformat -Werror=format-security -gdwarf-4 -fno-debug-types-section -fvar-tracking-assignments -g2 -Wp,-D_FORTIFY_SOURCE=2 -fstack-protector-strong --param=ssp-buffer-size=4 -fomit-frame-pointer -march=i686 -fasynchronous-unwind-tables -mtune=pentium4 -gdwarf-4 -fno-debug-types-section -fvar-tracking-assignments -g2 -fPIC' i686-pld-linux-gcc -I. -I/usr/include/ruby-2.4 -I/usr/include/ruby-2.4/ruby/backward -I/usr/include/ruby-2.4 -I. -D_FILE_OFFSET_BITS=64 -O2 -fwrapv -pipe -Wformat -Werror=format-security -gdwarf-4 -fno-debug-types-section -fvar-tracking-assignments -g2 -Wp,-D_FORTIFY_SOURCE=2 -fstack-protector-strong --param=ssp-buffer-size=4 -fomit-frame-pointer -march=i686 -fasynchronous-unwind-tables -mtune=pentium4 -gdwarf-4 -fno-debug-types-section -fvar-tracking-assignments -g2 -fPIC -o yajl_alloc.o -c yajl_alloc.c i686-pld-linux-gcc -I. -I/usr/include/ruby-2.4 -I/usr/include/ruby-2.4/ruby/backward -I/usr/include/ruby-2.4 -I. -D_FILE_OFFSET_BITS=64 -O2 -fwrapv -pipe -Wformat -Werror=format-security -gdwarf-4 -fno-debug-types-section -fvar-tracking-assignments -g2 -Wp,-D_FORTIFY_SOURCE=2 -fstack-protector-strong --param=ssp-buffer-size=4 -fomit-frame-pointer -march=i686 -fasynchronous-unwind-tables -mtune=pentium4 -gdwarf-4 -fno-debug-types-section -fvar-tracking-assignments -g2 -fPIC -o yajl_buf.o -c yajl_buf.c i686-pld-linux-gcc -I. -I/usr/include/ruby-2.4 -I/usr/include/ruby-2.4/ruby/backward -I/usr/include/ruby-2.4 -I. -D_FILE_OFFSET_BITS=64 -O2 -fwrapv -pipe -Wformat -Werror=format-security -gdwarf-4 -fno-debug-types-section -fvar-tracking-assignments -g2 -Wp,-D_FORTIFY_SOURCE=2 -fstack-protector-strong --param=ssp-buffer-size=4 -fomit-frame-pointer -march=i686 -fasynchronous-unwind-tables -mtune=pentium4 -gdwarf-4 -fno-debug-types-section -fvar-tracking-assignments -g2 -fPIC -o yajl.o -c yajl.c i686-pld-linux-gcc -I. -I/usr/include/ruby-2.4 -I/usr/include/ruby-2.4/ruby/backward -I/usr/include/ruby-2.4 -I. -D_FILE_OFFSET_BITS=64 -O2 -fwrapv -pipe -Wformat -Werror=format-security -gdwarf-4 -fno-debug-types-section -fvar-tracking-assignments -g2 -Wp,-D_FORTIFY_SOURCE=2 -fstack-protector-strong --param=ssp-buffer-size=4 -fomit-frame-pointer -march=i686 -fasynchronous-unwind-tables -mtune=pentium4 -gdwarf-4 -fno-debug-types-section -fvar-tracking-assignments -g2 -fPIC -o yajl_version.o -c yajl_version.c i686-pld-linux-gcc -I. -I/usr/include/ruby-2.4 -I/usr/include/ruby-2.4/ruby/backward -I/usr/include/ruby-2.4 -I. -D_FILE_OFFSET_BITS=64 -O2 -fwrapv -pipe -Wformat -Werror=format-security -gdwarf-4 -fno-debug-types-section -fvar-tracking-assignments -g2 -Wp,-D_FORTIFY_SOURCE=2 -fstack-protector-strong --param=ssp-buffer-size=4 -fomit-frame-pointer -march=i686 -fasynchronous-unwind-tables -mtune=pentium4 -gdwarf-4 -fno-debug-types-section -fvar-tracking-assignments -g2 -fPIC -o yajl_encode.o -c yajl_encode.c i686-pld-linux-gcc -I. -I/usr/include/ruby-2.4 -I/usr/include/ruby-2.4/ruby/backward -I/usr/include/ruby-2.4 -I. -D_FILE_OFFSET_BITS=64 -O2 -fwrapv -pipe -Wformat -Werror=format-security -gdwarf-4 -fno-debug-types-section -fvar-tracking-assignments -g2 -Wp,-D_FORTIFY_SOURCE=2 -fstack-protector-strong --param=ssp-buffer-size=4 -fomit-frame-pointer -march=i686 -fasynchronous-unwind-tables -mtune=pentium4 -gdwarf-4 -fno-debug-types-section -fvar-tracking-assignments -g2 -fPIC -o yajl_ext.o -c yajl_ext.c yajl_ext.c: In function 'rb_yajl_encoder_enable_json_gem_ext': yajl_ext.c:881:22: error: 'rb_cFixnum' undeclared (first use in this function); did you mean 'rb_isalnum'? rb_define_method(rb_cFixnum, "to_json", rb_yajl_json_ext_fixnum_to_json, -1); ^~~~~~~~~~ rb_isalnum yajl_ext.c:881:22: note: each undeclared identifier is reported only once for each function it appears in make: *** [Makefile:242: yajl_ext.o] Error 1 make: *** Waiting for unfinished jobs.... i686-pld-linux-gcc -I. -I/usr/include/ruby-2.4 -I/usr/include/ruby-2.4/ruby/backward -I/usr/include/ruby-2.4 -I. -D_FILE_OFFSET_BITS=64 -O2 -fwrapv -pipe -Wformat -Werror=format-security -gdwarf-4 -fno-debug-types-section -fvar-tracking-assignments -g2 -Wp,-D_FORTIFY_SOURCE=2 -fstack-protector-strong --param=ssp-buffer-size=4 -fomit-frame-pointer -march=i686 -fasynchronous-unwind-tables -mtune=pentium4 -gdwarf-4 -fno-debug-types-section -fvar-tracking-assignments -g2 -fPIC -o yajl_parser.o -c yajl_parser.c i686-pld-linux-gcc -I. -I/usr/include/ruby-2.4 -I/usr/include/ruby-2.4/ruby/backward -I/usr/include/ruby-2.4 -I. -D_FILE_OFFSET_BITS=64 -O2 -fwrapv -pipe -Wformat -Werror=format-security -gdwarf-4 -fno-debug-types-section -fvar-tracking-assignments -g2 -Wp,-D_FORTIFY_SOURCE=2 -fstack-protector-strong --param=ssp-buffer-size=4 -fomit-frame-pointer -march=i686 -fasynchronous-unwind-tables -mtune=pentium4 -gdwarf-4 -fno-debug-types-section -fvar-tracking-assignments -g2 -fPIC -o yajl_gen.o -c yajl_gen.c i686-pld-linux-gcc -I. -I/usr/include/ruby-2.4 -I/usr/include/ruby-2.4/ruby/backward -I/usr/include/ruby-2.4 -I. -D_FILE_OFFSET_BITS=64 -O2 -fwrapv -pipe -Wformat -Werror=format-security -gdwarf-4 -fno-debug-types-section -fvar-tracking-assignments -g2 -Wp,-D_FORTIFY_SOURCE=2 -fstack-protector-strong --param=ssp-buffer-size=4 -fomit-frame-pointer -march=i686 -fasynchronous-unwind-tables -mtune=pentium4 -gdwarf-4 -fno-debug-types-section -fvar-tracking-assignments -g2 -fPIC -o yajl_lex.o -c yajl_lex.c error: Bad exit status from /tmp/B.NuFB2V/BUILD/tmp/rpm-tmp.27286 (%build) RPM build errors: Bad exit status from /tmp/B.NuFB2V/BUILD/tmp/rpm-tmp.27286 (%build) ended at: Tue Jun 5 09:02:57 2018, done in 0:00:01.179136 error: No files produced. + chmod -R u+rwX /tmp/B.NuFB2V/BUILD + rm -rf /tmp/B.NuFB2V/tmp /tmp/B.NuFB2V/BUILD + rm -rf /tmp/B.NuFB2V Begin-PLD-Builder-Info Build-Time: user:3.09s sys:0.27s real:4.32s (faults io:0 non-io:134014) End-PLD-Builder-Info
[Back to list of logs] [View rpm -qa of builder]