FailedOk

th/SRPMS[OK]
th/x32[OK]
th/i686[OK]
th/x86_64[OK]

ac/SRPMS[OK]
ac/i386[OK]
ac/i586[OK]
ac/i686[OK]
ac/alpha[OK]
ac/amd64[OK]
ac/athlon[OK]
ac/ppc[OK]
ac/sparc[OK]
ac/sparc64[OK]

Advanced Search
main()
Powered by PLD Linux
(c) 2002-2018 PLD Team
$Revision: 1.37 $
Powered by Microsoft Windows 2003.
Your IP: 54.90.109.231

samba 25e1b6d7-1cd1-4e0e-96e2-dd2443354af6

Status:Failed
Source URL:ftp://buildlogs.pld-linux.org/th/i686/FAIL/samba,25e1b6d7-1cd1-4e0e-96e2-dd2443354af6.bz2
text/plain URL:View!
full text:View!
rpm -qa of builder:View!
Date:2018/11/28 01:25:22
Runtime:0:01:48.590027

Toc:

  • error 1
  • rpm: error: Failed build dependencies:
  • error 2
  • rpm: error: Failed build dependencies:
  • prep
  • Executing(%prep): /bin/sh -e /tmp/B.zYV1cz/BUILD/tmp/rpm-tmp.26577
  • build
  • Executing(%build): /bin/sh -e /tmp/B.zYV1cz/BUILD/tmp/rpm-tmp.72287
  • error 3
  • /tmp/B.zYV1cz/BUILD/samba-4.9.3/librpc/idl/auth.idl:107: error: Unable to determine origin of type `struct cli_credentials'
  • error 4
  • /tmp/B.zYV1cz/BUILD/samba-4.9.3/librpc/idl/auth.idl:107: error: Unable to determine origin of type `struct cli_credentials'
  • error 5
  • error: Bad exit status from /tmp/B.zYV1cz/BUILD/tmp/rpm-tmp.72287 (%build)
  • error 6
  • RPM build errors:
  • error 7
  • error: No files produced.

Content:

checking if we should skip the build
started at: Wed Nov 28 01:22:47 2018
killing old processes on a builder
sending signal 9 to pid -1
Killed
cleaning up /tmp
fetching https://srcbuilder.pld-linux.org/th//srpms/25e1b6d7-1cd1-4e0e-96e2-dd2443354af6/samba-4.9.3-1.src.rpm
fetched 17741835 bytes, 5720.4 K/s
installing srpm: samba-4.9.3-1.src.rpm
+ install -d /tmp/B.zYV1cz/BUILD /tmp/B.zYV1cz/RPMS
+ LC_ALL=en_US.UTF-8
+ rpm -qp --changelog samba-4.9.3-1.src.rpm
* Tue Nov 27 2018 PLD Linux Team <feedback@pld-linux.org>
- For complete changelog see: http://git.pld-linux.org/?p=packages/samba.git;a=log;h=master
* Tue Nov 27 2018 Adam Gołębiowski <adamg@pld-linux.org> 0acc39e
- updated to 4.9.3, solves CVE-2018-14629, CVE-2018-16841, CVE-2018-16851, CVE-2018-16852, CVE-2018-16853,CVE-2018-16857 * Sun Nov 18 2018 Arkadiusz Miśkiewicz <arekm@maven.pl> 8029aa5
- rel 3; set unix nobody group mapping * Sat Nov 17 2018 Jakub Bogusz <qboosh@pld-linux.org> a250be6
- updated talloc/tdb/tevent versions to those of included ones * Fri Nov 09 2018 Adam Gołębiowski <adamg@pld-linux.org> a30908a
- release 2 * Thu Nov 08 2018 Adam Gołębiowski <adamg@pld-linux.org> 76b03a4
- updated to 4.9.2 * Fri Sep 28 2018 Arkadiusz Miśkiewicz <arekm@maven.pl> 0c65359
- up to 4.9.1 * Mon Sep 17 2018 Arkadiusz Miśkiewicz <arekm@maven.pl> 279f093
- up to 4.9.0 * Fri Aug 31 2018 Arkadiusz Miśkiewicz <arekm@maven.pl> 8bd519e
- up to 4.8.5 * Wed Aug 22 2018 Jakub Bogusz <qboosh@pld-linux.org> c4c2c2d
- updated to 4.8.4 (fixes CVE-2018-1139 CVE-2018-1140 CVE-2018-10858 CVE-2018-10918 CVE-2018-10919) * Sat Aug 04 2018 Arkadiusz Miśkiewicz <arekm@maven.pl> 15c1253
- up to 4.8.3 * Sun Jun 24 2018 Jakub Bogusz <qboosh@pld-linux.org> 5021f73
- updated system libs dependencies - check-files cleanup * Fri May 25 2018 Arkadiusz Miśkiewicz <arekm@maven.pl> ead5ab3
- rel 1 * Fri May 25 2018 Arkadiusz Miśkiewicz <arekm@maven.pl> 711565c
- up to 4.8.2; files need fixes * Wed Apr 04 2018 Jakub Bogusz <qboosh@pld-linux.org> 9512983
- added no_libbsd patch and system_libbsd bcond * Thu Mar 22 2018 Jan Rękorajski <baggins@pld-linux.org> c69d0dd
- up to 4.7.6, fixes CVE-2018-1050, CVE-2018-1057 * Wed Dec 27 2017 Jakub Bogusz <qboosh@pld-linux.org> 5fe02f1
- made _libexecdir aware - use system python-iso8601 (used if found at build time) - release 2 * Tue Dec 26 2017 Jakub Bogusz <qboosh@pld-linux.org> d76287e
- updated to 4.7.4 (fixes CVE-2017-14746,CVE-2017-15275) - updated server-role patch + rpm -Uhv --nodeps --define '_topdir /tmp/B.zYV1cz' --define '_specdir %{_topdir}' --define '_sourcedir %{_specdir}' --define '_rpmdir %{_topdir}/RPMS' --define '_builddir %{_topdir}/BUILD' samba-4.9.3-1.src.rpm Preparing... ################################################## samba ################################################## + rm -f samba-4.9.3-1.src.rpm + install -m 700 -d /tmp/B.zYV1cz/BUILD/tmp + TMPDIR=/tmp/B.zYV1cz/BUILD/tmp + exec nice -n 0 rpmbuild -bp --short-circuit --nodeps --define '_topdir /tmp/B.zYV1cz' --define '_specdir %{_topdir}' --define '_sourcedir %{_specdir}' --define '_rpmdir %{_topdir}/RPMS' --define '_builddir %{_topdir}/BUILD' --target i686-pld-linux --define 'prep exit 0' /tmp/B.zYV1cz/samba.spec Building target platforms: i686-pld-linux checking BuildConflict-ing packages no BuildConflicts found checking BR rpm: error: Failed build dependencies: rpm: ceph-devel >= 0.73 is needed by samba-4.9.3-1.src rpm: pcp-devel is needed by samba-4.9.3-1.src rpm: ldb-devel >= 1.4.3 is needed by samba-4.9.3-1.src rpm: ldb-devel < 1.5 is needed by samba-4.9.3-1.src rpm: python-ldb-devel >= 1.4.3 is needed by samba-4.9.3-1.src rpm: Building target platforms: i686-pld-linux updating poldek cache... ready is up to date Retrieving th::packages.ndir.md... th is up to date Retrieving th::packages.ndir.md... th is up to date Retrieving th-ready::packages.ndir.md... th-ready is up to date Retrieving th-ready::packages.ndir.md... th-ready is up to date Retrieving th-test::packages.ndir.md... Retrieving th-test::packages.ndir.diff.toc.gz... Retrieving diff::packages.ndir.2018.11.27-12.01.01.gz... ..............................done Retrieving diff::packages.ndir.dscr.2018.11.27-12.01.01.gz... Loading [pndir]th-test... Applying packages.ndir.2018.11.27-12.01.01.gz... Retrieving diff::packages.ndir.2018.11.27-22.28.01.gz... ..............................done Retrieving diff::packages.ndir.dscr.2018.11.27-22.28.01.gz... ..............................done Applying packages.ndir.2018.11.27-22.28.01.gz... Retrieving diff::packages.ndir.2018.11.27-22.31.02.gz... ..............................done Retrieving diff::packages.ndir.dscr.2018.11.27-22.31.02.gz... Applying packages.ndir.2018.11.27-22.31.02.gz... Writing /root/tmp/poldek-cache-root/[...]/packages.ndir.gz... Retrieving th-test::packages.ndir.md... Retrieving th-test::packages.ndir.diff.toc.gz... Retrieving diff::packages.ndir.2018.11.27-21.29.01.gz... ..............................done Retrieving diff::packages.ndir.dscr.2018.11.27-21.29.01.gz... Loading [pndir]th-test... Applying packages.ndir.2018.11.27-21.29.01.gz... Retrieving diff::packages.ndir.2018.11.27-23.16.03.gz... ..............................done Retrieving diff::packages.ndir.dscr.2018.11.27-23.16.03.gz... Applying packages.ndir.2018.11.27-23.16.03.gz... Writing /root/tmp/poldek-cache-root/[...]/packages.ndir.gz... checking conflicting packages in BRed packages poldek: Loading [pndir]ready... poldek: Loading [pndir]th-test... poldek: Loading [pndir]th-test... poldek: Loading [pndir]th-ready... poldek: Loading [pndir]th-ready... poldek: Loading [pndir]th... poldek: Loading [pndir]th... poldek: 30501 packages read poldek: Removed 3300 duplicate packages from available set poldek: Processing dependencies... poldek: ceph-devel-0.94.10-1.i686 marks leveldb-devel-1.20-1.i686 (cap leveldb-devel) poldek: ldb-devel-1.4.3-1.i686 marks ldb-1.4.3-1.i686 (cap ldb = 1.4.3-1) poldek: pcp-devel-4.1.0-4.i686 marks pcp-libs-4.1.0-4.i686 (cap pcp-libs = 4.1.0-4) poldek: python-ldb-devel-1.4.3-1.i686 marks python-ldb-1.4.3-1.i686 (cap python-ldb = 1.4.3-1) poldek: There are 8 packages to install (4 marked by dependencies): poldek: I ceph-devel-0.94.10-1.i686 ldb-devel-1.4.3-1.i686 poldek: I pcp-devel-4.1.0-4.i686 python-ldb-devel-1.4.3-1.i686 poldek: D ldb-1.4.3-1.i686 leveldb-devel-1.20-1.i686 pcp-libs-4.1.0-4.i686 poldek: D python-ldb-1.4.3-1.i686 poldek: This operation will use 2.6MB of disk space. poldek: Need to get 1.1MB of archives (1.1MB to download). poldek: poldek: Retrieving [1/8] th::leveldb-devel-1.20-1.i686.rpm... poldek: ..............................done poldek: Retrieving [2/8] th::ceph-devel-0.94.10-1.i686.rpm... poldek: ..............................done poldek: Retrieving [3/8] th::ldb-1.4.3-1.i686.rpm... poldek: ..............................done poldek: Retrieving [4/8] th::ldb-devel-1.4.3-1.i686.rpm... poldek: ..............................done poldek: Retrieving [5/8] th::pcp-libs-4.1.0-4.i686.rpm... poldek: ..............................done poldek: Retrieving [6/8] th::pcp-devel-4.1.0-4.i686.rpm... poldek: ..............................done poldek: Retrieving [7/8] th::python-ldb-1.4.3-1.i686.rpm... poldek: ..............................done poldek: Retrieving [8/8] th::python-ldb-devel-1.4.3-1.i686.rpm... poldek: ..............................done poldek: Executing pm-command.sh --upgrade -vh --test --root / --define _check_dirname_deps 1... poldek: Preparing... ################################################## no conflicts found checking BR rpm: error: Failed build dependencies: rpm: ceph-devel >= 0.73 is needed by samba-4.9.3-1.src rpm: pcp-devel is needed by samba-4.9.3-1.src rpm: ldb-devel >= 1.4.3 is needed by samba-4.9.3-1.src rpm: ldb-devel < 1.5 is needed by samba-4.9.3-1.src rpm: python-ldb-devel >= 1.4.3 is needed by samba-4.9.3-1.src rpm: Building target platforms: i686-pld-linux installing BR: pcp\-devel ldb\-devel ceph\-devel python\-ldb\-devel + poldek --noask --caplookup -Q -v '--ignore=hhvm-*' '--ignore=php4-*' '--ignore=php52-*' '--ignore=php54-*' '--ignore=php55-*' '--ignore=php56-*' '--ignore=php70-*' '--ignore=php71-*' '--ignore=php72-*' '--ignore=php73-*' --upgrade pcp-devel ldb-devel ceph-devel python-ldb-devel Loading [pndir]ready... Loading [pndir]th-test... Loading [pndir]th-test... Loading [pndir]th-ready... Loading [pndir]th-ready... Loading [pndir]th... Loading [pndir]th... 30501 packages read Removed 3300 duplicate packages from available set Processing dependencies... ceph-devel-0.94.10-1.i686 marks leveldb-devel-1.20-1.i686 (cap leveldb-devel) There are 2 packages to install (1 marked by dependencies): I ceph-devel-0.94.10-1.i686 D leveldb-devel-1.20-1.i686 This operation will use 379.7KB of disk space. Need to get 101.5KB of archives. Executing pm-command.sh --upgrade -vh --root / --define _check_dirname_deps 1... Preparing... ################################################## ceph-devel ################################################## leveldb-devel ################################################## Installing set #2 Processing dependencies... ldb-devel-1.4.3-1.i686 marks ldb-1.4.3-1.i686 (cap ldb = 1.4.3-1) There are 2 packages to install (1 marked by dependencies): I ldb-devel-1.4.3-1.i686 D ldb-1.4.3-1.i686 This operation will use 519.1KB of disk space. Need to get 146.8KB of archives. Executing pm-command.sh --upgrade -vh --root / --define _check_dirname_deps 1... Preparing... ################################################## ldb ################################################## ldb-devel ################################################## Installing set #3 Processing dependencies... pcp-devel-4.1.0-4.i686 marks pcp-libs-4.1.0-4.i686 (cap pcp-libs = 4.1.0-4) There are 2 packages to install (1 marked by dependencies): I pcp-devel-4.1.0-4.i686 D pcp-libs-4.1.0-4.i686 This operation will use 1.6MB of disk space. Need to get 822.7KB of archives. Executing pm-command.sh --upgrade -vh --root / --define _check_dirname_deps 1... Preparing... ################################################## Adding group pcp GID=308. Adding user pcp UID=308. pcp-libs ################################################## pcp-devel ################################################## Installing set #4 Processing dependencies... python-ldb-devel-1.4.3-1.i686 marks python-ldb-1.4.3-1.i686 (cap python-ldb = 1.4.3-1) There are 2 packages to install (1 marked by dependencies): I python-ldb-devel-1.4.3-1.i686 D python-ldb-1.4.3-1.i686 This operation will use 104.4KB of disk space. Need to get 38.7KB of archives. Executing pm-command.sh --upgrade -vh --root / --define _check_dirname_deps 1... Preparing... ################################################## python-ldb ################################################## python-ldb-devel ################################################## building RPM using: set -ex; : build-id: 25e1b6d7-1cd1-4e0e-96e2-dd2443354af6; TMPDIR=/tmp/B.zYV1cz/BUILD/tmp exec nice -n 0 rpmbuild -bb --define '_smp_mflags -j9' --define '_make_opts -Otarget' --define '_pld_builder 1' --define '_topdir /tmp/B.zYV1cz' --define '_specdir %{_topdir}' --define '_sourcedir %{_specdir}' --define '_rpmdir %{_topdir}/RPMS' --define '_builddir %{_topdir}/BUILD' --target i686-pld-linux /tmp/B.zYV1cz/samba.spec + : build-id: 25e1b6d7-1cd1-4e0e-96e2-dd2443354af6 + TMPDIR=/tmp/B.zYV1cz/BUILD/tmp + exec nice -n 0 rpmbuild -bb --define '_smp_mflags -j9' --define '_make_opts -Otarget' --define '_pld_builder 1' --define '_topdir /tmp/B.zYV1cz' --define '_specdir %{_topdir}' --define '_sourcedir %{_specdir}' --define '_rpmdir %{_topdir}/RPMS' --define '_builddir %{_topdir}/BUILD' --target i686-pld-linux /tmp/B.zYV1cz/samba.spec Building target platforms: i686-pld-linux Executing(%prep): /bin/sh -e /tmp/B.zYV1cz/BUILD/tmp/rpm-tmp.26577 + umask 022 + cd /tmp/B.zYV1cz/BUILD + cd /tmp/B.zYV1cz/BUILD + rm -rf samba-4.9.3 + /usr/bin/gzip -dc /tmp/B.zYV1cz/samba-4.9.3.tar.gz + /bin/tar -xf - + STATUS=0 + '[' 0 -ne 0 ']' + cd samba-4.9.3 + /bin/id -u + '[' 1001 '=' 0 ']' + /bin/id -u + '[' 1001 '=' 0 ']' + /bin/chmod -Rf a+rX,u+w,g-w,o-w . + echo 'Patch #1 (samba-c++-nofail.patch):' Patch #1 (samba-c++-nofail.patch): + '[' -f /tmp/B.zYV1cz/samba-c++-nofail.patch ']' + /usr/bin/patch -s -p1 + /bin/cat /tmp/B.zYV1cz/samba-c++-nofail.patch + echo 'Patch #2 (samba-lprng-no-dot-printers.patch):' Patch #2 (samba-lprng-no-dot-printers.patch): + '[' -f /tmp/B.zYV1cz/samba-lprng-no-dot-printers.patch ']' + /bin/cat /tmp/B.zYV1cz/samba-lprng-no-dot-printers.patch + /usr/bin/patch -s -p1 + echo 'Patch #4 (unicodePwd-nthash-values-over-LDAP.patch):' Patch #4 (unicodePwd-nthash-values-over-LDAP.patch): + '[' -f /tmp/B.zYV1cz/unicodePwd-nthash-values-over-LDAP.patch ']' + /bin/cat /tmp/B.zYV1cz/unicodePwd-nthash-values-over-LDAP.patch + /usr/bin/patch -s -p1 + echo 'Patch #6 (server-role.patch):' Patch #6 (server-role.patch): + '[' -f /tmp/B.zYV1cz/server-role.patch ']' + /bin/cat /tmp/B.zYV1cz/server-role.patch + /usr/bin/patch -s -p1 + echo 'Patch #7 (samba-bug-9816.patch):' Patch #7 (samba-bug-9816.patch): + '[' -f /tmp/B.zYV1cz/samba-bug-9816.patch ']' + /bin/cat /tmp/B.zYV1cz/samba-bug-9816.patch + /usr/bin/patch -s -p1 + echo 'Patch #8 (samba-no_libbsd.patch):' Patch #8 (samba-no_libbsd.patch): + '[' -f /tmp/B.zYV1cz/samba-no_libbsd.patch ']' + /bin/cat /tmp/B.zYV1cz/samba-no_libbsd.patch + /usr/bin/patch -s -p1 + /bin/sed -i -e 's|#!/usr/bin/env python|#!/usr/bin/python|' source4/scripting/bin/samba-gpupdate source4/scripting/bin/samba-tool source4/scripting/bin/samba3dump source4/scripting/bin/samba_backup source4/scripting/bin/samba_dnsupdate source4/scripting/bin/samba_kcc source4/scripting/bin/samba_spnupdate source4/scripting/bin/samba_upgradedns source4/scripting/bin/samba_upgradeprovision source4/scripting/bin/sambaundoguididx + /bin/sed -i -e 's|#!/usr/bin/env perl|#!/usr/bin/perl|' pidl/pidl + exit 0 Executing(%build): /bin/sh -e /tmp/B.zYV1cz/BUILD/tmp/rpm-tmp.72287 TMP=/home/users/builder/tmp HOME=/home/users/builder PATH=/usr/local/bin:/usr/bin:/bin:/home/users/builder/bin TMPDIR=/tmp/B.zYV1cz/BUILD/tmp + umask 022 + cd /tmp/B.zYV1cz/BUILD + cd samba-4.9.3 + LDFLAGS='-Wl,--as-needed -Wl,--no-copy-dt-needed-entries -Wl,-z,relro -Wl,-z,combreloc ' CFLAGS='-O2 -fwrapv -pipe -Wformat -Werror=format-security -gdwarf-4 -fno-debug-types-section -fvar-tracking-assignments -g2 -Wp,-D_FORTIFY_SOURCE=2 -fstack-protector-strong --param=ssp-buffer-size=4 -fomit-frame-pointer -march=i686 -fasynchronous-unwind-tables -mtune=pentium4 -gdwarf-4 -fno-debug-types-section -fvar-tracking-assignments -g2 ' CXXFLAGS='-O2 -fwrapv -pipe -Wformat -Werror=format-security -gdwarf-4 -fno-debug-types-section -fvar-tracking-assignments -g2 -Wp,-D_FORTIFY_SOURCE=2 -fstack-protector-strong --param=ssp-buffer-size=4 -fomit-frame-pointer -march=i686 -fasynchronous-unwind-tables -mtune=pentium4 -gdwarf-4 -fno-debug-types-section -fvar-tracking-assignments -g2 ' FFLAGS='-O2 -fwrapv -pipe -Wformat -Werror=format-security -gdwarf-4 -fno-debug-types-section -fvar-tracking-assignments -g2 -Wp,-D_FORTIFY_SOURCE=2 -fstack-protector-strong --param=ssp-buffer-size=4 -fomit-frame-pointer -march=i686 -fasynchronous-unwind-tables -mtune=pentium4 -gdwarf-4 -fno-debug-types-section -fvar-tracking-assignments -g2 ' FCFLAGS='-O2 -fwrapv -pipe -Wformat -Werror=format-security -gdwarf-4 -fno-debug-types-section -fvar-tracking-assignments -g2 -Wp,-D_FORTIFY_SOURCE=2 -fstack-protector-strong --param=ssp-buffer-size=4 -fomit-frame-pointer -march=i686 -fasynchronous-unwind-tables -mtune=pentium4 -gdwarf-4 -fno-debug-types-section -fvar-tracking-assignments -g2 ' CPPFLAGS= CC=i686-pld-linux-gcc CXX=i686-pld-linux-g++ ./configure --enable-fhs '--prefix=/usr' '--exec-prefix=/usr' '--bindir=/usr/bin' '--sbindir=/usr/sbin' '--sysconfdir=/etc' '--datadir=/usr/share' '--includedir=/usr/include' '--libdir=/usr/lib' '--libexecdir=/usr/libexec' '--localstatedir=/var' '--sharedstatedir=/var/lib' '--mandir=/usr/share/man' '--infodir=/usr/share/info' '--with-privatelibdir=/usr/lib/samba' '--with-modulesdir=/usr/lib/samba' '--with-pammodulesdir=/lib/security' '--with-lockdir=/var/lib/samba' '--with-privatedir=/etc/samba' --disable-rpath --disable-rpath-install '--builtin-libraries=ccan,samba-cluster-support' '--bundled-libraries=NONE,iniparser,,roken,wind,hx509,asn1,heimbase,hcrypto,krb5,gssapi,heimntlm,hdb,kdc,com_err,compile_et,asn1_compile' '--with-shared-modules=idmap_ad,idmap_adex,idmap_hash,idmap_ldap,idmap_rid,idmap_tdb2,auth_samba4,vfs_dfs_samba4' --with-cluster-support --with-acl-support --with-ads --enable-pmda --with-automount --without-dmapi --with-dnsupdate --with-iconv --with-ldap --with-pam --with-quotas --with-regedit --with-sendfile-support --with-syslog --with-systemd --systemd-install-services '--with-systemddir=/lib/systemd/system' --with-utmp --with-winbind --enable-avahi --enable-cups --enable-iprint Checking for program gcc or cc : i686-pld-linux-gcc Checking for program cpp : /usr/bin/cpp Checking for program ar : /usr/bin/ar Checking for program ranlib : /usr/bin/ranlib Checking for gcc : ok Checking for program git : not found Check for -MD : yes Checking for program gdb : /usr/bin/gdb Checking for header sys/utsname.h : yes Checking uname sysname type : Linux Checking uname machine type : i686 Checking uname release type : 4.9.135-1 Checking uname version type : #1 SMP Thu Oct 25 22:34:13 CEST 2018 Checking for header stdio.h : yes Checking simple C program : ok Checking compiler accepts ['-Werror'] : yes Checking linker accepts ['-Wl,-rpath,.'] : yes Checking for rpath library support : ok Checking for -Wl,--version-script support : ok Checking compiler accepts ['-fvisibility=hidden', '-Werror'] : yes Checking for HAVE_VISIBILITY_ATTR : ok Checking for library constructor support : ok Checking for library destructor support : ok Checking for __attribute__ : ok Checking compiler accepts ['-fPIC'] : yes Checking for inline : inline Checking for program pkg-config : /usr/bin/pkg-config Checking for pkg-config version >= 0.0.0 : yes Checking compiler accepts [''] : yes Checking for header sys/types.h : yes Checking for header sys/stat.h : yes Checking for header stdlib.h : yes Checking for header stddef.h : yes Checking for header memory.h : yes Checking for header string.h : yes Checking for header strings.h : yes Checking for header inttypes.h : yes Checking for header stdint.h : yes Checking for header unistd.h : yes Checking for header minix/config.h : no Checking for header ctype.h : yes Checking for header standards.h : no Checking for header stdbool.h : yes Checking for header stdarg.h : yes Checking for header vararg.h : no Checking for header limits.h : yes Checking for header assert.h : yes Checking getconf LFS_CFLAGS : -D_LARGEFILE_SOURCE -D_FILE_OFFSET_BITS=64 Checking getconf large file support flags work : ok Checking for large file support without additional flags : ok Checking for header sys/time.h : yes Checking for header time.h : yes Checking for header endian.h : yes Checking for header sys/endian.h : no Checking for HAVE_LITTLE_ENDIAN : ok Checking for HAVE_BIG_ENDIAN : not found Checking for header signal.h : yes Checking if signal handlers return int : not found Checking for variable __FUNCTION__ : ok Checking for va_copy : ok Checking for HAVE__VA_ARGS__MACRO : ok Checking for header linux/types.h : yes Checking for header crypt.h : yes Checking for header locale.h : yes Checking for header acl/libacl.h : yes Checking for header compat.h : no Checking for header attr/xattr.h : no Checking for header dustat.h : no Checking for header fcntl.h : yes Checking for header fnmatch.h : yes Checking for header glob.h : yes Checking for header history.h : no Checking for header krb5.h : yes Checking for header langinfo.h : yes Checking for header libaio.h : yes Checking for header ndir.h : no Checking for header pwd.h : yes Checking for header shadow.h : yes Checking for header sys/acl.h : yes Checking for header sys/attributes.h : no Checking for header attr/attributes.h : yes Checking for header sys/capability.h : yes Checking for header sys/dir.h : yes Checking for header sys/epoll.h : yes Checking for header port.h : no Checking for header sys/fcntl.h : yes Checking for header sys/filio.h : no Checking for header sys/filsys.h : no Checking for header sys/fs/s5param.h : no Checking for header sys/fs/vx/quota.h : no Checking for header sys/id.h : no Checking for header sys/ioctl.h : yes Checking for header sys/ipc.h : yes Checking for header sys/mman.h : yes Checking for header sys/mode.h : no Checking for header sys/ndir.h : no Checking for header sys/priv.h : no Checking for header sys/resource.h : yes Checking for header sys/security.h : no Checking for header sys/shm.h : yes Checking for header sys/statfs.h : yes Checking for header sys/statvfs.h : yes Checking for header sys/termio.h : no Checking for header sys/vfs.h : yes Checking for header sys/xattr.h : yes Checking for header termio.h : yes Checking for header termios.h : yes Checking for header sys/file.h : yes Checking for header sys/ucontext.h : yes Checking for header sys/wait.h : yes Checking for declaration of malloc : ok Checking for header grp.h : yes Checking for header sys/select.h : yes Checking for header setjmp.h : yes Checking for header utime.h : yes Checking for header sys/syslog.h : yes Checking for header syslog.h : yes Checking for header sys/mount.h : yes Checking for header mntent.h : yes Checking for header stropts.h : yes Checking for header unix.h : no Checking for header sys/param.h : yes Checking for header sys/socket.h : yes Checking for header netinet/in.h : yes Checking for header netdb.h : yes Checking for header arpa/inet.h : yes Checking for header netinet/in_systm.h : yes Checking for header netinet/ip.h : yes Checking for header netinet/tcp.h : yes Checking for header netinet/in_ip.h : no Checking for header sys/sockio.h : no Checking for header sys/un.h : yes Checking for header sys/uio.h : yes Checking for header ifaddrs.h : yes Checking for header direct.h : no Checking for header dirent.h : yes Checking for header windows.h : no Checking for header winsock2.h : no Checking for header ws2tcpip.h : no Checking for header errno.h : yes Checking for header getopt.h : yes Checking for header iconv.h : yes Checking for header nss.h : yes Checking for header sasl/sasl.h : yes Checking for inotify_init : ok Checking for header security/pam_appl.h : yes Checking for header zlib.h : yes Checking for header asm/unistd.h : yes Checking for header aio.h : yes Checking for header sys/unistd.h : yes Checking for header alloca.h : yes Checking for header float.h : yes Checking for header rpc/rpc.h : yes Checking for header rpc/nettype.h : no Checking for tirpc rpc headers in default system path : not found Checking for header rpcsvc/yp_prot.h : yes Checking for header rpcsvc/nis.h : yes Checking for header rpcsvc/ypclnt.h : yes Checking for header sys/sysctl.h : yes Checking for header sys/fileio.h : no Checking for header sys/filesys.h : no Checking for header sys/dustat.h : no Checking for header sys/sysmacros.h : yes Checking for header xfs/libxfs.h : no Checking for header netgroup.h : no Checking for header valgrind.h : no Checking for header valgrind/valgrind.h : yes Checking for header valgrind/memcheck.h : yes Checking for header nss_common.h : no Checking for header nsswitch.h : no Checking for header ns_api.h : no Checking for header sys/extattr.h : no Checking for header sys/ea.h : no Checking for header sys/proplist.h : no Checking for header sys/cdefs.h : yes Checking for header utmp.h : yes Checking for header utmpx.h : yes Checking for header lastlog.h : yes Checking for header syscall.h : yes Checking for header sys/syscall.h : yes Checking for header sys/atomic.h : no Checking for header libgen.h : yes Checking compiler accepts -Wno-format-truncation : yes Checking compiler accepts -Wno-unused-function : yes Checking compiler accepts -Wno-strict-overflow : yes Checking for header sys/prctl.h : yes Checking for prctl syscall : ok Checking for O_DIRECT flag to open(2) : ok Checking for long long : ok Checking for intptr_t : ok Checking for uintptr_t : ok Checking for ptrdiff_t : ok Checking for comparison_fn_t : ok Checking for _Bool : ok Checking for bool : ok Checking for int8_t : ok Checking for uint8_t : ok Checking for int16_t : ok Checking for uint16_t : ok Checking for int32_t : ok Checking for uint32_t : ok Checking for int64_t : ok Checking for uint64_t : ok Checking for size_t : ok Checking for ssize_t : ok Checking for ino_t : ok Checking for loff_t : ok Checking for offset_t : not found Checking for volatile int : ok Checking for uint_t : not found Checking for blksize_t : ok Checking for blkcnt_t : ok Checking if size of bool == 1 : ok Checking if size of char == 1 : ok Checking if size of int == 1 : not found Checking if size of int == 2 : not found Checking if size of int == 4 : ok Checking if size of long long == 1 : not found Checking if size of long long == 2 : not found Checking if size of long long == 4 : not found Checking if size of long long == 8 : ok Checking if size of long == 1 : not found Checking if size of long == 2 : not found Checking if size of long == 4 : ok Checking if size of short == 1 : not found Checking if size of short == 2 : ok Checking if size of size_t == 1 : not found Checking if size of size_t == 2 : not found Checking if size of size_t == 4 : ok Checking if size of ssize_t == 1 : not found Checking if size of ssize_t == 2 : not found Checking if size of ssize_t == 4 : ok Checking if size of int8_t == 1 : ok Checking if size of uint8_t == 1 : ok Checking if size of int16_t == 1 : not found Checking if size of int16_t == 2 : ok Checking if size of uint16_t == 1 : not found Checking if size of uint16_t == 2 : ok Checking if size of int32_t == 1 : not found Checking if size of int32_t == 2 : not found Checking if size of int32_t == 4 : ok Checking if size of uint32_t == 1 : not found Checking if size of uint32_t == 2 : not found Checking if size of uint32_t == 4 : ok Checking if size of int64_t == 1 : not found Checking if size of int64_t == 2 : not found Checking if size of int64_t == 4 : not found Checking if size of int64_t == 8 : ok Checking if size of uint64_t == 1 : not found Checking if size of uint64_t == 2 : not found Checking if size of uint64_t == 4 : not found Checking if size of uint64_t == 8 : ok Checking if size of void* == 1 : not found Checking if size of void* == 2 : not found Checking if size of void* == 4 : ok Checking if size of off_t == 1 : not found Checking if size of off_t == 2 : not found Checking if size of off_t == 4 : not found Checking if size of off_t == 8 : ok Checking if size of dev_t == 1 : not found Checking if size of dev_t == 2 : not found Checking if size of dev_t == 4 : not found Checking if size of dev_t == 8 : ok Checking if size of ino_t == 1 : not found Checking if size of ino_t == 2 : not found Checking if size of ino_t == 4 : not found Checking if size of ino_t == 8 : ok Checking if size of time_t == 1 : not found Checking if size of time_t == 2 : not found Checking if size of time_t == 4 : ok Checking for socklen_t : ok Checking for struct ifaddrs : ok Checking for struct addrinfo : ok Checking for struct sockaddr : ok Checking for HAVE_STRUCT_SOCKADDR_IN6 : ok Checking for struct sockaddr_storage : ok Checking for sa_family_t : ok Checking for sig_atomic_t : ok Checking for sigsetmask : ok Checking for siggetmask : ok Checking for sigprocmask : ok Checking for sigblock : ok Checking for sigaction : ok Checking for sigset : ok Checking for inet_ntoa : ok Checking for inet_aton : ok Checking for inet_ntop : ok Checking for inet_pton : ok Checking for connect : ok Checking for gethostbyname : ok Checking for getaddrinfo : ok Checking for getnameinfo : ok Checking for freeaddrinfo : ok Checking for gai_strerror : ok Checking for socketpair : ok Checking for variable IPV6_V6ONLY : ok Checking for header net/if.h : yes Checking for HAVE_IPV6 : ok Checking whether we have ucontext_t : ok Checking for __sync_fetch_and_add compiler builtin : ok Checking for atomic_add_32 compiler builtin : not found Checking for fallthrough attribute : ok Checking for strdup : ok Checking for memmem : ok Checking for printf : ok Checking for memset : ok Checking for memcpy : ok Checking for memmove : ok Checking for strcpy : ok Checking for strncpy : ok Checking for bzero : ok Checking for shl_load : not found Checking for shl_unload : not found Checking for shl_findsym : not found Checking for pipe : ok Checking for strftime : ok Checking for srandom : ok Checking for random : ok Checking for srand : ok Checking for rand : ok Checking for usleep : ok Checking for setbuffer : ok Checking for lstat : ok Checking for getpgrp : ok Checking for utime : ok Checking for utimes : ok Checking for setuid : ok Checking for seteuid : ok Checking for setreuid : ok Checking for setresuid : ok Checking for setgid : ok Checking for setegid : ok Checking for setregid : ok Checking for setresgid : ok Checking for chroot : ok Checking for strerror : ok Checking for vsyslog : ok Checking for setlinebuf : ok Checking for mktime : ok Checking for ftruncate : ok Checking for chsize : not found Checking for rename : ok Checking for waitpid : ok Checking for wait4 : ok Checking for initgroups : ok Checking for pread : ok Checking for pwrite : ok Checking for strndup : ok Checking for strcasestr : ok Checking for strsep : ok Checking for strtok_r : ok Checking for mkdtemp : ok Checking for dup2 : ok Checking for dprintf : ok Checking for vdprintf : ok Checking for isatty : ok Checking for chown : ok Checking for lchown : ok Checking for link : ok Checking for readlink : ok Checking for symlink : ok Checking for realpath : ok Checking for snprintf : ok Checking for vsnprintf : ok Checking for asprintf : ok Checking for vasprintf : ok Checking for setenv : ok Checking for unsetenv : ok Checking for strnlen : ok Checking for strtoull : ok Checking for __strtoull : not found Checking for strtouq : ok Checking for strtoll : ok Checking for __strtoll : not found Checking for strtoq : ok Checking for memalign : ok Checking for posix_memalign : ok Checking for header malloc.h : yes Checking for declaration of memalign : ok Checking for posix_fallocate-capable libc : ok Checking for posix_fallocate : ok Checking for prctl : ok Checking for dirname : ok Checking for basename : ok Checking whether we can use SO_PEERCRED to get socket credentials : ok Checking correct behavior of strtoll : not found Checking for if_nametoindex : ok Checking for strerror_r : ok Checking for getdirentries : ok Checking for getdents : not found Checking for syslog : ok Checking for gai_strerror : ok Checking for get_current_dir_name : ok Checking for timegm : ok Checking for getifaddrs : ok Checking for freeifaddrs : ok Checking for mmap : ok Checking for setgroups : ok Checking for syscall : ok Checking for setsid : ok Checking for getgrent_r : ok Checking for getgrgid_r : ok Checking for getgrnam_r : ok Checking for getgrouplist : ok Checking for getpagesize : ok Checking for getpwent_r : ok Checking for getpwnam_r : ok Checking for getpwuid_r : ok Checking for epoll_create : ok Checking for port_create : not found Checking for getxattr : ok Checking whether xattr interface takes additional options : not found Checking for dlopen : not found Checking for dlsym : not found Checking for dlerror : not found Checking for dlclose : not found Checking for library dl : yes Checking for dlopen : ok Checking for dlsym : ok Checking for dlerror : ok Checking for dlclose : ok Checking for declaration of dlopen : ok Checking C prototype for dlopen : not found Checking for fdatasync : ok Checking for declaration of fdatasync : ok Checking for clock_gettime : ok Checking whether the clock_gettime clock ID CLOCK_MONOTONIC is available : ok Checking whether the clock_gettime clock ID CLOCK_PROCESS_CPUTIME_ID is available : ok Checking whether the clock_gettime clock ID CLOCK_REALTIME is available : ok Checking for struct timespec : ok Checking for header arpa/nameser.h : yes Checking for header resolv.h : yes Checking for res_search : not found Checking for library resolv : yes Checking for res_search : ok Checking for header libintl.h : yes Checking for library intl : not found Checking for declaration of dgettext : ok Checking for declaration of gettext : ok Checking for declaration of bindtextdomain : ok Checking for declaration of textdomain : ok Checking for declaration of bind_textdomain_codeset : ok Checking for bindtextdomain : ok Checking for textdomain : ok Checking for bind_textdomain_codeset : ok Checking for dgettext : ok Checking for gettext : ok Checking for pthread_create : not found Checking for library pthread : yes Checking for pthread_create : ok Checking for pthread_attr_init : ok Checking for pthread_mutexattr_setrobust : ok Checking for declaration of PTHREAD_MUTEX_ROBUST : not found Checking for declaration of PTHREAD_MUTEX_ROBUST (as enum) : ok Checking for pthread_mutex_consistent : ok Checking for crypt : not found Checking for library crypt : yes Checking for crypt : ok Checking for crypt_r : not found Checking for crypt_r : ok Checking for header readline.h : no Checking for header readline/readline.h : yes Checking for header readline/history.h : yes Checking for variable rl_event_hook : ok Checking for declaration of snprintf : ok Checking for declaration of vsnprintf : ok Checking for declaration of asprintf : ok Checking for declaration of vasprintf : ok Checking for declaration of errno : ok Checking for declaration of EWOULDBLOCK : ok Checking for declaration of environ : ok Checking for declaration of getgrent_r : ok Checking for declaration of getpwent_r : ok Checking for declaration of pread : ok Checking for declaration of pwrite : ok Checking for declaration of setenv : ok Checking for declaration of setresgid : ok Checking for declaration of setresuid : ok Checking for eventfd : ok Checking for header poll.h : yes Checking for poll : ok Checking for strptime : ok Checking for declaration of strptime : ok Checking for working strptime : ok Checking for declaration of gettimeofday : ok Checking C prototype for gettimeofday : ok Checking C prototype for gettimeofday : not found Checking for C99 vsnprintf : ok Checking for HAVE_SHARED_MMAP : ok Checking for HAVE_MREMAP : ok Checking for HAVE_INCOHERENT_MMAP : not found Checking for HAVE_IMMEDIATE_STRUCTURES : ok Checking for HAVE_MKDIR_MODE : ok Checking for member st_mtim.tv_nsec in struct stat : ok Checking for member st_rdev in struct stat : ok Checking for member st_rdev in struct stat : ok Checking for member ss_family in struct sockaddr_storage : ok Checking for member __ss_family in struct sockaddr_storage : not found Checking for member sa_len in struct sockaddr : not found Checking for member sin_len in struct sockaddr_in : not found Checking for member sin6_len in struct sockaddr_in6 : not found Checking for HAVE_UNIXSOCKET : ok Checking for HAVE_SECURE_MKSTEMP : ok Checking for HAVE_IFACE_GETIFADDRS : ok Checking for declaration of getpwent_r : ok Checking C prototype for getpwent_r : not found Checking for declaration of getgrent_r : ok Checking C prototype for getgrent_r : not found Checking C prototype for getpwent_r : not found Checking C prototype for getgrent_r : not found Checking for strerror_r : ok Checking for XSI (rather than GNU) prototype for strerror_r : not found Checking for HAVE_FUSE_FUSE_LOWLEVEL_H : ok Checking for library fuse : yes Checking for fuse_mount : ok Checking for program perl : /usr/bin/perl Checking for program perl : /usr/bin/perl Checking for program perl : /usr/bin/perl Checking for perl 5.0.0 : ok 5.28.0 Checking for perl $Config{vendorprefix}: : '/usr' Checking for perl $Config{vendorarch}: : '/usr/lib/perl5/vendor_perl/5.28.0/i686-pld-linux-thread-multi' PERL_ARCH_INSTALL_DIR: : '/usr/lib/perl5/vendor_perl/5.28.0/i686-pld-linux-thread-multi' Checking for perl $Config{vendorlib}: : '/usr/share/perl5/vendor_perl' PERL_LIB_INSTALL_DIR: : '/usr/share/perl5/vendor_perl' PERL_INC: : ['/usr/local/lib/perl5/5.28.0/i686-pld-linux-thread-multi', '/usr/local/share/perl5', '/usr/lib/perl5/vendor_perl/5.28.0/i686-pld-linux-thread-multi', '/usr/share/perl5/vendor_perl', '/usr/lib/perl5/5.28.0/i686-pld-linux-thread-multi', '/usr/share/perl5/5.28.0'] Checking for program xsltproc : /usr/bin/xsltproc Checking for program python : /usr/bin/python Checking for program python : /usr/bin/python Checking for program python : /usr/bin/python Checking for Python version >= 2.6.0 : ok 2.7.15 Checking for library python2.7 : yes Checking for program python2.7-config : /usr/bin/python2.7-config Checking for custom code : yes Dynconfig[STATEDIR]: : '/var/lib/samba' Dynconfig[SCRIPTSBINDIR]: : '/usr/sbin' Dynconfig[PAMMODULESDIR]: : '/lib/security' Dynconfig[WINBINDD_SOCKET_DIR]: : '/var/run/samba/winbindd' Dynconfig[PRIVATE_DIR]: : '/etc/samba' Dynconfig[LMHOSTSFILE]: : '/etc/samba/lmhosts' Dynconfig[SETUPDIR]: : '/usr/share/samba/setup' Dynconfig[PIDDIR]: : '/var/run/samba' Dynconfig[PKGCONFIGDIR]: : '/usr/lib/pkgconfig' Dynconfig[DATADIR]: : '/usr/share' Dynconfig[CACHEDIR]: : '/var/cache/samba' Dynconfig[SBINDIR]: : '/usr/sbin' Dynconfig[NCALRPCDIR]: : '/var/run/samba/ncalrpc' Dynconfig[BINDDNS_DIR]: : '/var/lib/samba/bind-dns' Dynconfig[LOCKDIR]: : '/var/lib/samba' Dynconfig[PYTHONARCHDIR]: : '/usr/lib/python2.7/site-packages' Dynconfig[PERL_LIB_INSTALL_DIR]: : '/usr/share/perl5/vendor_perl' Dynconfig[LOGFILEBASE]: : '/var/log/samba' Dynconfig[PYTHONDIR]: : '/usr/share/python2.7/site-packages' Dynconfig[PERL_ARCH_INSTALL_DIR]: : '/usr/lib/perl5/vendor_perl/5.28.0/i686-pld-linux-thread-multi' Dynconfig[NTP_SIGND_SOCKET_DIR]: : '/var/lib/samba/ntp_signd' Dynconfig[CONFIGFILE]: : '/etc/samba/smb.conf' Dynconfig[SOCKET_DIR]: : '/var/run/samba' Dynconfig[MODULESDIR]: : '/usr/lib/samba' Dynconfig[LIBDIR]: : '/usr/lib' Dynconfig[LOCALEDIR]: : '/usr/share/locale' Dynconfig[NMBDSOCKETDIR]: : '/var/run/samba/nmbd' Dynconfig[INCLUDEDIR]: : '/usr/include/samba-4.0' Dynconfig[CODEPAGEDIR]: : '/usr/share/samba/codepages' Dynconfig[PRIVATELIBDIR]: : '/usr/lib/samba' Dynconfig[PRIVILEGED_SOCKET_DIR]: : '/var/lib/samba' Dynconfig[LIBEXECDIR]: : '/usr/libexec' Dynconfig[SMB_PASSWD_FILE]: : '/etc/samba/smbpasswd' Dynconfig[BINDIR]: : '/usr/bin' Dynconfig[CONFIGDIR]: : '/etc/samba' Checking for third party Python module dns.resolver : system Checking for longjmp : yes Checking for siglongjmp : yes Checking for system cmocka (>=1.1.1) : yes Checking for stpcpy : yes Checking for system popt : yes Checking for header popt.h : yes Checking for library popt : yes Checking for poptGetContext : yes Checking for system z (>=1.2.3) : yes Checking for library z : yes Checking for zlibVersion : yes Checking for system z (>=1.2.3) : yes Checking for system tdb (>=1.3.16) : yes Checking for Python version >= 2.4.2 : ok 2.7.15 Checking for Python version >= 2.4.2 : ok 2.7.15 Checking for python headers : using cache Checking linker accepts -Wl,-no-undefined : yes Checking linker accepts ['-undefined', 'dynamic_lookup'] : no Checking for header sys/auxv.h : yes Checking for getauxval : yes Checking linker accepts -Wl,-no-undefined : yes Checking linker accepts ['-undefined', 'dynamic_lookup'] : no Checking for Python version >= 2.4.2 : ok 2.7.15 Checking for python headers : using cache Checking for system talloc (>=2.1.14) : yes Checking for system pytalloc-util (>=2.1.14) : yes Checking for system tevent (>=0.9.37) : yes Checking value of NSIG : yes Checking value of _NSIG : yes Checking value of SIGRTMAX : yes Checking value of SIGRTMIN : yes Checking for program python : /usr/bin/python Checking for Python version >= 2.4.2 : ok 2.7.15 Checking for python headers : using cache Checking linker accepts -Wl,-no-undefined : yes Checking linker accepts ['-undefined', 'dynamic_lookup'] : no Checking for program python : /usr/bin/python Checking for program xsltproc : /usr/bin/xsltproc Checking for Python version >= 2.4.2 : ok 2.7.15 Checking for python headers : using cache Checking for system pyldb-util (>=1.4.3 <=1.4.999) : yes Checking for system ldb (>=1.4.3 <=1.4.999) : yes Checking for a 64-bit host to support lmdb : no --without-ldb-lmdb implied as this host is not 64-bit Checking linker accepts -Wl,-no-undefined : yes Checking linker accepts ['-undefined', 'dynamic_lookup'] : no Checking linker accepts ['-Wl,--wrap=test'] : yes Checking for u_char : yes Checking for u_int32_t : yes Checking for header err.h : yes Checking for header sys/bswap.h : no Checking for header sys/stropts.h : yes Checking for header sys/timeb.h : yes Checking for header sys/times.h : yes Checking for header timezone.h : no Checking for header ttyname.h : no Checking for header netinet/in6.h : no Checking for header netinet6/in6.h : no Checking for header curses.h : yes Checking for header term.h : yes Checking for header termcap.h : yes Checking for atexit : yes Checking for cgetent : no Checking for macro cgetent : no Checking for getprogname : no Checking for macro getprogname : no Checking for setprogname : no Checking for macro setprogname : no Checking for gethostname : yes Checking for putenv : yes Checking for rcmd : yes Checking for readv : yes Checking for sendmsg : yes Checking for setitimer : yes Checking for strlwr : no Checking for macro strlwr : no Checking for strncasecmp : yes Checking for strsep_copy : no Checking for macro strsep_copy : no Checking for strupr : no Checking for macro strupr : no Checking for swab : yes Checking for umask : yes Checking for uname : yes Checking for closefrom : no Checking for macro closefrom : no Checking for err : yes Checking for warn : yes Checking for errx : yes Checking for warnx : yes Checking for flock : yes Checking for writev : yes Checking for hstrerror : yes Checking for socket : yes Checking for getipnodebyname : no Checking for macro getipnodebyname : no Checking for gethostent : yes Checking for gethostent_r : yes Checking for sethostent : yes Checking for endhostent : yes Checking for getipnodebyaddr : no Checking for macro getipnodebyaddr : no Checking for freehostent : no Checking for macro freehostent : no Checking for gethostbyname_r : yes Checking for gethostbyaddr : yes Checking for library socket : not found Checking for library nsl : yes Checking for getipnodebyname : no Checking for macro getipnodebyname : no Checking for getipnodebyaddr : no Checking for macro getipnodebyaddr : no Checking for freehostent : no Checking for macro freehostent : no Checking for iruserok : yes Checking for bswap16 : no Checking for macro bswap16 : no Checking for bswap32 : no Checking for macro bswap32 : no Checking for header sys/termios.h : yes Checking for struct winsize : yes Checking for member ws_xpixel in struct winsize : yes Checking for member ws_ypixel in struct winsize : yes Checking for variable h_errno : yes Checking for declaration of h_errno : yes Checking for header dns.h : no Checking for res_nsearch : no Checking for macro res_nsearch : no Checking for res_ndestroy : no Checking for macro res_ndestroy : no Checking for dns_search : no Checking for macro dns_search : no Checking for dn_expand : no Checking for macro dn_expand : no Checking for header dns.h : no Checking for res_nsearch : no Checking for header dns.h : no Checking for header dns.h : no Checking for macro res_nsearch : yes Checking for header dns.h : no Checking for res_ndestroy : no Checking for header dns.h : no Checking for header dns.h : no Checking for macro res_ndestroy : no Checking for header dns.h : no Checking for dns_search : no Checking for header dns.h : no Checking for header dns.h : no Checking for macro dns_search : no Checking for header dns.h : no Checking for dn_expand : yes Checking for variable _res : yes Checking for declaration of _res : yes Checking for dirfd : yes Checking for declaration of dirfd : yes Checking for member dd_fd in DIR : no Using in-tree heimdal kerberos defines Checking for program krb5-config.heimdal : not found Checking for program krb5-config : /usr/bin/krb5-config Checking for jansson : yes Checking for library jansson : yes Checking for json_object : yes Checking for gnutls >= 3.4.7 : yes Checking for library gnutls : yes Checking for header gnutls/gnutls.h : yes Checking for gnutls_global_init : yes Checking for gnutls_certificate_verify_peers3 : yes Checking for header gnutls/x509.h : yes Checking for declaration of GNUTLS_CERT_EXPIRED : no Checking for declaration of GNUTLS_CERT_EXPIRED (as enum) : yes Checking for declaration of GNUTLS_CERT_NOT_ACTIVATED : no Checking for declaration of GNUTLS_CERT_NOT_ACTIVATED (as enum) : yes Checking for declaration of GNUTLS_CERT_UNEXPECTED_OWNER : no Checking for declaration of GNUTLS_CERT_UNEXPECTED_OWNER (as enum) : yes Checking for variable gnutls_x509_crt_set_version : yes Checking for variable gnutls_x509_crt_set_subject_key_id : yes Checking for gnutls_datum : yes Checking for gnutls_datum_t : yes Checking for library gcrypt : yes Checking for header gcrypt.h : yes Checking for gcry_control : yes Checking for library gpg-error : yes Checking for gpg_err_code_from_errno : yes Checking for gnutls_aead_cipher_init : yes Checking for program gpgme-config : /usr/bin/gpgme-config Checking for gpgme support : yes Checking for library gpgme : yes Checking for header gpgme.h : no Checking for gpgme_new : yes Checking for header linux/fcntl.h : yes Checking for declaration of F_SETLEASE : yes Checking for declaration of SA_SIGINFO : yes Checking for header execinfo.h : yes Checking for backtrace : yes Checking for backtrace_symbols : yes Checking for header libunwind.h : yes Checking for member f_frsize in struct statvfs : yes Checking for statvfs (SVR4) : yes Checking for *bsd style statfs with statfs.f_iosize : no Checking if f_fsid is an integer : yes Checking whether statvfs.f_flag exists : yes Checking whether statvfs.f_flags exists : no Checking for libsystemd-daemon : not found Checking for libsystemd-journal : not found Checking for libsystemd : yes Checking for library systemd : yes Checking for lttng-ust : yes Checking for header lttng/tracef.h : yes Checking for library lttng-ust : yes Checking for header gpfs.h : no Checking for library iconv : no Checking for library iconv : not found Checking for iconv_open : yes Checking errno of iconv for illegal multibyte sequence : yes Checking for pam_start : no Checking for macro pam_start : no Checking for library pam : yes Checking for pam_start : yes Checking for header security/pam_modules.h : yes Checking for header pam/pam_modules.h : no Checking for header nss_dbdefs.h : no Checking for member ipnode.af_family in union nss_XbyY_key : no Checking for member pw_comment in struct passwd : no Checking for member pw_age in struct passwd : no Checking for library ncurses : yes Checking for tgetent : yes for compiling <readline/readline.h> with strict prototypes : no for workaround to <readline/readline.h> strict prototypes issue : no Checking for rl_completion_t : no Checking for CPPFunction : yes Checking for library readline : yes Checking for rl_completion_matches : yes Checking for history_list : yes Checking for header bsd/md5.h : yes Checking for MD5Init : no Checking for macro MD5Init : no Checking for library bsd : yes Checking for MD5Init : yes Checking for header CommonCrypto/CommonDigest.h : no Checking for CC_MD5_Init : no Checking for macro CC_MD5_Init : no Checking for header CommonCrypto/CommonDigest.h : no Checking for CC_MD5_Init : no Checking for header CommonCrypto/CommonDigest.h : no Checking for header CommonCrypto/CommonDigest.h : no Checking for macro CC_MD5_Init : no Checking for SHA1_Update : no Checking for macro SHA1_Update : no Checking for SHA256_Update : no Checking for macro SHA256_Update : no Checking for SHA512_Update : no Checking for macro SHA512_Update : no Checking for perl module Parse::Yapp::Driver 1.05 : ok perl manpage generation : ok perl man1 extension : 1p perl man3 extension : 3pm Checking for program yapp : /usr/bin/yapp Checking for program pod2man : /usr/bin/pod2man Checking linker accepts -Wl,--export-dynamic : yes Checking for header linux/falloc.h : yes Checking for header linux/ioctl.h : yes Checking for getcwd : yes Checking for fchown : yes Checking for chmod : yes Checking for fchmod : yes Checking for mknod : yes Checking for strtol : yes Checking for strchr : yes Checking for strupr : no Checking for macro strupr : no Checking for chflags : no Checking for macro chflags : no Checking for getrlimit : yes Checking for fsync : yes Checking for setpgid : yes Checking for glob : yes Checking for strpbrk : yes Checking for crypt16 : no Checking for macro crypt16 : no Checking for getauthuid : no Checking for macro getauthuid : no Checking for innetgr : yes Checking for select : yes Checking for rdchk : no Checking for macro rdchk : no Checking for getgrnam : yes Checking for getgrent : yes Checking for pathconf : yes Checking for setpriv : no Checking for macro setpriv : no Checking for setgidx : no Checking for macro setgidx : no Checking for setuidx : no Checking for macro setuidx : no Checking for sysconf : yes Checking for grantpt : yes Checking for posix_openpt : yes Checking for fallocate : yes Checking for fseeko : yes Checking for setluid : no Checking for macro setluid : no Checking for getpwnam : yes Checking for fdopendir : yes Checking for fstatat : yes Checking for clearenv : yes Checking for strcasecmp : yes Checking for fcvt : yes Checking for fcvtl : no Checking for macro fcvtl : no Checking for setlocale : yes Checking for library rt : yes Checking for nanosleep : yes Checking for lutimes : yes Checking for futimes : yes Checking for utimensat : yes Checking for futimens : yes Checking for mlock : yes Checking for munlock : yes Checking for mlockall : yes Checking for munlockall : yes Checking for shmget : yes Checking for shm_open : no Checking for macro shm_open : no Checking for shm_open : yes Checking for yp_get_default_domain : yes Checking for _dn_expand : no Checking for macro _dn_expand : no Checking for __dn_expand : yes Checking for declaration of fdatasync : yes Checking for declaration of readahead : yes Checking for HAVE_LINUX_SPLICE : yes Checking for declaration of splice : yes Checking for kernel change notify support : yes Checking for Linux kernel oplocks : yes Checking for IRIX kernel oplock types : no Checking for kernel share modes : yes Checking for header fam.h : yes Checking for library fam : yes Checking for FAMOpen2 : yes Checking whether enum FAMCodes is available : yes Checking for FAMNoExists : yes Checking for libarchive existence Checking for header archive.h : yes Checking for library archive : yes Checking for archive_read_support_filter_all : yes Checking for archive_read_free : yes Building without DMAPI support (--without-dmapi). Checking for member st_blocks in struct stat : yes Checking for member st_blksize in struct stat : yes Checking for member st_flags in struct stat : no Checking for header replace.h : no Checking whether blkcnt_t is 32 bit : no Checking whether blkcnt_t is 64 bit : yes Checking for library cap : yes Checking for cap_get_proc : yes Checking whether POSIX capabilities are available : yes Checking for broken nisplus include files : yes Checking if the compiler will optimize out functions : yes Checking for LL suffix on long long integers : yes Checking for _acl : no Checking for macro _acl : no Checking for __acl : no Checking for macro __acl : no Checking for _chdir : no Checking for macro _chdir : no Checking for __chdir : no Checking for macro __chdir : no Checking for chflags : no Checking for macro chflags : no Checking for _close : no Checking for macro _close : no Checking for __close : yes Checking for _closedir : no Checking for macro _closedir : no Checking for __closedir : no Checking for macro __closedir : no Checking for crypt16 : no Checking for macro crypt16 : no Checking for devnm : no Checking for macro devnm : no Checking for DNSServiceRegister : no Checking for macro DNSServiceRegister : no Checking for _dup : no Checking for macro _dup : no Checking for __dup : no Checking for macro __dup : no Checking for _dup2 : no Checking for macro _dup2 : no Checking for __dup2 : yes Checking for endmntent : yes Checking for execl : yes Checking for _facl : no Checking for macro _facl : no Checking for __facl : no Checking for macro __facl : no Checking for _fchdir : no Checking for macro _fchdir : no Checking for __fchdir : no Checking for macro __fchdir : no Checking for _fcntl : no Checking for macro _fcntl : no Checking for __fcntl : yes Checking for fcvtl : no Checking for macro fcvtl : no Checking for _fork : no Checking for macro _fork : no Checking for __fork : yes Checking for _fstat : no Checking for macro _fstat : no Checking for __fstat : yes Checking for __fxstat : yes Checking for getauthuid : no Checking for macro getauthuid : no Checking for _getcwd : no Checking for macro _getcwd : no Checking for __getcwd : no Checking for macro __getcwd : no Checking for getdents : no Checking for macro getdents : no Checking for __getdents : no Checking for macro __getdents : no Checking for getgrset : no Checking for macro getgrset : no Checking for getmntent : yes Checking for getpwanam : no Checking for macro getpwanam : no Checking for llseek : no Checking for macro llseek : no Checking for _llseek : no Checking for macro _llseek : no Checking for __llseek : no Checking for macro __llseek : no Checking for _lseek : no Checking for macro _lseek : no Checking for __lseek : yes Checking for _lstat : no Checking for macro _lstat : no Checking for __lstat : yes Checking for __lxstat : yes Checking for _open : no Checking for macro _open : no Checking for __open : yes Checking for _opendir : no Checking for macro _opendir : no Checking for __opendir : no Checking for macro __opendir : no Checking for _pread : no Checking for macro _pread : no Checking for __pread : no Checking for macro __pread : no Checking for _pwrite : no Checking for macro _pwrite : no Checking for __pwrite : no Checking for macro __pwrite : no Checking for rdchk : no Checking for macro rdchk : no Checking for _read : no Checking for macro _read : no Checking for __read : yes Checking for _readdir : no Checking for macro _readdir : no Checking for __readdir : no Checking for macro __readdir : no Checking for _seekdir : no Checking for macro _seekdir : no Checking for __seekdir : no Checking for macro __seekdir : no Checking for setgidx : no Checking for macro setgidx : no Checking for setluid : no Checking for macro setluid : no Checking for setmntent : yes Checking for setpriv : no Checking for macro setpriv : no Checking for setuidx : no Checking for macro setuidx : no Checking for _stat : no Checking for macro _stat : no Checking for __stat : yes Checking for statvfs : yes Checking for strsignal : yes Checking for strupr : no Checking for macro strupr : no Checking for sysctl : yes Checking for sysctlbyname : no Checking for macro sysctlbyname : no Checking for __sys_llseek : no Checking for macro __sys_llseek : no Checking for _telldir : no Checking for macro _telldir : no Checking for __telldir : no Checking for macro __telldir : no Checking for _write : no Checking for macro _write : no Checking for __write : yes Checking for __xstat : yes Checking if can we convert from CP850 to UCS-2LE : yes Checking if can we convert from UTF-8 to UCS-2LE : yes building on linux2 Checking for library acl : yes Checking for acl_get_file : yes Checking for POSIX ACL support : yes Checking whether acl_get_perm_np() is available : no Checking for variable ACL_EVERYONE : no vfs_fileid checking for statfs() and struct statfs.f_fsid : yes Checking whether the Linux 'fallocate' function is available : yes Checking whether Linux 'fallocate' supports hole-punching : yes Checking whether lseek supports hole/data seeking : yes Checking whether Linux readahead is available : yes Checking for declaration of readahead : yes Checking for openat : yes Checking if we can use msg_control for passing file descriptors : yes Checking if we can use msg_accrights for passing file descriptors : no Checking for program awk : /bin/awk Checking for header asm/types.h : yes Checking for major macro : no Checking for minor macro : no Checking for member d_off in struct dirent : yes Checking for program cups-config : /usr/bin/cups-config Checking for /usr/bin/cups-config : yes Checking for header cups/cups.h : yes Checking for header cups/language.h : yes Checking for library cups : yes Checking for httpConnect : yes Checking for httpConnectEncrypt : yes Checking for header ldap.h : yes Checking for header lber.h : yes Checking for header ldap_pvt.h : no Checking for ber_tag_t : yes Checking for library lber : yes Checking for ber_scanf : yes Checking for ber_sockbuf_add_io : yes Checking for variable LDAP_OPT_SOCKBUF : yes Checking for variable LBER_OPT_LOG_PRINT_FN : yes Checking for library ldap : yes Checking for ldap_init : yes Checking for ldap_init_fd : yes Checking for ldap_initialize : yes Checking for ldap_set_rebind_proc : yes Checking for ldap_add_result_entry : yes Checking whether ldap_set_rebind_proc takes 3 arguments : yes Building with Active Directory support. Checking for pututline : yes Checking for pututxline : yes Checking for updwtmp : yes Checking for updwtmpx : yes Checking for getutmpx : yes Checking for getutxent : yes Checking for member ut_name in struct utmp : yes Checking for member ut_user in struct utmp : yes Checking for member ut_id in struct utmp : yes Checking for member ut_host in struct utmp : yes Checking for member ut_time in struct utmp : yes Checking for member ut_tv in struct utmp : yes Checking for member ut_type in struct utmp : yes Checking for member ut_pid in struct utmp : yes Checking for member ut_exit.e_exit in struct utmp : yes Checking for member ut_syslen in struct utmpx : no Checking whether pututline returns pointer : yes Checking if size of ((struct utmp *)NULL)->ut_line == 1 : no Checking if size of ((struct utmp *)NULL)->ut_line == 2 : no Checking if size of ((struct utmp *)NULL)->ut_line == 4 : no Checking if size of ((struct utmp *)NULL)->ut_line == 8 : no Checking if size of ((struct utmp *)NULL)->ut_line == 16 : no Checking if size of ((struct utmp *)NULL)->ut_line == 32 : yes Checking for header avahi-common/watch.h : yes Checking for header avahi-client/client.h : yes Checking for library avahi-client : yes Checking for avahi_client_new : yes Checking for library avahi-common : yes Checking for avahi_strerror : yes Checking for header pam/pam_appl.h : no Checking for pam_get_data : yes Checking for header security/pam_ext.h : yes Checking for header security/_pam_macros.h : yes Checking for header pam/pam_ext.h : no Checking for header pam/_pam_macros.h : no Checking for pam_vsyslog : yes Checking whether PAM_RHOST is available : yes Checking whether PAM_TTY is available : yes Checking whether PAM_RADIO_TYPE is available : yes Checking whether Linux should use 32-bit credential calls : yes Checking whether we can use Linux thread-specific credentials with 32-bit system calls : yes Checking whether Linux netlink is available : yes Checking whether Linux rtnetlink is available : yes Checking whether fcntl locking is available : yes Checking whether fcntl lock supports open file description locks : yes Checking for member st_mtim.tv_nsec in struct stat : yes Checking for member st_mtimensec in struct stat : no Checking for member st_mtimespec.tv_nsec in struct stat : no Checking for member st_mtime_n in struct stat : no Checking for member st_umtime in struct stat : no Checking for member st_birthtime in struct stat : no Checking for member st_birthtimespec.tv_nsec in struct stat : no Checking for member st_birthtimensec in struct stat : no Checking whether posix_fadvise is available : yes Checking whether sysconf(_SC_NGROUPS_MAX) is available : yes Checking whether sysconf(_SC_NPROC_ONLN) is available : no Checking whether sysconf(_SC_NPROCESSORS_ONLN) is available : yes Checking whether sysconf(_SC_PAGESIZE) is available : yes Checking whether to use the Darwin-specific initgroups system call : no Checking whether struct utimbuf is available : yes Checking whether we have the struct sigevent : yes Checking for member sigev_value.sival_ptr in struct sigevent : yes Checking for member sigev_value.sigval_ptr in struct sigevent : no Checking for the maximum value of the 'time_t' type : no Checking whether the macro for makedev is available : no Checking whether the realpath function allows a NULL argument : yes Checking for ftruncate extend : yes Checking for header sys/sendfile.h : yes Checking for linux sendfile support : yes getcwd takes a NULL argument : yes Checking for library gen : not found Checking for getspnam : yes Checking for header sys/fs/vx_quota.h : no Checking for header sys/quota.h : yes Checking for header ufs/ufs/quota.h : no Checking for header xfs/xqm.h : no for XFS QUOTA in <sys/quota.h> : no Checking for member dqb_fsoftlimit in struct dqblk : no Checking for member dqb_curbytes in struct dqblk : no Checking for header rpcsvc/rquota.h : yes Checking for member getquota_rslt_u in struct getquota_rslt : yes Checking for header rpc/types.h : yes Checking for header rpc/nettype.h : no Checking for header rpc/xdr.h : yes Checking for header rpc/nettype.h : no checking for clnt_create() : yes building with cluster support Checking whether seekdir returns void : yes Checking for header linux/fs.h : yes Checking for declaration of FS_IOC_GETFLAGS : yes Checking for declaration of FS_COMPR_FL : yes Checking for header cephfs/libcephfs.h : yes Checking for library cephfs : yes Checking for library ceph-common : no Checking for library ceph-common : not found Checking for ceph_statx : no Checking for macro ceph_statx : no Checking for glusterfs-api >= 4 : yes Checking for header glusterfs/api/glfs.h : yes Checking for library gfapi : yes Checking for glusterfs-api >= 6 : yes Checking for dbus : yes Checking for header dbus/dbus.h : yes Checking for library dbus-1 : yes Looking for ncurses features Checking for program ncurses5-config : not found Checking for program ncurses6-config : /usr/bin/ncurses6-config Checking for /usr/bin/ncurses6-config : yes Checking for header ncurses.h : yes Checking for header menu.h : yes Checking for header panel.h : yes Checking for header form.h : yes Checking for initscr : yes Checking for library menu : yes Checking for set_menu_items : yes Checking for item_count : yes Checking for library panel : yes Checking for new_panel : yes Checking for show_panel : yes Checking for library form : yes Checking for new_field : yes Checking for new_form : yes building regedit Checking for header ftw.h : yes Checking for nftw : yes Checking for library crypto : yes Checking for DES_pcbc_encrypt : yes VFS_STATIC: vfs_default,vfs_posixacl VFS_SHARED: vfs_recycle,vfs_audit,vfs_extd_audit,vfs_full_audit,vfs_netatalk,vfs_fake_perms,vfs_default_quota,vfs_readonly,vfs_cap,vfs_expand_msdfs,vfs_shadow_copy,vfs_shadow_copy2,vfs_readahead,vfs_xattr_tdb,vfs_streams_xattr,vfs_streams_depot,vfs_acl_xattr,vfs_acl_tdb,vfs_preopen,vfs_catia,vfs_media_harmony,vfs_unityed_media,vfs_fruit,vfs_shell_snap,vfs_commit,vfs_worm,vfs_crossrename,vfs_linux_xfs_sgid,vfs_time_audit,vfs_offline,vfs_virusfilter,vfs_posix_eadb,vfs_syncops,vfs_dirsort,vfs_fileid,vfs_aio_fork,vfs_aio_pthread,vfs_btrfs,vfs_ceph,vfs_glusterfs,vfs_snapper,vfs_dfs_samba4 PDB_STATIC: pdb_smbpasswd,pdb_tdbsam,pdb_samba_dsdb,pdb_ldapsam PDB_SHARED: AUTH_STATIC: auth_builtin,auth_sam,auth_winbind,auth_unix AUTH_SHARED: auth_script,auth_samba4 NSS_INFO_STATIC: nss_info_template NSS_INFO_SHARED: CHARSET_STATIC: CHARSET_SHARED: IDMAP_STATIC: idmap_tdb,idmap_passdb,idmap_nss IDMAP_SHARED: idmap_ad,idmap_rfc2307,idmap_autorid,idmap_rid,idmap_hash,idmap_tdb2,idmap_script,idmap_adex,idmap_ldap GPEXT_STATIC: GPEXT_SHARED: PERFCOUNT_STATIC: PERFCOUNT_SHARED: RPC_STATIC: RPC_SHARED: Checking for header pty.h : yes Checking for header util.h : no Checking for header bsd/libutil.h : yes Checking for header libutil.h : no Checking for openpty : no Checking for macro openpty : no Checking for library util : yes Checking for header util.h : no Checking for header libutil.h : no Checking for openpty : yes Checking for header netinet/if_ether.h : yes Checking for header netinet/ip6.h : yes Checking for header netinet/icmp6.h : yes Checking for header linux/if_packet.h : yes Checking for HAVE_AF_PACKET : yes Checking for HAVE_PACKETSOCKET : yes Checking for header sched.h : yes Checking for header procinfo.h : no Checking for sched_setscheduler : yes Checking for variable ETIME : yes Checking for header pcp/pmapi.h : yes Checking for header pcp/impl.h : yes Checking for header pcp/pmda.h : yes Checking for library pcp : yes Checking for pmProgname : yes Checking for library pcp_pmda : yes Checking for pmdaDaemon : yes Checking for __pmID_int : no Building with PMDA support Checking for header linux/sockios.h : yes Checking for header linux/ethtool.h : yes Checking linker accepts -Wl,-no-undefined : yes Checking linker accepts ['-undefined', 'dynamic_lookup'] : no Checking linker accepts -Wl,--as-needed : yes Checking for -lc not needed : ok Checking configure summary : yes Checking compiler for PIE support : yes Checking compiler for full RELRO support : yes Checking if compiler accepts -fstack-protector-strong : yes Checking if compiler accepts -fstack-clash-protection : yes 'configure' finished successfully (1m15.491s) + /usr/bin/make -Otarget -j9 'V=1' WAF_MAKE=1 python ./buildtools/bin/waf build Waf: Entering directory `/tmp/B.zYV1cz/BUILD/samba-4.9.3/bin' symlink: samba/__init__.py -> python/samba/__init__.py symlink: samba/colour.py -> python/samba/colour.py symlink: samba/common.py -> python/samba/common.py symlink: samba/compat.py -> python/samba/compat.py symlink: samba/dbchecker.py -> python/samba/dbchecker.py symlink: samba/descriptor.py -> python/samba/descriptor.py symlink: samba/dnsserver.py -> python/samba/dnsserver.py symlink: samba/domain_update.py -> python/samba/domain_update.py symlink: samba/drs_utils.py -> python/samba/drs_utils.py symlink: samba/emulate/__init__.py -> python/samba/emulate/__init__.py symlink: samba/emulate/traffic.py -> python/samba/emulate/traffic.py symlink: samba/emulate/traffic_packets.py -> python/samba/emulate/traffic_packets.py symlink: samba/forest_update.py -> python/samba/forest_update.py symlink: samba/getopt.py -> python/samba/getopt.py symlink: samba/gp_sec_ext.py -> python/samba/gp_sec_ext.py symlink: samba/gpclass.py -> python/samba/gpclass.py symlink: samba/graph.py -> python/samba/graph.py symlink: samba/hostconfig.py -> python/samba/hostconfig.py symlink: samba/idmap.py -> python/samba/idmap.py symlink: samba/join.py -> python/samba/join.py symlink: samba/kcc/__init__.py -> python/samba/kcc/__init__.py symlink: samba/kcc/debug.py -> python/samba/kcc/debug.py symlink: samba/kcc/graph.py -> python/samba/kcc/graph.py symlink: samba/kcc/graph_utils.py -> python/samba/kcc/graph_utils.py symlink: samba/kcc/kcc_utils.py -> python/samba/kcc/kcc_utils.py symlink: samba/kcc/ldif_import_export.py -> python/samba/kcc/ldif_import_export.py symlink: samba/mdb_util.py -> python/samba/mdb_util.py symlink: samba/ms_display_specifiers.py -> python/samba/ms_display_specifiers.py symlink: samba/ms_forest_updates_markdown.py -> python/samba/ms_forest_updates_markdown.py symlink: samba/ms_schema.py -> python/samba/ms_schema.py symlink: samba/ms_schema_markdown.py -> python/samba/ms_schema_markdown.py symlink: samba/ndr.py -> python/samba/ndr.py symlink: samba/netcmd/__init__.py -> python/samba/netcmd/__init__.py symlink: samba/netcmd/common.py -> python/samba/netcmd/common.py symlink: samba/netcmd/computer.py -> python/samba/netcmd/computer.py symlink: samba/netcmd/dbcheck.py -> python/samba/netcmd/dbcheck.py symlink: samba/netcmd/delegation.py -> python/samba/netcmd/delegation.py symlink: samba/netcmd/dns.py -> python/samba/netcmd/dns.py symlink: samba/netcmd/domain.py -> python/samba/netcmd/domain.py symlink: samba/netcmd/domain_backup.py -> python/samba/netcmd/domain_backup.py symlink: samba/netcmd/drs.py -> python/samba/netcmd/drs.py symlink: samba/netcmd/dsacl.py -> python/samba/netcmd/dsacl.py symlink: samba/netcmd/forest.py -> python/samba/netcmd/forest.py symlink: samba/netcmd/fsmo.py -> python/samba/netcmd/fsmo.py symlink: samba/netcmd/gpo.py -> python/samba/netcmd/gpo.py symlink: samba/netcmd/group.py -> python/samba/netcmd/group.py symlink: samba/netcmd/ldapcmp.py -> python/samba/netcmd/ldapcmp.py symlink: samba/netcmd/main.py -> python/samba/netcmd/main.py symlink: samba/netcmd/nettime.py -> python/samba/netcmd/nettime.py symlink: samba/netcmd/ntacl.py -> python/samba/netcmd/ntacl.py symlink: samba/netcmd/ou.py -> python/samba/netcmd/ou.py symlink: samba/netcmd/processes.py -> python/samba/netcmd/processes.py symlink: samba/netcmd/pso.py -> python/samba/netcmd/pso.py symlink: samba/netcmd/rodc.py -> python/samba/netcmd/rodc.py symlink: samba/netcmd/schema.py -> python/samba/netcmd/schema.py symlink: samba/netcmd/sites.py -> python/samba/netcmd/sites.py symlink: samba/netcmd/spn.py -> python/samba/netcmd/spn.py symlink: samba/netcmd/testparm.py -> python/samba/netcmd/testparm.py symlink: samba/netcmd/user.py -> python/samba/netcmd/user.py symlink: samba/netcmd/visualize.py -> python/samba/netcmd/visualize.py symlink: samba/ntacls.py -> python/samba/ntacls.py symlink: samba/provision/__init__.py -> python/samba/provision/__init__.py symlink: samba/provision/backend.py -> python/samba/provision/backend.py symlink: samba/provision/common.py -> python/samba/provision/common.py symlink: samba/provision/kerberos.py -> python/samba/provision/kerberos.py symlink: samba/provision/kerberos_implementation.py -> python/samba/provision/kerberos_implementation.py symlink: samba/provision/sambadns.py -> python/samba/provision/sambadns.py symlink: samba/remove_dc.py -> python/samba/remove_dc.py symlink: samba/samba3/__init__.py -> python/samba/samba3/__init__.py symlink: samba/samdb.py -> python/samba/samdb.py symlink: samba/schema.py -> python/samba/schema.py symlink: samba/sd_utils.py -> python/samba/sd_utils.py symlink: samba/sites.py -> python/samba/sites.py symlink: samba/subnets.py -> python/samba/subnets.py symlink: samba/subunit/__init__.py -> python/samba/subunit/__init__.py symlink: samba/subunit/run.py -> python/samba/subunit/run.py symlink: samba/tdb_util.py -> python/samba/tdb_util.py symlink: samba/tests/__init__.py -> python/samba/tests/__init__.py symlink: samba/tests/audit_log_base.py -> python/samba/tests/audit_log_base.py symlink: samba/tests/audit_log_dsdb.py -> python/samba/tests/audit_log_dsdb.py symlink: samba/tests/audit_log_pass_change.py -> python/samba/tests/audit_log_pass_change.py symlink: samba/tests/auth.py -> python/samba/tests/auth.py symlink: samba/tests/auth_log.py -> python/samba/tests/auth_log.py symlink: samba/tests/auth_log_base.py -> python/samba/tests/auth_log_base.py symlink: samba/tests/auth_log_ncalrpc.py -> python/samba/tests/auth_log_ncalrpc.py symlink: samba/tests/auth_log_netlogon.py -> python/samba/tests/auth_log_netlogon.py symlink: samba/tests/auth_log_netlogon_bad_creds.py -> python/samba/tests/auth_log_netlogon_bad_creds.py symlink: samba/tests/auth_log_pass_change.py -> python/samba/tests/auth_log_pass_change.py symlink: samba/tests/auth_log_samlogon.py -> python/samba/tests/auth_log_samlogon.py symlink: samba/tests/blackbox/__init__.py -> python/samba/tests/blackbox/__init__.py symlink: samba/tests/blackbox/bug13653.py -> python/samba/tests/blackbox/bug13653.py symlink: samba/tests/blackbox/check_output.py -> python/samba/tests/blackbox/check_output.py symlink: samba/tests/blackbox/ndrdump.py -> python/samba/tests/blackbox/ndrdump.py symlink: samba/tests/blackbox/samba_dnsupdate.py -> python/samba/tests/blackbox/samba_dnsupdate.py symlink: samba/tests/blackbox/smbcontrol.py -> python/samba/tests/blackbox/smbcontrol.py symlink: samba/tests/blackbox/traffic_learner.py -> python/samba/tests/blackbox/traffic_learner.py symlink: samba/tests/blackbox/traffic_replay.py -> python/samba/tests/blackbox/traffic_replay.py symlink: samba/tests/blackbox/traffic_summary.py -> python/samba/tests/blackbox/traffic_summary.py symlink: samba/tests/common.py -> python/samba/tests/common.py symlink: samba/tests/core.py -> python/samba/tests/core.py symlink: samba/tests/credentials.py -> python/samba/tests/credentials.py symlink: samba/tests/dcerpc/__init__.py -> python/samba/tests/dcerpc/__init__.py symlink: samba/tests/dcerpc/array.py -> python/samba/tests/dcerpc/array.py symlink: samba/tests/dcerpc/bare.py -> python/samba/tests/dcerpc/bare.py symlink: samba/tests/dcerpc/dnsserver.py -> python/samba/tests/dcerpc/dnsserver.py symlink: samba/tests/dcerpc/integer.py -> python/samba/tests/dcerpc/integer.py symlink: samba/tests/dcerpc/misc.py -> python/samba/tests/dcerpc/misc.py symlink: samba/tests/dcerpc/raw_protocol.py -> python/samba/tests/dcerpc/raw_protocol.py symlink: samba/tests/dcerpc/raw_testcase.py -> python/samba/tests/dcerpc/raw_testcase.py symlink: samba/tests/dcerpc/registry.py -> python/samba/tests/dcerpc/registry.py symlink: samba/tests/dcerpc/rpc_talloc.py -> python/samba/tests/dcerpc/rpc_talloc.py symlink: samba/tests/dcerpc/rpcecho.py -> python/samba/tests/dcerpc/rpcecho.py symlink: samba/tests/dcerpc/sam.py -> python/samba/tests/dcerpc/sam.py symlink: samba/tests/dcerpc/srvsvc.py -> python/samba/tests/dcerpc/srvsvc.py symlink: samba/tests/dcerpc/string.py -> python/samba/tests/dcerpc/string.py symlink: samba/tests/dcerpc/testrpc.py -> python/samba/tests/dcerpc/testrpc.py symlink: samba/tests/dcerpc/unix.py -> python/samba/tests/dcerpc/unix.py symlink: samba/tests/dckeytab.py -> python/samba/tests/dckeytab.py symlink: samba/tests/dns.py -> python/samba/tests/dns.py symlink: samba/tests/dns_base.py -> python/samba/tests/dns_base.py symlink: samba/tests/dns_forwarder.py -> python/samba/tests/dns_forwarder.py symlink: samba/tests/dns_forwarder_helpers/server.py -> python/samba/tests/dns_forwarder_helpers/server.py symlink: samba/tests/dns_invalid.py -> python/samba/tests/dns_invalid.py symlink: samba/tests/dns_tkey.py -> python/samba/tests/dns_tkey.py symlink: samba/tests/dns_wildcard.py -> python/samba/tests/dns_wildcard.py symlink: samba/tests/docs.py -> python/samba/tests/docs.py symlink: samba/tests/domain_backup.py -> python/samba/tests/domain_backup.py symlink: samba/tests/dsdb.py -> python/samba/tests/dsdb.py symlink: samba/tests/dsdb_lock.py -> python/samba/tests/dsdb_lock.py symlink: samba/tests/dsdb_schema_attributes.py -> python/samba/tests/dsdb_schema_attributes.py symlink: samba/tests/emulate/__init__.py -> python/samba/tests/emulate/__init__.py symlink: samba/tests/emulate/traffic.py -> python/samba/tests/emulate/traffic.py symlink: samba/tests/emulate/traffic_packet.py -> python/samba/tests/emulate/traffic_packet.py symlink: samba/tests/encrypted_secrets.py -> python/samba/tests/encrypted_secrets.py symlink: samba/tests/gensec.py -> python/samba/tests/gensec.py symlink: samba/tests/get_opt.py -> python/samba/tests/get_opt.py symlink: samba/tests/getdcname.py -> python/samba/tests/getdcname.py symlink: samba/tests/glue.py -> python/samba/tests/glue.py symlink: samba/tests/gpo.py -> python/samba/tests/gpo.py symlink: samba/tests/graph.py -> python/samba/tests/graph.py symlink: samba/tests/group_audit.py -> python/samba/tests/group_audit.py symlink: samba/tests/hostconfig.py -> python/samba/tests/hostconfig.py symlink: samba/tests/join.py -> python/samba/tests/join.py symlink: samba/tests/kcc/__init__.py -> python/samba/tests/kcc/__init__.py symlink: samba/tests/kcc/graph.py -> python/samba/tests/kcc/graph.py symlink: samba/tests/kcc/graph_utils.py -> python/samba/tests/kcc/graph_utils.py symlink: samba/tests/kcc/kcc_utils.py -> python/samba/tests/kcc/kcc_utils.py symlink: samba/tests/kcc/ldif_import_export.py -> python/samba/tests/kcc/ldif_import_export.py symlink: samba/tests/krb5_credentials.py -> python/samba/tests/krb5_credentials.py symlink: samba/tests/libsmb_samba_internal.py -> python/samba/tests/libsmb_samba_internal.py symlink: samba/tests/loadparm.py -> python/samba/tests/loadparm.py symlink: samba/tests/lsa_string.py -> python/samba/tests/lsa_string.py symlink: samba/tests/messaging.py -> python/samba/tests/messaging.py symlink: samba/tests/net_join.py -> python/samba/tests/net_join.py symlink: samba/tests/net_join_no_spnego.py -> python/samba/tests/net_join_no_spnego.py symlink: samba/tests/netbios.py -> python/samba/tests/netbios.py symlink: samba/tests/netcmd.py -> python/samba/tests/netcmd.py symlink: samba/tests/netlogonsvc.py -> python/samba/tests/netlogonsvc.py symlink: samba/tests/ntacls.py -> python/samba/tests/ntacls.py symlink: samba/tests/ntacls_backup.py -> python/samba/tests/ntacls_backup.py symlink: samba/tests/ntlmdisabled.py -> python/samba/tests/ntlmdisabled.py symlink: samba/tests/pam_winbind.py -> python/samba/tests/pam_winbind.py symlink: samba/tests/pam_winbind_warn_pwd_expire.py -> python/samba/tests/pam_winbind_warn_pwd_expire.py symlink: samba/tests/param.py -> python/samba/tests/param.py symlink: samba/tests/password_hash.py -> python/samba/tests/password_hash.py symlink: samba/tests/password_hash_fl2003.py -> python/samba/tests/password_hash_fl2003.py symlink: samba/tests/password_hash_fl2008.py -> python/samba/tests/password_hash_fl2008.py symlink: samba/tests/password_hash_gpgme.py -> python/samba/tests/password_hash_gpgme.py symlink: samba/tests/password_hash_ldap.py -> python/samba/tests/password_hash_ldap.py symlink: samba/tests/password_quality.py -> python/samba/tests/password_quality.py symlink: samba/tests/password_test.py -> python/samba/tests/password_test.py symlink: samba/tests/policy.py -> python/samba/tests/policy.py symlink: samba/tests/posixacl.py -> python/samba/tests/posixacl.py symlink: samba/tests/provision.py -> python/samba/tests/provision.py symlink: samba/tests/pso.py -> python/samba/tests/pso.py symlink: samba/tests/py_credentials.py -> python/samba/tests/py_credentials.py symlink: samba/tests/registry.py -> python/samba/tests/registry.py symlink: samba/tests/s3idmapdb.py -> python/samba/tests/s3idmapdb.py symlink: samba/tests/s3param.py -> python/samba/tests/s3param.py symlink: samba/tests/s3passdb.py -> python/samba/tests/s3passdb.py symlink: samba/tests/s3registry.py -> python/samba/tests/s3registry.py symlink: samba/tests/s3windb.py -> python/samba/tests/s3windb.py symlink: samba/tests/samba3sam.py -> python/samba/tests/samba3sam.py symlink: samba/tests/samba_tool/__init__.py -> python/samba/tests/samba_tool/__init__.py symlink: samba/tests/samba_tool/base.py -> python/samba/tests/samba_tool/base.py symlink: samba/tests/samba_tool/computer.py -> python/samba/tests/samba_tool/computer.py symlink: samba/tests/samba_tool/demote.py -> python/samba/tests/samba_tool/demote.py symlink: samba/tests/samba_tool/dnscmd.py -> python/samba/tests/samba_tool/dnscmd.py symlink: samba/tests/samba_tool/forest.py -> python/samba/tests/samba_tool/forest.py symlink: samba/tests/samba_tool/fsmo.py -> python/samba/tests/samba_tool/fsmo.py symlink: samba/tests/samba_tool/gpo.py -> python/samba/tests/samba_tool/gpo.py symlink: samba/tests/samba_tool/group.py -> python/samba/tests/samba_tool/group.py symlink: samba/tests/samba_tool/help.py -> python/samba/tests/samba_tool/help.py symlink: samba/tests/samba_tool/join.py -> python/samba/tests/samba_tool/join.py symlink: samba/tests/samba_tool/ntacl.py -> python/samba/tests/samba_tool/ntacl.py symlink: samba/tests/samba_tool/ou.py -> python/samba/tests/samba_tool/ou.py symlink: samba/tests/samba_tool/passwordsettings.py -> python/samba/tests/samba_tool/passwordsettings.py symlink: samba/tests/samba_tool/processes.py -> python/samba/tests/samba_tool/processes.py symlink: samba/tests/samba_tool/provision_password_check.py -> python/samba/tests/samba_tool/provision_password_check.py symlink: samba/tests/samba_tool/rodc.py -> python/samba/tests/samba_tool/rodc.py symlink: samba/tests/samba_tool/schema.py -> python/samba/tests/samba_tool/schema.py symlink: samba/tests/samba_tool/sites.py -> python/samba/tests/samba_tool/sites.py symlink: samba/tests/samba_tool/timecmd.py -> python/samba/tests/samba_tool/timecmd.py symlink: samba/tests/samba_tool/user.py -> python/samba/tests/samba_tool/user.py symlink: samba/tests/samba_tool/user_check_password_script.py -> python/samba/tests/samba_tool/user_check_password_script.py symlink: samba/tests/samba_tool/user_virtualCryptSHA.py -> python/samba/tests/samba_tool/user_virtualCryptSHA.py symlink: samba/tests/samba_tool/user_wdigest.py -> python/samba/tests/samba_tool/user_wdigest.py symlink: samba/tests/samba_tool/visualize.py -> python/samba/tests/samba_tool/visualize.py symlink: samba/tests/samba_tool/visualize_drs.py -> python/samba/tests/samba_tool/visualize_drs.py symlink: samba/tests/samdb.py -> python/samba/tests/samdb.py symlink: samba/tests/samdb_api.py -> python/samba/tests/samdb_api.py symlink: samba/tests/security.py -> python/samba/tests/security.py symlink: samba/tests/smb.py -> python/samba/tests/smb.py symlink: samba/tests/source.py -> python/samba/tests/source.py symlink: samba/tests/strings.py -> python/samba/tests/strings.py symlink: samba/tests/subunitrun.py -> python/samba/tests/subunitrun.py symlink: samba/tests/tdb_util.py -> python/samba/tests/tdb_util.py symlink: samba/tests/unicodenames.py -> python/samba/tests/unicodenames.py symlink: samba/tests/upgrade.py -> python/samba/tests/upgrade.py symlink: samba/tests/upgradeprovision.py -> python/samba/tests/upgradeprovision.py symlink: samba/tests/upgradeprovisionneeddc.py -> python/samba/tests/upgradeprovisionneeddc.py symlink: samba/tests/xattr.py -> python/samba/tests/xattr.py symlink: samba/upgrade.py -> python/samba/upgrade.py symlink: samba/upgradehelpers.py -> python/samba/upgradehelpers.py symlink: samba/web_server/__init__.py -> python/samba/web_server/__init__.py symlink: samba/xattr.py -> python/samba/xattr.py symlink: rpc/dcerpc.py -> python/samba/dcerpc/__init__.py Selected embedded Heimdal build symlink: samba-tool -> ./samba-tool symlink: samba_dnsupdate -> ./samba_dnsupdate symlink: samba_spnupdate -> ./samba_spnupdate symlink: samba_kcc -> ./samba_kcc symlink: samba_upgradeprovision -> ./samba_upgradeprovision symlink: samba_upgradedns -> ./samba_upgradedns symlink: gen_output.py -> ./gen_output.py symlink: samba-gpupdate -> ./samba-gpupdate symlink: smbaddshare -> ./smbaddshare symlink: smbchangeshare -> ./smbchangeshare symlink: smbdeleteshare -> ./smbdeleteshare Checking project rules ... Project rules pass [ 1/4157] Generating replace.vscript [ 2/4157] Generating interfaces.vscript [ 3/4157] Generating addns.vscript [ 4/4157] Generating server-role.vscript [ 5/4157] Generating samba-hostconfig.vscript [ 6/4157] Generating samba_python.vscript [ 7/4157] Generating shares.vscript [ 8/4157] Generating ndr-samba4.vscript [ 9/4157] Generating dcerpc-samba4.vscript [ 10/4157] Generating dcerpc-samr.vscript [ 11/4157] Generating dcerpc.vscript [ 12/4157] Generating dsdb-module.vscript [ 13/4157] Generating samdb.vscript [ 14/4157] Generating samdb-common.vscript [ 15/4157] Generating dsdb_garbage_collect_tombstones.vscript [ 16/4157] Generating scavenge_dns_records.vscript [ 17/4157] Generating service.vscript [ 18/4157] Generating process_model.vscript [ 19/4157] Generating cluster.vscript [ 20/4157] Generating samba-net.vscript [ 21/4157] Generating authkrb5.vscript [ 22/4157] Generating auth4.vscript [ 23/4157] Generating auth_unix_token.vscript [ 24/4157] Generating common_auth.vscript [ 25/4157] Generating gensec.vscript [ 26/4157] Generating samba-credentials.vscript [ 27/4157] Generating winbind-client.vscript [ 28/4157] Generating nss_wrapper_winbind.vscript [ 29/4157] Generating nss_winbind.vscript [ 30/4157] Generating nss_wins.vscript [ 31/4157] Generating wbclient.vscript [ 32/4157] Generating smbpasswdparser.vscript [ 33/4157] Generating netif.vscript [ 34/4157] Generating ldbsamba.vscript [ 35/4157] Generating registry.vscript [ 36/4157] Generating MESSAGING_SEND.vscript [ 37/4157] Generating MESSAGING.vscript [ 38/4157] Generating events.vscript [ 39/4157] Generating cmdline-credentials.vscript [ 40/4157] Generating http.vscript [ 41/4157] Generating time-basic.vscript [ 42/4157] Generating sys_rw.vscript [ 43/4157] Generating samba-debug.vscript [ 44/4157] Generating socket-blocking.vscript [ 45/4157] Generating talloc_report.vscript [ 46/4157] Generating iov_buf.vscript [ 47/4157] Generating msghdr.vscript [ 48/4157] Generating genrand.vscript [ 49/4157] Generating samba-util.vscript [ 50/4157] Generating samba-modules.vscript [ 51/4157] Generating asn1util.vscript [ 52/4157] Generating util_tdb.vscript [ 53/4157] Generating tevent-util.vscript [ 54/4157] Generating util_setid.vscript [ 55/4157] Generating server_id_db.vscript [ 56/4157] Generating tdb-wrap.vscript [ 57/4157] Generating torture.vscript [ 58/4157] Generating gpext.vscript [ 59/4157] Generating dnsserver_common.vscript [ 60/4157] Generating dlz_bind9.vscript [ 61/4157] Generating dlz_bind9_9.vscript [ 62/4157] Generating dlz_bind9_10.vscript [ 63/4157] Generating dlz_bind9_11.vscript [ 64/4157] Generating dlz_bind9_for_torture.vscript [ 65/4157] Generating dcerpc_server.vscript [ 66/4157] Generating posix_eadb.vscript [ 67/4157] Generating ndr-krb5pac.vscript [ 68/4157] Generating ndr-standard.vscript [ 69/4157] Generating ndr_nbt.vscript [ 70/4157] Generating ndr-samba.vscript [ 71/4157] Generating dcerpc-samba.vscript [ 72/4157] Generating ndr.vscript [ 73/4157] Generating dcerpc-binding.vscript [ 74/4157] Generating cli-ldap.vscript [ 75/4157] Generating LIBWBCLIENT_OLD.vscript [ 76/4157] Generating smbclient-raw.vscript [ 77/4157] Generating smb_transport.vscript [ 78/4157] Generating cli_smb_common.vscript [ 79/4157] Generating samba-errors.vscript [ 80/4157] Generating cli_cldap.vscript [ 81/4157] Generating dbwrap.vscript [ 82/4157] Generating samba-security.vscript [ 83/4157] Generating cli-ldap-common.vscript [ 84/4157] Generating cli-nbt.vscript [ 85/4157] Generating cliauth.vscript [ 86/4157] Generating util_reg.vscript [ 87/4157] Generating samba-policy.vscript [ 88/4157] Generating npa_tstream.vscript [ 89/4157] Generating HDB_SAMBA4.vscript [ 90/4157] Generating pac.vscript [ 91/4157] Generating db-glue.vscript [ 92/4157] Generating ctdb-event-client.vscript [ 93/4157] Generating samba-sockets.vscript [ 94/4157] Generating flag_mapping.vscript [ 95/4157] Generating netapi.vscript [ 96/4157] Generating gse.vscript [ 97/4157] Generating msrpc3.vscript [ 98/4157] Generating samba-passdb.vscript [ 99/4157] Generating smbldaphelper.vscript [ 100/4157] Generating popt_samba3.vscript [ 101/4157] Generating popt_samba3_cmdline.vscript [ 102/4157] Generating util_cmdline.vscript [ 103/4157] Generating cmdline_contexts.vscript [ 104/4157] Generating messages_dgm.vscript [ 105/4157] Generating messages_util.vscript [ 106/4157] Generating smbd_shim.vscript [ 107/4157] Generating libsmb.vscript [ 108/4157] Generating secrets3.vscript [ 109/4157] Generating smbldap.vscript [ 110/4157] Generating ads.vscript [ 111/4157] Generating smbconf.vscript [ 112/4157] Generating smbd_conn.vscript [ 113/4157] Generating smbd_base.vscript [ 114/4157] Generating printing_migrate.vscript [ 115/4157] Generating net_keytab.vscript [ 116/4157] Generating trusts_util.vscript [ 117/4157] Generating samba3-util.vscript [ 118/4157] Generating xattr_tdb.vscript [ 119/4157] Generating CHARSET3.vscript [ 120/4157] Generating libcli_lsa3.vscript [ 121/4157] Generating libcli_netlogon3.vscript [ 122/4157] Generating cli_spoolss.vscript [ 123/4157] Generating auth.vscript [ 124/4157] Generating smbclient.vscript [ 125/4157] Generating non_posix_acls.vscript [ 126/4157] Generating idmap.vscript [ 127/4157] Generating nss_info.vscript [ 128/4157] Generating dfs_server_ad.vscript [ 129/4157] Generating krb5samba.vscript [ 130/4157] Compiling lib/replace/replace.c [ 131/4157] Compiling lib/replace/cwrap.c [ 132/4157] Compiling lib/replace/closefrom.c 01:25:08 runner i686-pld-linux-gcc -O2 -fwrapv -pipe -Wformat -Werror=format-security -gdwarf-4 -fno-debug-types-section -fvar-tracking-assignments -g2 -Wp,-D_FORTIFY_SOURCE=2 -fstack-protector-strong --param=ssp-buffer-size=4 -fomit-frame-pointer -march=i686 -fasynchronous-unwind-tables -mtune=pentium4 -gdwarf-4 -fno-debug-types-section -fvar-tracking-assignments -g2 -fPIC -D_LARGEFILE_SOURCE -D_FILE_OFFSET_BITS=64 -D_REENTRANT -D_POSIX_PTHREAD_SEMANTICS -DCTDB_HELPER_BINDIR="/usr/libexec/ctdb" -DLOGDIR="/var/log" -DCTDB_DATADIR="/usr/share/ctdb" -DCTDB_ETCDIR="/etc/ctdb" -DCTDB_VARDIR="/var/lib/ctdb" -DCTDB_RUNDIR="/var/run/ctdb" -fstack-clash-protection -DSTATIC_replace_MODULES=NULL -DSTATIC_replace_MODULES_PROTO=extern void __replace_dummy_module_proto(void) -MD -Idefault/lib/replace -I../lib/replace -Idefault/include/public -I../include/public -Idefault/source4 -I../source4 -Idefault/lib -I../lib -Idefault/source4/lib -I../source4/lib -Idefault/source4/include -I../source4/include -Idefault/include -I../include -Idefault/ctdb/include -I../ctdb/include -Idefault/ctdb -I../ctdb -Idefault -I.. -I/usr/local/include -D_SAMBA_BUILD_=4 -DHAVE_CONFIG_H=1 -D_GNU_SOURCE=1 -D_XOPEN_SOURCE_EXTENDED=1 ../lib/replace/closefrom.c -c -o default/lib/replace/closefrom_2.o 01:25:08 runner i686-pld-linux-gcc -O2 -fwrapv -pipe -Wformat -Werror=format-security -gdwarf-4 -fno-debug-types-section -fvar-tracking-assignments -g2 -Wp,-D_FORTIFY_SOURCE=2 -fstack-protector-strong --param=ssp-buffer-size=4 -fomit-frame-pointer -march=i686 -fasynchronous-unwind-tables -mtune=pentium4 -gdwarf-4 -fno-debug-types-section -fvar-tracking-assignments -g2 -fPIC -D_LARGEFILE_SOURCE -D_FILE_OFFSET_BITS=64 -D_REENTRANT -D_POSIX_PTHREAD_SEMANTICS -DCTDB_HELPER_BINDIR="/usr/libexec/ctdb" -DLOGDIR="/var/log" -DCTDB_DATADIR="/usr/share/ctdb" -DCTDB_ETCDIR="/etc/ctdb" -DCTDB_VARDIR="/var/lib/ctdb" -DCTDB_RUNDIR="/var/run/ctdb" -fstack-clash-protection -DSTATIC_replace_MODULES=NULL -DSTATIC_replace_MODULES_PROTO=extern void __replace_dummy_module_proto(void) -MD -Idefault/lib/replace -I../lib/replace -Idefault/include/public -I../include/public -Idefault/source4 -I../source4 -Idefault/lib -I../lib -Idefault/source4/lib -I../source4/lib -Idefault/source4/include -I../source4/include -Idefault/include -I../include -Idefault/ctdb/include -I../ctdb/include -Idefault/ctdb -I../ctdb -Idefault -I.. -I/usr/local/include -D_SAMBA_BUILD_=4 -DHAVE_CONFIG_H=1 -D_GNU_SOURCE=1 -D_XOPEN_SOURCE_EXTENDED=1 ../lib/replace/cwrap.c -c -o default/lib/replace/cwrap_2.o 01:25:08 runner i686-pld-linux-gcc -O2 -fwrapv -pipe -Wformat -Werror=format-security -gdwarf-4 -fno-debug-types-section -fvar-tracking-assignments -g2 -Wp,-D_FORTIFY_SOURCE=2 -fstack-protector-strong --param=ssp-buffer-size=4 -fomit-frame-pointer -march=i686 -fasynchronous-unwind-tables -mtune=pentium4 -gdwarf-4 -fno-debug-types-section -fvar-tracking-assignments -g2 -fPIC -D_LARGEFILE_SOURCE -D_FILE_OFFSET_BITS=64 -D_REENTRANT -D_POSIX_PTHREAD_SEMANTICS -DCTDB_HELPER_BINDIR="/usr/libexec/ctdb" -DLOGDIR="/var/log" -DCTDB_DATADIR="/usr/share/ctdb" -DCTDB_ETCDIR="/etc/ctdb" -DCTDB_VARDIR="/var/lib/ctdb" -DCTDB_RUNDIR="/var/run/ctdb" -fstack-clash-protection -DSTATIC_replace_MODULES=NULL -DSTATIC_replace_MODULES_PROTO=extern void __replace_dummy_module_proto(void) -MD -Idefault/lib/replace -I../lib/replace -Idefault/include/public -I../include/public -Idefault/source4 -I../source4 -Idefault/lib -I../lib -Idefault/source4/lib -I../source4/lib -Idefault/source4/include -I../source4/include -Idefault/include -I../include -Idefault/ctdb/include -I../ctdb/include -Idefault/ctdb -I../ctdb -Idefault -I.. -I/usr/local/include -D_SAMBA_BUILD_=4 -DHAVE_CONFIG_H=1 -D_GNU_SOURCE=1 -D_XOPEN_SOURCE_EXTENDED=1 ../lib/replace/replace.c -c -o default/lib/replace/replace_2.o ../lib/replace/replace.c: In function 'rep_setproctitle': ../lib/replace/replace.c:954:16: warning: ignoring return value of 'vasprintf', declared with attribute warn_unused_result [-Wunused-result] vasprintf(&title, fmt, args); ^~~~~~~~~~~~~~~~~~~~~~~~~~~~ [ 133/4157] Linking default/lib/replace/libreplace-samba4.so 01:25:08 runner i686-pld-linux-gcc default/lib/replace/replace_2.o default/lib/replace/cwrap_2.o default/lib/replace/closefrom_2.o -o /tmp/B.zYV1cz/BUILD/samba-4.9.3/bin/default/lib/replace/libreplace-samba4.so -Wl,--as-needed -Wl,--no-copy-dt-needed-entries -Wl,-z,relro -Wl,-z,combreloc -Wl,-z,relro,-z,now -lpthread -Wl,-no-undefined -Wl,--export-dynamic -shared -Wl,--version-script=/tmp/B.zYV1cz/BUILD/samba-4.9.3/bin/default/lib/replace/replace.vscript -L/usr/local/lib -Wl,-Bdynamic -lrt -lcrypt -ldl -lnsl -lbsd [ 134/4157] Generating VERSION [ 135/4157] Generating INFILE_catalog.xml [ 136/4157] Generating INFILE_samba.build.version [ 137/4157] Generating smbdotconf/parameters.all.xml [ 138/4157] Generating PKGCONFIG_samba-hostconfig.pc [ 139/4157] Generating samba_python_empty_c [ 140/4157] Generating shares_empty_c [ 141/4157] Generating ndr-samba4_empty_c [ 142/4157] Generating dcerpc-samba4_empty_c [ 143/4157] Generating dcerpc-samr_empty_c [ 144/4157] Generating PKGCONFIG_dcerpc_samr.pc [ 145/4157] Generating PKGCONFIG_dcerpc.pc [ 146/4157] Generating dsdb-module_empty_c [ 147/4157] Generating PKGCONFIG_samdb.pc [ 148/4157] Generating gensec_ntlmssp_empty_c [ 149/4157] Generating PKGCONFIG_samba-credentials.pc [ 150/4157] Generating PKGCONFIG_wbclient.pc [ 151/4157] Generating third_party_init_py 01:25:08 runner touch default/third_party/empty_file [ 152/4157] Generating PKGCONFIG_samba-util.pc [ 153/4157] Generating PKGCONFIG_dcerpc_server.pc [ 154/4157] Generating smbtorture.objlist_empty_c [ 155/4157] Generating PKGCONFIG_ndr_krb5pac.pc [ 156/4157] Generating PKGCONFIG_ndr_standard.pc [ 157/4157] Generating PKGCONFIG_ndr_nbt.pc [ 158/4157] Generating ndr-samba_empty_c [ 159/4157] Generating dcerpc-samba_empty_c [ 160/4157] Generating PKGCONFIG_ndr.pc [ 161/4157] Generating cliauth_empty_c [ 162/4157] Generating PKGCONFIG_samba-policy.pc [ 163/4157] Generating HEIMDAL_ERRORLIST 01:25:08 runner /usr/bin/python '/tmp/B.zYV1cz/BUILD/samba-4.9.3/source4/heimdal/lib/wind/gen-errorlist.py' '/tmp/B.zYV1cz/BUILD/samba-4.9.3/source4/heimdal/lib/wind/rfc3454.txt' '/tmp/B.zYV1cz/BUILD/samba-4.9.3/bin/default/source4/heimdal/lib/wind' [ 164/4157] Generating HEIMDAL_NORMALIZE_TABLE [ 165/4157] Generating HEIMDAL_COMBINING_TABLE 01:25:08 runner /usr/bin/python '/tmp/B.zYV1cz/BUILD/samba-4.9.3/source4/heimdal/lib/wind/gen-normalize.py' '/tmp/B.zYV1cz/BUILD/samba-4.9.3/source4/heimdal/lib/wind/UnicodeData.txt' '/tmp/B.zYV1cz/BUILD/samba-4.9.3/source4/heimdal/lib/wind/CompositionExclusions-3.2.0.txt' '/tmp/B.zYV1cz/BUILD/samba-4.9.3/bin/default/source4/heimdal/lib/wind' [ 166/4157] Generating HEIMDAL_BIDI_TABLE [ 167/4157] Generating HEIMDAL_MAP_TABLE 01:25:08 runner /usr/bin/python '/tmp/B.zYV1cz/BUILD/samba-4.9.3/source4/heimdal/lib/wind/gen-bidi.py' '/tmp/B.zYV1cz/BUILD/samba-4.9.3/source4/heimdal/lib/wind/rfc3454.txt' '/tmp/B.zYV1cz/BUILD/samba-4.9.3/bin/default/source4/heimdal/lib/wind' 01:25:08 runner /usr/bin/python '/tmp/B.zYV1cz/BUILD/samba-4.9.3/source4/heimdal/lib/wind/gen-map.py' '/tmp/B.zYV1cz/BUILD/samba-4.9.3/source4/heimdal/lib/wind/rfc3454.txt' '/tmp/B.zYV1cz/BUILD/samba-4.9.3/bin/default/source4/heimdal/lib/wind' 01:25:08 runner /usr/bin/python '/tmp/B.zYV1cz/BUILD/samba-4.9.3/source4/heimdal/lib/wind/gen-combining.py' '/tmp/B.zYV1cz/BUILD/samba-4.9.3/source4/heimdal/lib/wind/UnicodeData.txt' '/tmp/B.zYV1cz/BUILD/samba-4.9.3/bin/default/source4/heimdal/lib/wind' [ 168/4157] Generating pac_empty_c [ 169/4157] Generating ctdb-version-header [ 170/4157] Generating ctdb-smnotify-h 01:25:08 runner rpcgen -h ../ctdb/utils/smnotify/smnotify.x > default/ctdb/utils/smnotify/smnotify.h [ 171/4157] Generating ctdb-smnotify-x [ 172/4157] Generating ctdb-smnotify-c 01:25:08 runner rpcgen -c ../ctdb/utils/smnotify/smnotify.x | sed -e "s@^\([ ]*register int32_t \*buf\);@\1 = buf;@" > default/ctdb/utils/smnotify/gen_xdr.c [ 173/4157] Generating ctdb.1.xml 01:25:08 runner rpcgen -l ../ctdb/utils/smnotify/smnotify.x > default/ctdb/utils/smnotify/gen_smnotify.c 01:25:08 runner sed -e "s|/usr/local/var/lib/ctdb|/var/lib/ctdb|g" -e "s|/usr/local/etc/ctdb|/etc/ctdb|g" -e "s|/usr/local/var/log|/var/log|g" -e "s|/usr/local/var/run/ctdb|/var/run/ctdb|g" -e "s|/usr/local/sbin|/usr/sbin|g" -e "s|/usr/local/libexec/ctdb|/usr/libexec/ctdb|g" -e "s|/usr/local/bin|/usr/bin|g" -e "s|/usr/local/share/ctdb|/usr/share/ctdb|g" ../ctdb/doc/ctdb.1.xml > default/ctdb/ctdb.1.xml [ 174/4157] Generating ctdbd.1.xml fooresult B.1,rfc4518-map 01:25:08 runner sed -e "s|/usr/local/var/lib/ctdb|/var/lib/ctdb|g" -e "s|/usr/local/etc/ctdb|/etc/ctdb|g" -e "s|/usr/local/var/log|/var/log|g" -e "s|/usr/local/var/run/ctdb|/var/run/ctdb|g" -e "s|/usr/local/sbin|/usr/sbin|g" -e "s|/usr/local/libexec/ctdb|/usr/libexec/ctdb|g" -e "s|/usr/local/bin|/usr/bin|g" -e "s|/usr/local/share/ctdb|/usr/share/ctdb|g" ../ctdb/doc/ctdbd.1.xml > default/ctdb/ctdbd.1.xml [ 175/4157] Generating ltdbtool.1.xml [ 176/4157] Generating ping_pong.1.xml 01:25:08 runner sed -e "s|/usr/local/var/lib/ctdb|/var/lib/ctdb|g" -e "s|/usr/local/etc/ctdb|/etc/ctdb|g" -e "s|/usr/local/var/log|/var/log|g" -e "s|/usr/local/var/run/ctdb|/var/run/ctdb|g" -e "s|/usr/local/sbin|/usr/sbin|g" -e "s|/usr/local/libexec/ctdb|/usr/libexec/ctdb|g" -e "s|/usr/local/bin|/usr/bin|g" -e "s|/usr/local/share/ctdb|/usr/share/ctdb|g" ../ctdb/doc/ltdbtool.1.xml > default/ctdb/ltdbtool.1.xml [ 177/4157] Generating ctdb_diagnostics.1.xml 01:25:08 runner sed -e "s|/usr/local/var/lib/ctdb|/var/lib/ctdb|g" -e "s|/usr/local/etc/ctdb|/etc/ctdb|g" -e "s|/usr/local/var/log|/var/log|g" -e "s|/usr/local/var/run/ctdb|/var/run/ctdb|g" -e "s|/usr/local/sbin|/usr/sbin|g" -e "s|/usr/local/libexec/ctdb|/usr/libexec/ctdb|g" -e "s|/usr/local/bin|/usr/bin|g" -e "s|/usr/local/share/ctdb|/usr/share/ctdb|g" ../ctdb/doc/ctdb_diagnostics.1.xml > default/ctdb/ctdb_diagnostics.1.xml [ 178/4157] Generating ctdbd_wrapper.1.xml 01:25:08 runner sed -e "s|/usr/local/var/lib/ctdb|/var/lib/ctdb|g" -e "s|/usr/local/etc/ctdb|/etc/ctdb|g" -e "s|/usr/local/var/log|/var/log|g" -e "s|/usr/local/var/run/ctdb|/var/run/ctdb|g" -e "s|/usr/local/sbin|/usr/sbin|g" -e "s|/usr/local/libexec/ctdb|/usr/libexec/ctdb|g" -e "s|/usr/local/bin|/usr/bin|g" -e "s|/usr/local/share/ctdb|/usr/share/ctdb|g" ../ctdb/doc/ping_pong.1.xml > default/ctdb/ping_pong.1.xml [ 179/4157] Generating onnode.1.xml 01:25:08 runner sed -e "s|/usr/local/var/lib/ctdb|/var/lib/ctdb|g" -e "s|/usr/local/etc/ctdb|/etc/ctdb|g" -e "s|/usr/local/var/log|/var/log|g" -e "s|/usr/local/var/run/ctdb|/var/run/ctdb|g" -e "s|/usr/local/sbin|/usr/sbin|g" -e "s|/usr/local/libexec/ctdb|/usr/libexec/ctdb|g" -e "s|/usr/local/bin|/usr/bin|g" -e "s|/usr/local/share/ctdb|/usr/share/ctdb|g" ../ctdb/doc/onnode.1.xml > default/ctdb/onnode.1.xml [ 180/4157] Generating ctdb.conf.5.xml 01:25:08 runner sed -e "s|/usr/local/var/lib/ctdb|/var/lib/ctdb|g" -e "s|/usr/local/etc/ctdb|/etc/ctdb|g" -e "s|/usr/local/var/log|/var/log|g" -e "s|/usr/local/var/run/ctdb|/var/run/ctdb|g" -e "s|/usr/local/sbin|/usr/sbin|g" -e "s|/usr/local/libexec/ctdb|/usr/libexec/ctdb|g" -e "s|/usr/local/bin|/usr/bin|g" -e "s|/usr/local/share/ctdb|/usr/share/ctdb|g" ../ctdb/doc/ctdbd_wrapper.1.xml > default/ctdb/ctdbd_wrapper.1.xml [ 181/4157] Generating ctdb-script.options.5.xml 01:25:08 runner sed -e "s|/usr/local/var/lib/ctdb|/var/lib/ctdb|g" -e "s|/usr/local/etc/ctdb|/etc/ctdb|g" -e "s|/usr/local/var/log|/var/log|g" -e "s|/usr/local/var/run/ctdb|/var/run/ctdb|g" -e "s|/usr/local/sbin|/usr/sbin|g" -e "s|/usr/local/libexec/ctdb|/usr/libexec/ctdb|g" -e "s|/usr/local/bin|/usr/bin|g" -e "s|/usr/local/share/ctdb|/usr/share/ctdb|g" ../ctdb/doc/ctdb.conf.5.xml > default/ctdb/ctdb.conf.5.xml 01:25:08 runner sed -e "s|/usr/local/var/lib/ctdb|/var/lib/ctdb|g" -e "s|/usr/local/etc/ctdb|/etc/ctdb|g" -e "s|/usr/local/var/log|/var/log|g" -e "s|/usr/local/var/run/ctdb|/var/run/ctdb|g" -e "s|/usr/local/sbin|/usr/sbin|g" -e "s|/usr/local/libexec/ctdb|/usr/libexec/ctdb|g" -e "s|/usr/local/bin|/usr/bin|g" -e "s|/usr/local/share/ctdb|/usr/share/ctdb|g" ../ctdb/doc/ctdb-script.options.5.xml > default/ctdb/ctdb-script.options.5.xml [ 182/4157] Generating ctdb.sysconfig.5.xml 01:25:09 runner sed -e "s|/usr/local/var/lib/ctdb|/var/lib/ctdb|g" -e "s|/usr/local/etc/ctdb|/etc/ctdb|g" -e "s|/usr/local/var/log|/var/log|g" -e "s|/usr/local/var/run/ctdb|/var/run/ctdb|g" -e "s|/usr/local/sbin|/usr/sbin|g" -e "s|/usr/local/libexec/ctdb|/usr/libexec/ctdb|g" -e "s|/usr/local/bin|/usr/bin|g" -e "s|/usr/local/share/ctdb|/usr/share/ctdb|g" ../ctdb/doc/ctdb.sysconfig.5.xml > default/ctdb/ctdb.sysconfig.5.xml [ 183/4157] Generating ctdb.7.xml [ 184/4157] Generating ctdb-statistics.7.xml 01:25:09 runner sed -e "s|/usr/local/var/lib/ctdb|/var/lib/ctdb|g" -e "s|/usr/local/etc/ctdb|/etc/ctdb|g" -e "s|/usr/local/var/log|/var/log|g" -e "s|/usr/local/var/run/ctdb|/var/run/ctdb|g" -e "s|/usr/local/sbin|/usr/sbin|g" -e "s|/usr/local/libexec/ctdb|/usr/libexec/ctdb|g" -e "s|/usr/local/bin|/usr/bin|g" -e "s|/usr/local/share/ctdb|/usr/share/ctdb|g" ../ctdb/doc/ctdb.7.xml > default/ctdb/ctdb.7.xml 01:25:09 runner sed -e "s|/usr/local/var/lib/ctdb|/var/lib/ctdb|g" -e "s|/usr/local/etc/ctdb|/etc/ctdb|g" -e "s|/usr/local/var/log|/var/log|g" -e "s|/usr/local/var/run/ctdb|/var/run/ctdb|g" -e "s|/usr/local/sbin|/usr/sbin|g" -e "s|/usr/local/libexec/ctdb|/usr/libexec/ctdb|g" -e "s|/usr/local/bin|/usr/bin|g" -e "s|/usr/local/share/ctdb|/usr/share/ctdb|g" ../ctdb/doc/ctdb-statistics.7.xml > default/ctdb/ctdb-statistics.7.xml [ 185/4157] Generating ctdb-tunables.7.xml 01:25:09 runner sed -e "s|/usr/local/var/lib/ctdb|/var/lib/ctdb|g" -e "s|/usr/local/etc/ctdb|/etc/ctdb|g" -e "s|/usr/local/var/log|/var/log|g" -e "s|/usr/local/var/run/ctdb|/var/run/ctdb|g" -e "s|/usr/local/sbin|/usr/sbin|g" -e "s|/usr/local/libexec/ctdb|/usr/libexec/ctdb|g" -e "s|/usr/local/bin|/usr/bin|g" -e "s|/usr/local/share/ctdb|/usr/share/ctdb|g" ../ctdb/doc/ctdb-tunables.7.xml > default/ctdb/ctdb-tunables.7.xml [ 186/4157] Generating ctdb-onnode 01:25:09 runner sed -e "s|/usr/local/var/lib/ctdb|/var/lib/ctdb|g" -e "s|/usr/local/etc/ctdb|/etc/ctdb|g" -e "s|/usr/local/var/log|/var/log|g" -e "s|/usr/local/var/run/ctdb|/var/run/ctdb|g" -e "s|/usr/local/sbin|/usr/sbin|g" -e "s|/usr/local/libexec/ctdb|/usr/libexec/ctdb|g" -e "s|/usr/local/bin|/usr/bin|g" -e "s|/usr/local/share/ctdb|/usr/share/ctdb|g" ../ctdb/tools/onnode > default/ctdb/onnode [ 187/4157] Generating ctdb-diagnostics 01:25:09 runner sed -e "s|/usr/local/var/lib/ctdb|/var/lib/ctdb|g" -e "s|/usr/local/etc/ctdb|/etc/ctdb|g" -e "s|/usr/local/var/log|/var/log|g" -e "s|/usr/local/var/run/ctdb|/var/run/ctdb|g" -e "s|/usr/local/sbin|/usr/sbin|g" -e "s|/usr/local/libexec/ctdb|/usr/libexec/ctdb|g" -e "s|/usr/local/bin|/usr/bin|g" -e "s|/usr/local/share/ctdb|/usr/share/ctdb|g" ../ctdb/tools/ctdb_diagnostics > default/ctdb/ctdb_diagnostics [ 188/4157] Generating ctdb-natgw 01:25:09 runner sed -e "s|/usr/local/var/lib/ctdb|/var/lib/ctdb|g" -e "s|/usr/local/etc/ctdb|/etc/ctdb|g" -e "s|/usr/local/var/log|/var/log|g" -e "s|/usr/local/var/run/ctdb|/var/run/ctdb|g" -e "s|/usr/local/sbin|/usr/sbin|g" -e "s|/usr/local/libexec/ctdb|/usr/libexec/ctdb|g" -e "s|/usr/local/bin|/usr/bin|g" -e "s|/usr/local/share/ctdb|/usr/share/ctdb|g" ../ctdb/tools/ctdb_natgw > default/ctdb/ctdb_natgw [ 189/4157] Generating ctdb-lvs 01:25:09 runner sed -e "s|/usr/local/var/lib/ctdb|/var/lib/ctdb|g" -e "s|/usr/local/etc/ctdb|/etc/ctdb|g" -e "s|/usr/local/var/log|/var/log|g" -e "s|/usr/local/var/run/ctdb|/var/run/ctdb|g" -e "s|/usr/local/sbin|/usr/sbin|g" -e "s|/usr/local/libexec/ctdb|/usr/libexec/ctdb|g" -e "s|/usr/local/bin|/usr/bin|g" -e "s|/usr/local/share/ctdb|/usr/share/ctdb|g" ../ctdb/tools/ctdb_lvs > default/ctdb/ctdb_lvs [ 190/4157] Generating ctdbd-wrapper 01:25:09 runner sed -e "s|/usr/local/var/lib/ctdb|/var/lib/ctdb|g" -e "s|/usr/local/etc/ctdb|/etc/ctdb|g" -e "s|/usr/local/var/log|/var/log|g" -e "s|/usr/local/var/run/ctdb|/var/run/ctdb|g" -e "s|/usr/local/sbin|/usr/sbin|g" -e "s|/usr/local/libexec/ctdb|/usr/libexec/ctdb|g" -e "s|/usr/local/bin|/usr/bin|g" -e "s|/usr/local/share/ctdb|/usr/share/ctdb|g" ../ctdb/config/ctdbd_wrapper > default/ctdb/ctdbd_wrapper [ 191/4157] Generating ctdb-functions 01:25:09 runner sed -e "s|/usr/local/var/lib/ctdb|/var/lib/ctdb|g" -e "s|/usr/local/etc/ctdb|/etc/ctdb|g" -e "s|/usr/local/var/log|/var/log|g" -e "s|/usr/local/var/run/ctdb|/var/run/ctdb|g" -e "s|/usr/local/sbin|/usr/sbin|g" -e "s|/usr/local/libexec/ctdb|/usr/libexec/ctdb|g" -e "s|/usr/local/bin|/usr/bin|g" -e "s|/usr/local/share/ctdb|/usr/share/ctdb|g" ../ctdb/config/functions > default/ctdb/functions [ 192/4157] Generating ctdb-sudoers 01:25:09 runner sed -e "s|/usr/local/var/lib/ctdb|/var/lib/ctdb|g" -e "s|/usr/local/etc/ctdb|/etc/ctdb|g" -e "s|/usr/local/var/log|/var/log|g" -e "s|/usr/local/var/run/ctdb|/var/run/ctdb|g" -e "s|/usr/local/sbin|/usr/sbin|g" -e "s|/usr/local/libexec/ctdb|/usr/libexec/ctdb|g" -e "s|/usr/local/bin|/usr/bin|g" -e "s|/usr/local/share/ctdb|/usr/share/ctdb|g" ../ctdb/config/ctdb.sudoers > default/ctdb/ctdb.sudoers [ 193/4157] Generating ctdb-test-wrap 01:25:09 runner sed -e "s@^TEST_SCRIPTS_DIR=.*@&\nexport TEST_BIN_DIR="/usr/libexec/ctdb/tests"@" ../ctdb/tests/scripts/test_wrap > default/ctdb/test_wrap [ 194/4157] Generating ctdb-test-script-install-paths 01:25:09 runner sed -e "s|/usr/local/var/lib/ctdb|/var/lib/ctdb|g" -e "s|/usr/local/etc/ctdb|/etc/ctdb|g" -e "s|/usr/local/var/log|/var/log|g" -e "s|/usr/local/var/run/ctdb|/var/run/ctdb|g" -e "s|/usr/local/sbin|/usr/sbin|g" -e "s|/usr/local/libexec/ctdb|/usr/libexec/ctdb|g" -e "s|/usr/local/bin|/usr/bin|g" -e "s|/usr/local/share/ctdb|/usr/share/ctdb|g" ../ctdb/tests/scripts/script_install_paths.sh > default/ctdb/script_install_paths.sh [ 195/4157] Generating ctdb-test-runner [ 196/4157] Generating python_samba_dnsupdate [ 197/4157] Generating python_samba_spnupdate 01:25:09 runner sed -e "s@^\(export CTDB_TEST_DIR\)=.*@\1=/usr/share/ctdb/tests\nexport TEST_BIN_DIR="/usr/libexec/ctdb/tests"@" -e "s@^\(export CTDB_TESTS_ARE_INSTALLED\)=false@\1=true@" ../ctdb/tests/run_tests.sh > default/ctdb/ctdb_run_tests.sh [ 198/4157] Generating python_samba_upgradedns [ 199/4157] Generating python_samba_kcc [ 200/4157] Generating python_samba-gpupdate [ 201/4157] Generating python_samba-tool [ 202/4157] Generating perl_pidl [ 203/4157] Generating samba-sockets_empty_c [ 204/4157] Generating smbd/build_options.c [ 205/4157] Generating PKGCONFIG_netapi.pc [ 206/4157] Generating samba-passdb_empty_c [ 207/4157] Generating PKGCONFIG_smbclient.pc [ 208/4157] Generating vfs_empty_c [ 209/4157] Generating nfs41acl-xdr-c 01:25:09 runner rpcgen -c ../source3/modules/nfs41acl.x | sed -e "s@^\([ ]*register int32_t \*buf\);@\1 = buf;@" > default/source3/modules/nfs41acl_xdr.c [ 210/4157] Generating nfs41acl-h 01:25:09 runner rpcgen -h ../source3/modules/nfs41acl.x > default/source3/modules/nfs41acl.h [ 211/4157] Generating perfcount_empty_c [ 212/4157] Generating rpc_empty_c [ 213/4157] Generating findsmb-script 01:25:09 runner sed -e "s#@PERL@#/usr/bin/env perl#" -e "s#@BINDIR@#/usr/bin#" ../source3/script/findsmb.in > default/source3/script/findsmb [ 214/4157] Generating idmap_ad_empty_c [ 215/4157] Generating idmap_hash_empty_c [ 216/4157] Generating nss_info_hash_empty_c [ 217/4157] Generating nss_info_rfc2307_empty_c [ 218/4157] Generating nss_info_sfu20_empty_c [ 219/4157] Generating nss_info_sfu_empty_c [ 220/4157] Generating INFILE_smb.service [ 221/4157] Generating INFILE_nmb.service [ 222/4157] Generating INFILE_winbind.service [ 223/4157] Generating INFILE_samba.service [ 224/4157] Generating ../heimdal/lib/asn1/der-protos.h [ 225/4157] Generating ../heimdal/lib/asn1/der-private.h 01:25:11 runner /usr/bin/perl "/tmp/B.zYV1cz/BUILD/samba-4.9.3/source4/heimdal/cf/make-proto.pl" -q -P comment -o "/tmp/B.zYV1cz/BUILD/samba-4.9.3/bin/default/source4/heimdal/lib/asn1/der-protos.h" ../source4/heimdal/lib/asn1/der_get.c ../source4/heimdal/lib/asn1/der_put.c ../source4/heimdal/lib/asn1/der_free.c ../source4/heimdal/lib/asn1/der_format.c ../source4/heimdal/lib/asn1/der_length.c ../source4/heimdal/lib/asn1/der_copy.c ../source4/heimdal/lib/asn1/der_cmp.c 01:25:11 runner /usr/bin/perl "/tmp/B.zYV1cz/BUILD/samba-4.9.3/source4/heimdal/cf/make-proto.pl" -q -P comment -p "/tmp/B.zYV1cz/BUILD/samba-4.9.3/bin/default/source4/heimdal/lib/asn1/der-private.h" ../source4/heimdal/lib/asn1/der_get.c ../source4/heimdal/lib/asn1/der_put.c ../source4/heimdal/lib/asn1/der_free.c ../source4/heimdal/lib/asn1/der_format.c ../source4/heimdal/lib/asn1/der_length.c ../source4/heimdal/lib/asn1/der_copy.c ../source4/heimdal/lib/asn1/der_cmp.c [ 226/4157] Compiling lib/replace/replace.c [ 227/4157] Compiling source4/heimdal/lib/roken/base64.c [ 228/4157] Compiling source4/heimdal/lib/roken/ct.c [ 229/4157] Compiling source4/heimdal/lib/roken/hex.c 01:25:12 runner i686-pld-linux-gcc -O2 -fwrapv -pipe -Wformat -Werror=format-security -gdwarf-4 -fno-debug-types-section -fvar-tracking-assignments -g2 -Wp,-D_FORTIFY_SOURCE=2 -fstack-protector-strong --param=ssp-buffer-size=4 -fomit-frame-pointer -march=i686 -fasynchronous-unwind-tables -mtune=pentium4 -gdwarf-4 -fno-debug-types-section -fvar-tracking-assignments -g2 -DSOCKET_WRAPPER_DISABLE=1 -D_SAMBA_HOSTCC_ -fPIC -D_LARGEFILE_SOURCE -D_FILE_OFFSET_BITS=64 -D_REENTRANT -D_POSIX_PTHREAD_SEMANTICS -DCTDB_HELPER_BINDIR="/usr/libexec/ctdb" -DLOGDIR="/var/log" -DCTDB_DATADIR="/usr/share/ctdb" -DCTDB_ETCDIR="/etc/ctdb" -DCTDB_VARDIR="/var/lib/ctdb" -DCTDB_RUNDIR="/var/run/ctdb" -fstack-clash-protection -DSTATIC_ROKEN_HOSTCC_MODULES=NULL -DSTATIC_ROKEN_HOSTCC_MODULES_PROTO=extern void __ROKEN_HOSTCC_dummy_module_proto(void) -MD -Idefault/source4/heimdal_build -I../source4/heimdal_build -Idefault/source4/heimdal/lib/roken -I../source4/heimdal/lib/roken -Idefault/include/public -I../include/public -Idefault/source4 -I../source4 -Idefault/lib -I../lib -Idefault/source4/lib -I../source4/lib -Idefault/source4/include -I../source4/include -Idefault/include -I../include -Idefault/lib/replace -I../lib/replace -Idefault/ctdb/include -I../ctdb/include -Idefault/ctdb -I../ctdb -Idefault -I.. -I/usr/local/include -D_SAMBA_BUILD_=4 -DHAVE_CONFIG_H=1 -D_GNU_SOURCE=1 -D_XOPEN_SOURCE_EXTENDED=1 ../source4/heimdal/lib/roken/hex.c -c -o default/source4/heimdal/lib/roken/hex_3.o 01:25:12 runner i686-pld-linux-gcc -O2 -fwrapv -pipe -Wformat -Werror=format-security -gdwarf-4 -fno-debug-types-section -fvar-tracking-assignments -g2 -Wp,-D_FORTIFY_SOURCE=2 -fstack-protector-strong --param=ssp-buffer-size=4 -fomit-frame-pointer -march=i686 -fasynchronous-unwind-tables -mtune=pentium4 -gdwarf-4 -fno-debug-types-section -fvar-tracking-assignments -g2 -DSOCKET_WRAPPER_DISABLE=1 -D_SAMBA_HOSTCC_ -fPIC -D_LARGEFILE_SOURCE -D_FILE_OFFSET_BITS=64 -D_REENTRANT -D_POSIX_PTHREAD_SEMANTICS -DCTDB_HELPER_BINDIR="/usr/libexec/ctdb" -DLOGDIR="/var/log" -DCTDB_DATADIR="/usr/share/ctdb" -DCTDB_ETCDIR="/etc/ctdb" -DCTDB_VARDIR="/var/lib/ctdb" -DCTDB_RUNDIR="/var/run/ctdb" -fstack-clash-protection -DSTATIC_ROKEN_HOSTCC_MODULES=NULL -DSTATIC_ROKEN_HOSTCC_MODULES_PROTO=extern void __ROKEN_HOSTCC_dummy_module_proto(void) -MD -Idefault/source4/heimdal_build -I../source4/heimdal_build -Idefault/source4/heimdal/lib/roken -I../source4/heimdal/lib/roken -Idefault/include/public -I../include/public -Idefault/source4 -I../source4 -Idefault/lib -I../lib -Idefault/source4/lib -I../source4/lib -Idefault/source4/include -I../source4/include -Idefault/include -I../include -Idefault/lib/replace -I../lib/replace -Idefault/ctdb/include -I../ctdb/include -Idefault/ctdb -I../ctdb -Idefault -I.. -I/usr/local/include -D_SAMBA_BUILD_=4 -DHAVE_CONFIG_H=1 -D_GNU_SOURCE=1 -D_XOPEN_SOURCE_EXTENDED=1 ../source4/heimdal/lib/roken/base64.c -c -o default/source4/heimdal/lib/roken/base64_3.o 01:25:12 runner i686-pld-linux-gcc -O2 -fwrapv -pipe -Wformat -Werror=format-security -gdwarf-4 -fno-debug-types-section -fvar-tracking-assignments -g2 -Wp,-D_FORTIFY_SOURCE=2 -fstack-protector-strong --param=ssp-buffer-size=4 -fomit-frame-pointer -march=i686 -fasynchronous-unwind-tables -mtune=pentium4 -gdwarf-4 -fno-debug-types-section -fvar-tracking-assignments -g2 -D_SAMBA_HOSTCC_ -fPIC -D_LARGEFILE_SOURCE -D_FILE_OFFSET_BITS=64 -D_REENTRANT -D_POSIX_PTHREAD_SEMANTICS -DCTDB_HELPER_BINDIR="/usr/libexec/ctdb" -DLOGDIR="/var/log" -DCTDB_DATADIR="/usr/share/ctdb" -DCTDB_ETCDIR="/etc/ctdb" -DCTDB_VARDIR="/var/lib/ctdb" -DCTDB_RUNDIR="/var/run/ctdb" -fstack-clash-protection -DSTATIC_LIBREPLACE_HOSTCC_MODULES=NULL -DSTATIC_LIBREPLACE_HOSTCC_MODULES_PROTO=extern void __LIBREPLACE_HOSTCC_dummy_module_proto(void) -MD -Idefault/lib/replace -I../lib/replace -Idefault/include/public -I../include/public -Idefault/source4 -I../source4 -Idefault/lib -I../lib -Idefault/source4/lib -I../source4/lib -Idefault/source4/include -I../source4/include -Idefault/include -I../include -Idefault/ctdb/include -I../ctdb/include -Idefault/ctdb -I../ctdb -Idefault -I.. -I/usr/local/include -D_SAMBA_BUILD_=4 -DHAVE_CONFIG_H=1 -D_GNU_SOURCE=1 -D_XOPEN_SOURCE_EXTENDED=1 ../lib/replace/replace.c -c -o default/lib/replace/replace_1.o [ 230/4157] Compiling source4/heimdal/lib/roken/bswap.c 01:25:12 runner i686-pld-linux-gcc -O2 -fwrapv -pipe -Wformat -Werror=format-security -gdwarf-4 -fno-debug-types-section -fvar-tracking-assignments -g2 -Wp,-D_FORTIFY_SOURCE=2 -fstack-protector-strong --param=ssp-buffer-size=4 -fomit-frame-pointer -march=i686 -fasynchronous-unwind-tables -mtune=pentium4 -gdwarf-4 -fno-debug-types-section -fvar-tracking-assignments -g2 -DSOCKET_WRAPPER_DISABLE=1 -D_SAMBA_HOSTCC_ -fPIC -D_LARGEFILE_SOURCE -D_FILE_OFFSET_BITS=64 -D_REENTRANT -D_POSIX_PTHREAD_SEMANTICS -DCTDB_HELPER_BINDIR="/usr/libexec/ctdb" -DLOGDIR="/var/log" -DCTDB_DATADIR="/usr/share/ctdb" -DCTDB_ETCDIR="/etc/ctdb" -DCTDB_VARDIR="/var/lib/ctdb" -DCTDB_RUNDIR="/var/run/ctdb" -fstack-clash-protection -DSTATIC_ROKEN_HOSTCC_MODULES=NULL -DSTATIC_ROKEN_HOSTCC_MODULES_PROTO=extern void __ROKEN_HOSTCC_dummy_module_proto(void) -MD -Idefault/source4/heimdal_build -I../source4/heimdal_build -Idefault/source4/heimdal/lib/roken -I../source4/heimdal/lib/roken -Idefault/include/public -I../include/public -Idefault/source4 -I../source4 -Idefault/lib -I../lib -Idefault/source4/lib -I../source4/lib -Idefault/source4/include -I../source4/include -Idefault/include -I../include -Idefault/lib/replace -I../lib/replace -Idefault/ctdb/include -I../ctdb/include -Idefault/ctdb -I../ctdb -Idefault -I.. -I/usr/local/include -D_SAMBA_BUILD_=4 -DHAVE_CONFIG_H=1 -D_GNU_SOURCE=1 -D_XOPEN_SOURCE_EXTENDED=1 ../source4/heimdal/lib/roken/ct.c -c -o default/source4/heimdal/lib/roken/ct_3.o [ 232/4157] Compiling source4/heimdal/lib/roken/emalloc.c [ 231/4157] Compiling source4/heimdal/lib/roken/dumpdata.c 01:25:12 runner i686-pld-linux-gcc -O2 -fwrapv -pipe -Wformat -Werror=format-security -gdwarf-4 -fno-debug-types-section -fvar-tracking-assignments -g2 -Wp,-D_FORTIFY_SOURCE=2 -fstack-protector-strong --param=ssp-buffer-size=4 -fomit-frame-pointer -march=i686 -fasynchronous-unwind-tables -mtune=pentium4 -gdwarf-4 -fno-debug-types-section -fvar-tracking-assignments -g2 -DSOCKET_WRAPPER_DISABLE=1 -D_SAMBA_HOSTCC_ -fPIC -D_LARGEFILE_SOURCE -D_FILE_OFFSET_BITS=64 -D_REENTRANT -D_POSIX_PTHREAD_SEMANTICS -DCTDB_HELPER_BINDIR="/usr/libexec/ctdb" -DLOGDIR="/var/log" -DCTDB_DATADIR="/usr/share/ctdb" -DCTDB_ETCDIR="/etc/ctdb" -DCTDB_VARDIR="/var/lib/ctdb" -DCTDB_RUNDIR="/var/run/ctdb" -fstack-clash-protection -DSTATIC_ROKEN_HOSTCC_MODULES=NULL -DSTATIC_ROKEN_HOSTCC_MODULES_PROTO=extern void __ROKEN_HOSTCC_dummy_module_proto(void) -MD -Idefault/source4/heimdal_build -I../source4/heimdal_build -Idefault/source4/heimdal/lib/roken -I../source4/heimdal/lib/roken -Idefault/include/public -I../include/public -Idefault/source4 -I../source4 -Idefault/lib -I../lib -Idefault/source4/lib -I../source4/lib -Idefault/source4/include -I../source4/include -Idefault/include -I../include -Idefault/lib/replace -I../lib/replace -Idefault/ctdb/include -I../ctdb/include -Idefault/ctdb -I../ctdb -Idefault -I.. -I/usr/local/include -D_SAMBA_BUILD_=4 -DHAVE_CONFIG_H=1 -D_GNU_SOURCE=1 -D_XOPEN_SOURCE_EXTENDED=1 ../source4/heimdal/lib/roken/bswap.c -c -o default/source4/heimdal/lib/roken/bswap_3.o [ 234/4157] Compiling source4/heimdal/lib/roken/getarg.c [ 233/4157] Compiling source4/heimdal/lib/roken/ecalloc.c 01:25:12 runner i686-pld-linux-gcc -O2 -fwrapv -pipe -Wformat -Werror=format-security -gdwarf-4 -fno-debug-types-section -fvar-tracking-assignments -g2 -Wp,-D_FORTIFY_SOURCE=2 -fstack-protector-strong --param=ssp-buffer-size=4 -fomit-frame-pointer -march=i686 -fasynchronous-unwind-tables -mtune=pentium4 -gdwarf-4 -fno-debug-types-section -fvar-tracking-assignments -g2 -DSOCKET_WRAPPER_DISABLE=1 -D_SAMBA_HOSTCC_ -fPIC -D_LARGEFILE_SOURCE -D_FILE_OFFSET_BITS=64 -D_REENTRANT -D_POSIX_PTHREAD_SEMANTICS -DCTDB_HELPER_BINDIR="/usr/libexec/ctdb" -DLOGDIR="/var/log" -DCTDB_DATADIR="/usr/share/ctdb" -DCTDB_ETCDIR="/etc/ctdb" -DCTDB_VARDIR="/var/lib/ctdb" -DCTDB_RUNDIR="/var/run/ctdb" -fstack-clash-protection -DSTATIC_ROKEN_HOSTCC_MODULES=NULL -DSTATIC_ROKEN_HOSTCC_MODULES_PROTO=extern void __ROKEN_HOSTCC_dummy_module_proto(void) -MD -Idefault/source4/heimdal_build -I../source4/heimdal_build -Idefault/source4/heimdal/lib/roken -I../source4/heimdal/lib/roken -Idefault/include/public -I../include/public -Idefault/source4 -I../source4 -Idefault/lib -I../lib -Idefault/source4/lib -I../source4/lib -Idefault/source4/include -I../source4/include -Idefault/include -I../include -Idefault/lib/replace -I../lib/replace -Idefault/ctdb/include -I../ctdb/include -Idefault/ctdb -I../ctdb -Idefault -I.. -I/usr/local/include -D_SAMBA_BUILD_=4 -DHAVE_CONFIG_H=1 -D_GNU_SOURCE=1 -D_XOPEN_SOURCE_EXTENDED=1 ../source4/heimdal/lib/roken/dumpdata.c -c -o default/source4/heimdal/lib/roken/dumpdata_3.o 01:25:12 runner i686-pld-linux-gcc -O2 -fwrapv -pipe -Wformat -Werror=format-security -gdwarf-4 -fno-debug-types-section -fvar-tracking-assignments -g2 -Wp,-D_FORTIFY_SOURCE=2 -fstack-protector-strong --param=ssp-buffer-size=4 -fomit-frame-pointer -march=i686 -fasynchronous-unwind-tables -mtune=pentium4 -gdwarf-4 -fno-debug-types-section -fvar-tracking-assignments -g2 -DSOCKET_WRAPPER_DISABLE=1 -D_SAMBA_HOSTCC_ -fPIC -D_LARGEFILE_SOURCE -D_FILE_OFFSET_BITS=64 -D_REENTRANT -D_POSIX_PTHREAD_SEMANTICS -DCTDB_HELPER_BINDIR="/usr/libexec/ctdb" -DLOGDIR="/var/log" -DCTDB_DATADIR="/usr/share/ctdb" -DCTDB_ETCDIR="/etc/ctdb" -DCTDB_VARDIR="/var/lib/ctdb" -DCTDB_RUNDIR="/var/run/ctdb" -fstack-clash-protection -DSTATIC_ROKEN_HOSTCC_MODULES=NULL -DSTATIC_ROKEN_HOSTCC_MODULES_PROTO=extern void __ROKEN_HOSTCC_dummy_module_proto(void) -MD -Idefault/source4/heimdal_build -I../source4/heimdal_build -Idefault/source4/heimdal/lib/roken -I../source4/heimdal/lib/roken -Idefault/include/public -I../include/public -Idefault/source4 -I../source4 -Idefault/lib -I../lib -Idefault/source4/lib -I../source4/lib -Idefault/source4/include -I../source4/include -Idefault/include -I../include -Idefault/lib/replace -I../lib/replace -Idefault/ctdb/include -I../ctdb/include -Idefault/ctdb -I../ctdb -Idefault -I.. -I/usr/local/include -D_SAMBA_BUILD_=4 -DHAVE_CONFIG_H=1 -D_GNU_SOURCE=1 -D_XOPEN_SOURCE_EXTENDED=1 ../source4/heimdal/lib/roken/emalloc.c -c -o default/source4/heimdal/lib/roken/emalloc_3.o 01:25:12 runner i686-pld-linux-gcc -O2 -fwrapv -pipe -Wformat -Werror=format-security -gdwarf-4 -fno-debug-types-section -fvar-tracking-assignments -g2 -Wp,-D_FORTIFY_SOURCE=2 -fstack-protector-strong --param=ssp-buffer-size=4 -fomit-frame-pointer -march=i686 -fasynchronous-unwind-tables -mtune=pentium4 -gdwarf-4 -fno-debug-types-section -fvar-tracking-assignments -g2 -DSOCKET_WRAPPER_DISABLE=1 -D_SAMBA_HOSTCC_ -fPIC -D_LARGEFILE_SOURCE -D_FILE_OFFSET_BITS=64 -D_REENTRANT -D_POSIX_PTHREAD_SEMANTICS -DCTDB_HELPER_BINDIR="/usr/libexec/ctdb" -DLOGDIR="/var/log" -DCTDB_DATADIR="/usr/share/ctdb" -DCTDB_ETCDIR="/etc/ctdb" -DCTDB_VARDIR="/var/lib/ctdb" -DCTDB_RUNDIR="/var/run/ctdb" -fstack-clash-protection -DSTATIC_ROKEN_HOSTCC_MODULES=NULL -DSTATIC_ROKEN_HOSTCC_MODULES_PROTO=extern void __ROKEN_HOSTCC_dummy_module_proto(void) -MD -Idefault/source4/heimdal_build -I../source4/heimdal_build -Idefault/source4/heimdal/lib/roken -I../source4/heimdal/lib/roken -Idefault/include/public -I../include/public -Idefault/source4 -I../source4 -Idefault/lib -I../lib -Idefault/source4/lib -I../source4/lib -Idefault/source4/include -I../source4/include -Idefault/include -I../include -Idefault/lib/replace -I../lib/replace -Idefault/ctdb/include -I../ctdb/include -Idefault/ctdb -I../ctdb -Idefault -I.. -I/usr/local/include -D_SAMBA_BUILD_=4 -DHAVE_CONFIG_H=1 -D_GNU_SOURCE=1 -D_XOPEN_SOURCE_EXTENDED=1 ../source4/heimdal/lib/roken/ecalloc.c -c -o default/source4/heimdal/lib/roken/ecalloc_3.o 01:25:12 runner i686-pld-linux-gcc -O2 -fwrapv -pipe -Wformat -Werror=format-security -gdwarf-4 -fno-debug-types-section -fvar-tracking-assignments -g2 -Wp,-D_FORTIFY_SOURCE=2 -fstack-protector-strong --param=ssp-buffer-size=4 -fomit-frame-pointer -march=i686 -fasynchronous-unwind-tables -mtune=pentium4 -gdwarf-4 -fno-debug-types-section -fvar-tracking-assignments -g2 -DSOCKET_WRAPPER_DISABLE=1 -D_SAMBA_HOSTCC_ -fPIC -D_LARGEFILE_SOURCE -D_FILE_OFFSET_BITS=64 -D_REENTRANT -D_POSIX_PTHREAD_SEMANTICS -DCTDB_HELPER_BINDIR="/usr/libexec/ctdb" -DLOGDIR="/var/log" -DCTDB_DATADIR="/usr/share/ctdb" -DCTDB_ETCDIR="/etc/ctdb" -DCTDB_VARDIR="/var/lib/ctdb" -DCTDB_RUNDIR="/var/run/ctdb" -fstack-clash-protection -DSTATIC_ROKEN_HOSTCC_MODULES=NULL -DSTATIC_ROKEN_HOSTCC_MODULES_PROTO=extern void __ROKEN_HOSTCC_dummy_module_proto(void) -MD -Idefault/source4/heimdal_build -I../source4/heimdal_build -Idefault/source4/heimdal/lib/roken -I../source4/heimdal/lib/roken -Idefault/include/public -I../include/public -Idefault/source4 -I../source4 -Idefault/lib -I../lib -Idefault/source4/lib -I../source4/lib -Idefault/source4/include -I../source4/include -Idefault/include -I../include -Idefault/lib/replace -I../lib/replace -Idefault/ctdb/include -I../ctdb/include -Idefault/ctdb -I../ctdb -Idefault -I.. -I/usr/local/include -D_SAMBA_BUILD_=4 -DHAVE_CONFIG_H=1 -D_GNU_SOURCE=1 -D_XOPEN_SOURCE_EXTENDED=1 ../source4/heimdal/lib/roken/getarg.c -c -o default/source4/heimdal/lib/roken/getarg_3.o [ 235/4157] Compiling source4/heimdal/lib/roken/get_window_size.c [ 236/4157] Compiling source4/heimdal/lib/roken/getdtablesize.c 01:25:12 runner i686-pld-linux-gcc -O2 -fwrapv -pipe -Wformat -Werror=format-security -gdwarf-4 -fno-debug-types-section -fvar-tracking-assignments -g2 -Wp,-D_FORTIFY_SOURCE=2 -fstack-protector-strong --param=ssp-buffer-size=4 -fomit-frame-pointer -march=i686 -fasynchronous-unwind-tables -mtune=pentium4 -gdwarf-4 -fno-debug-types-section -fvar-tracking-assignments -g2 -DSOCKET_WRAPPER_DISABLE=1 -D_SAMBA_HOSTCC_ -fPIC -D_LARGEFILE_SOURCE -D_FILE_OFFSET_BITS=64 -D_REENTRANT -D_POSIX_PTHREAD_SEMANTICS -DCTDB_HELPER_BINDIR="/usr/libexec/ctdb" -DLOGDIR="/var/log" -DCTDB_DATADIR="/usr/share/ctdb" -DCTDB_ETCDIR="/etc/ctdb" -DCTDB_VARDIR="/var/lib/ctdb" -DCTDB_RUNDIR="/var/run/ctdb" -fstack-clash-protection -DSTATIC_ROKEN_HOSTCC_MODULES=NULL -DSTATIC_ROKEN_HOSTCC_MODULES_PROTO=extern void __ROKEN_HOSTCC_dummy_module_proto(void) -MD -Idefault/source4/heimdal_build -I../source4/heimdal_build -Idefault/source4/heimdal/lib/roken -I../source4/heimdal/lib/roken -Idefault/include/public -I../include/public -Idefault/source4 -I../source4 -Idefault/lib -I../lib -Idefault/source4/lib -I../source4/lib -Idefault/source4/include -I../source4/include -Idefault/include -I../include -Idefault/lib/replace -I../lib/replace -Idefault/ctdb/include -I../ctdb/include -Idefault/ctdb -I../ctdb -Idefault -I.. -I/usr/local/include -D_SAMBA_BUILD_=4 -DHAVE_CONFIG_H=1 -D_GNU_SOURCE=1 -D_XOPEN_SOURCE_EXTENDED=1 ../source4/heimdal/lib/roken/getdtablesize.c -c -o default/source4/heimdal/lib/roken/getdtablesize_3.o ../lib/replace/replace.c: In function 'rep_setproctitle': ../lib/replace/replace.c:954:16: warning: ignoring return value of 'vasprintf', declared with attribute warn_unused_result [-Wunused-result] vasprintf(&title, fmt, args); ^~~~~~~~~~~~~~~~~~~~~~~~~~~~ 01:25:12 runner i686-pld-linux-gcc -O2 -fwrapv -pipe -Wformat -Werror=format-security -gdwarf-4 -fno-debug-types-section -fvar-tracking-assignments -g2 -Wp,-D_FORTIFY_SOURCE=2 -fstack-protector-strong --param=ssp-buffer-size=4 -fomit-frame-pointer -march=i686 -fasynchronous-unwind-tables -mtune=pentium4 -gdwarf-4 -fno-debug-types-section -fvar-tracking-assignments -g2 -DSOCKET_WRAPPER_DISABLE=1 -D_SAMBA_HOSTCC_ -fPIC -D_LARGEFILE_SOURCE -D_FILE_OFFSET_BITS=64 -D_REENTRANT -D_POSIX_PTHREAD_SEMANTICS -DCTDB_HELPER_BINDIR="/usr/libexec/ctdb" -DLOGDIR="/var/log" -DCTDB_DATADIR="/usr/share/ctdb" -DCTDB_ETCDIR="/etc/ctdb" -DCTDB_VARDIR="/var/lib/ctdb" -DCTDB_RUNDIR="/var/run/ctdb" -fstack-clash-protection -DSTATIC_ROKEN_HOSTCC_MODULES=NULL -DSTATIC_ROKEN_HOSTCC_MODULES_PROTO=extern void __ROKEN_HOSTCC_dummy_module_proto(void) -MD -Idefault/source4/heimdal_build -I../source4/heimdal_build -Idefault/source4/heimdal/lib/roken -I../source4/heimdal/lib/roken -Idefault/include/public -I../include/public -Idefault/source4 -I../source4 -Idefault/lib -I../lib -Idefault/source4/lib -I../source4/lib -Idefault/source4/include -I../source4/include -Idefault/include -I../include -Idefault/lib/replace -I../lib/replace -Idefault/ctdb/include -I../ctdb/include -Idefault/ctdb -I../ctdb -Idefault -I.. -I/usr/local/include -D_SAMBA_BUILD_=4 -DHAVE_CONFIG_H=1 -D_GNU_SOURCE=1 -D_XOPEN_SOURCE_EXTENDED=1 ../source4/heimdal/lib/roken/get_window_size.c -c -o default/source4/heimdal/lib/roken/get_window_size_3.o [ 237/4157] Compiling source4/heimdal/lib/roken/h_errno.c 01:25:12 runner i686-pld-linux-gcc -O2 -fwrapv -pipe -Wformat -Werror=format-security -gdwarf-4 -fno-debug-types-section -fvar-tracking-assignments -g2 -Wp,-D_FORTIFY_SOURCE=2 -fstack-protector-strong --param=ssp-buffer-size=4 -fomit-frame-pointer -march=i686 -fasynchronous-unwind-tables -mtune=pentium4 -gdwarf-4 -fno-debug-types-section -fvar-tracking-assignments -g2 -DSOCKET_WRAPPER_DISABLE=1 -D_SAMBA_HOSTCC_ -fPIC -D_LARGEFILE_SOURCE -D_FILE_OFFSET_BITS=64 -D_REENTRANT -D_POSIX_PTHREAD_SEMANTICS -DCTDB_HELPER_BINDIR="/usr/libexec/ctdb" -DLOGDIR="/var/log" -DCTDB_DATADIR="/usr/share/ctdb" -DCTDB_ETCDIR="/etc/ctdb" -DCTDB_VARDIR="/var/lib/ctdb" -DCTDB_RUNDIR="/var/run/ctdb" -fstack-clash-protection -DSTATIC_ROKEN_HOSTCC_MODULES=NULL -DSTATIC_ROKEN_HOSTCC_MODULES_PROTO=extern void __ROKEN_HOSTCC_dummy_module_proto(void) -MD -Idefault/source4/heimdal_build -I../source4/heimdal_build -Idefault/source4/heimdal/lib/roken -I../source4/heimdal/lib/roken -Idefault/include/public -I../include/public -Idefault/source4 -I../source4 -Idefault/lib -I../lib -Idefault/source4/lib -I../source4/lib -Idefault/source4/include -I../source4/include -Idefault/include -I../include -Idefault/lib/replace -I../lib/replace -Idefault/ctdb/include -I../ctdb/include -Idefault/ctdb -I../ctdb -Idefault -I.. -I/usr/local/include -D_SAMBA_BUILD_=4 -DHAVE_CONFIG_H=1 -D_GNU_SOURCE=1 -D_XOPEN_SOURCE_EXTENDED=1 ../source4/heimdal/lib/roken/h_errno.c -c -o default/source4/heimdal/lib/roken/h_errno_3.o [ 238/4157] Compiling source4/heimdal/lib/roken/issuid.c 01:25:12 runner i686-pld-linux-gcc -O2 -fwrapv -pipe -Wformat -Werror=format-security -gdwarf-4 -fno-debug-types-section -fvar-tracking-assignments -g2 -Wp,-D_FORTIFY_SOURCE=2 -fstack-protector-strong --param=ssp-buffer-size=4 -fomit-frame-pointer -march=i686 -fasynchronous-unwind-tables -mtune=pentium4 -gdwarf-4 -fno-debug-types-section -fvar-tracking-assignments -g2 -DSOCKET_WRAPPER_DISABLE=1 -D_SAMBA_HOSTCC_ -fPIC -D_LARGEFILE_SOURCE -D_FILE_OFFSET_BITS=64 -D_REENTRANT -D_POSIX_PTHREAD_SEMANTICS -DCTDB_HELPER_BINDIR="/usr/libexec/ctdb" -DLOGDIR="/var/log" -DCTDB_DATADIR="/usr/share/ctdb" -DCTDB_ETCDIR="/etc/ctdb" -DCTDB_VARDIR="/var/lib/ctdb" -DCTDB_RUNDIR="/var/run/ctdb" -fstack-clash-protection -DSTATIC_ROKEN_HOSTCC_MODULES=NULL -DSTATIC_ROKEN_HOSTCC_MODULES_PROTO=extern void __ROKEN_HOSTCC_dummy_module_proto(void) -MD -Idefault/source4/heimdal_build -I../source4/heimdal_build -Idefault/source4/heimdal/lib/roken -I../source4/heimdal/lib/roken -Idefault/include/public -I../include/public -Idefault/source4 -I../source4 -Idefault/lib -I../lib -Idefault/source4/lib -I../source4/lib -Idefault/source4/include -I../source4/include -Idefault/include -I../include -Idefault/lib/replace -I../lib/replace -Idefault/ctdb/include -I../ctdb/include -Idefault/ctdb -I../ctdb -Idefault -I.. -I/usr/local/include -D_SAMBA_BUILD_=4 -DHAVE_CONFIG_H=1 -D_GNU_SOURCE=1 -D_XOPEN_SOURCE_EXTENDED=1 ../source4/heimdal/lib/roken/issuid.c -c -o default/source4/heimdal/lib/roken/issuid_3.o [ 239/4157] Compiling source4/heimdal/lib/roken/net_read.c 01:25:12 runner i686-pld-linux-gcc -O2 -fwrapv -pipe -Wformat -Werror=format-security -gdwarf-4 -fno-debug-types-section -fvar-tracking-assignments -g2 -Wp,-D_FORTIFY_SOURCE=2 -fstack-protector-strong --param=ssp-buffer-size=4 -fomit-frame-pointer -march=i686 -fasynchronous-unwind-tables -mtune=pentium4 -gdwarf-4 -fno-debug-types-section -fvar-tracking-assignments -g2 -DSOCKET_WRAPPER_DISABLE=1 -D_SAMBA_HOSTCC_ -fPIC -D_LARGEFILE_SOURCE -D_FILE_OFFSET_BITS=64 -D_REENTRANT -D_POSIX_PTHREAD_SEMANTICS -DCTDB_HELPER_BINDIR="/usr/libexec/ctdb" -DLOGDIR="/var/log" -DCTDB_DATADIR="/usr/share/ctdb" -DCTDB_ETCDIR="/etc/ctdb" -DCTDB_VARDIR="/var/lib/ctdb" -DCTDB_RUNDIR="/var/run/ctdb" -fstack-clash-protection -DSTATIC_ROKEN_HOSTCC_MODULES=NULL -DSTATIC_ROKEN_HOSTCC_MODULES_PROTO=extern void __ROKEN_HOSTCC_dummy_module_proto(void) -MD -Idefault/source4/heimdal_build -I../source4/heimdal_build -Idefault/source4/heimdal/lib/roken -I../source4/heimdal/lib/roken -Idefault/include/public -I../include/public -Idefault/source4 -I../source4 -Idefault/lib -I../lib -Idefault/source4/lib -I../source4/lib -Idefault/source4/include -I../source4/include -Idefault/include -I../include -Idefault/lib/replace -I../lib/replace -Idefault/ctdb/include -I../ctdb/include -Idefault/ctdb -I../ctdb -Idefault -I.. -I/usr/local/include -D_SAMBA_BUILD_=4 -DHAVE_CONFIG_H=1 -D_GNU_SOURCE=1 -D_XOPEN_SOURCE_EXTENDED=1 ../source4/heimdal/lib/roken/net_read.c -c -o default/source4/heimdal/lib/roken/net_read_3.o [ 240/4157] Compiling source4/heimdal/lib/roken/net_write.c 01:25:12 runner i686-pld-linux-gcc -O2 -fwrapv -pipe -Wformat -Werror=format-security -gdwarf-4 -fno-debug-types-section -fvar-tracking-assignments -g2 -Wp,-D_FORTIFY_SOURCE=2 -fstack-protector-strong --param=ssp-buffer-size=4 -fomit-frame-pointer -march=i686 -fasynchronous-unwind-tables -mtune=pentium4 -gdwarf-4 -fno-debug-types-section -fvar-tracking-assignments -g2 -DSOCKET_WRAPPER_DISABLE=1 -D_SAMBA_HOSTCC_ -fPIC -D_LARGEFILE_SOURCE -D_FILE_OFFSET_BITS=64 -D_REENTRANT -D_POSIX_PTHREAD_SEMANTICS -DCTDB_HELPER_BINDIR="/usr/libexec/ctdb" -DLOGDIR="/var/log" -DCTDB_DATADIR="/usr/share/ctdb" -DCTDB_ETCDIR="/etc/ctdb" -DCTDB_VARDIR="/var/lib/ctdb" -DCTDB_RUNDIR="/var/run/ctdb" -fstack-clash-protection -DSTATIC_ROKEN_HOSTCC_MODULES=NULL -DSTATIC_ROKEN_HOSTCC_MODULES_PROTO=extern void __ROKEN_HOSTCC_dummy_module_proto(void) -MD -Idefault/source4/heimdal_build -I../source4/heimdal_build -Idefault/source4/heimdal/lib/roken -I../source4/heimdal/lib/roken -Idefault/include/public -I../include/public -Idefault/source4 -I../source4 -Idefault/lib -I../lib -Idefault/source4/lib -I../source4/lib -Idefault/source4/include -I../source4/include -Idefault/include -I../include -Idefault/lib/replace -I../lib/replace -Idefault/ctdb/include -I../ctdb/include -Idefault/ctdb -I../ctdb -Idefault -I.. -I/usr/local/include -D_SAMBA_BUILD_=4 -DHAVE_CONFIG_H=1 -D_GNU_SOURCE=1 -D_XOPEN_SOURCE_EXTENDED=1 ../source4/heimdal/lib/roken/net_write.c -c -o default/source4/heimdal/lib/roken/net_write_3.o [ 241/4157] Compiling source4/heimdal/lib/roken/parse_time.c 01:25:12 runner i686-pld-linux-gcc -O2 -fwrapv -pipe -Wformat -Werror=format-security -gdwarf-4 -fno-debug-types-section -fvar-tracking-assignments -g2 -Wp,-D_FORTIFY_SOURCE=2 -fstack-protector-strong --param=ssp-buffer-size=4 -fomit-frame-pointer -march=i686 -fasynchronous-unwind-tables -mtune=pentium4 -gdwarf-4 -fno-debug-types-section -fvar-tracking-assignments -g2 -DSOCKET_WRAPPER_DISABLE=1 -D_SAMBA_HOSTCC_ -fPIC -D_LARGEFILE_SOURCE -D_FILE_OFFSET_BITS=64 -D_REENTRANT -D_POSIX_PTHREAD_SEMANTICS -DCTDB_HELPER_BINDIR="/usr/libexec/ctdb" -DLOGDIR="/var/log" -DCTDB_DATADIR="/usr/share/ctdb" -DCTDB_ETCDIR="/etc/ctdb" -DCTDB_VARDIR="/var/lib/ctdb" -DCTDB_RUNDIR="/var/run/ctdb" -fstack-clash-protection -DSTATIC_ROKEN_HOSTCC_MODULES=NULL -DSTATIC_ROKEN_HOSTCC_MODULES_PROTO=extern void __ROKEN_HOSTCC_dummy_module_proto(void) -MD -Idefault/source4/heimdal_build -I../source4/heimdal_build -Idefault/source4/heimdal/lib/roken -I../source4/heimdal/lib/roken -Idefault/include/public -I../include/public -Idefault/source4 -I../source4 -Idefault/lib -I../lib -Idefault/source4/lib -I../source4/lib -Idefault/source4/include -I../source4/include -Idefault/include -I../include -Idefault/lib/replace -I../lib/replace -Idefault/ctdb/include -I../ctdb/include -Idefault/ctdb -I../ctdb -Idefault -I.. -I/usr/local/include -D_SAMBA_BUILD_=4 -DHAVE_CONFIG_H=1 -D_GNU_SOURCE=1 -D_XOPEN_SOURCE_EXTENDED=1 ../source4/heimdal/lib/roken/parse_time.c -c -o default/source4/heimdal/lib/roken/parse_time_3.o [ 242/4157] Compiling source4/heimdal/lib/roken/parse_units.c 01:25:12 runner i686-pld-linux-gcc -O2 -fwrapv -pipe -Wformat -Werror=format-security -gdwarf-4 -fno-debug-types-section -fvar-tracking-assignments -g2 -Wp,-D_FORTIFY_SOURCE=2 -fstack-protector-strong --param=ssp-buffer-size=4 -fomit-frame-pointer -march=i686 -fasynchronous-unwind-tables -mtune=pentium4 -gdwarf-4 -fno-debug-types-section -fvar-tracking-assignments -g2 -DSOCKET_WRAPPER_DISABLE=1 -D_SAMBA_HOSTCC_ -fPIC -D_LARGEFILE_SOURCE -D_FILE_OFFSET_BITS=64 -D_REENTRANT -D_POSIX_PTHREAD_SEMANTICS -DCTDB_HELPER_BINDIR="/usr/libexec/ctdb" -DLOGDIR="/var/log" -DCTDB_DATADIR="/usr/share/ctdb" -DCTDB_ETCDIR="/etc/ctdb" -DCTDB_VARDIR="/var/lib/ctdb" -DCTDB_RUNDIR="/var/run/ctdb" -fstack-clash-protection -DSTATIC_ROKEN_HOSTCC_MODULES=NULL -DSTATIC_ROKEN_HOSTCC_MODULES_PROTO=extern void __ROKEN_HOSTCC_dummy_module_proto(void) -MD -Idefault/source4/heimdal_build -I../source4/heimdal_build -Idefault/source4/heimdal/lib/roken -I../source4/heimdal/lib/roken -Idefault/include/public -I../include/public -Idefault/source4 -I../source4 -Idefault/lib -I../lib -Idefault/source4/lib -I../source4/lib -Idefault/source4/include -I../source4/include -Idefault/include -I../include -Idefault/lib/replace -I../lib/replace -Idefault/ctdb/include -I../ctdb/include -Idefault/ctdb -I../ctdb -Idefault -I.. -I/usr/local/include -D_SAMBA_BUILD_=4 -DHAVE_CONFIG_H=1 -D_GNU_SOURCE=1 -D_XOPEN_SOURCE_EXTENDED=1 ../source4/heimdal/lib/roken/parse_units.c -c -o default/source4/heimdal/lib/roken/parse_units_3.o [ 243/4157] Compiling source4/heimdal/lib/roken/vis.c 01:25:12 runner i686-pld-linux-gcc -O2 -fwrapv -pipe -Wformat -Werror=format-security -gdwarf-4 -fno-debug-types-section -fvar-tracking-assignments -g2 -Wp,-D_FORTIFY_SOURCE=2 -fstack-protector-strong --param=ssp-buffer-size=4 -fomit-frame-pointer -march=i686 -fasynchronous-unwind-tables -mtune=pentium4 -gdwarf-4 -fno-debug-types-section -fvar-tracking-assignments -g2 -DSOCKET_WRAPPER_DISABLE=1 -D_SAMBA_HOSTCC_ -fPIC -D_LARGEFILE_SOURCE -D_FILE_OFFSET_BITS=64 -D_REENTRANT -D_POSIX_PTHREAD_SEMANTICS -DCTDB_HELPER_BINDIR="/usr/libexec/ctdb" -DLOGDIR="/var/log" -DCTDB_DATADIR="/usr/share/ctdb" -DCTDB_ETCDIR="/etc/ctdb" -DCTDB_VARDIR="/var/lib/ctdb" -DCTDB_RUNDIR="/var/run/ctdb" -fstack-clash-protection -DSTATIC_ROKEN_HOSTCC_MODULES=NULL -DSTATIC_ROKEN_HOSTCC_MODULES_PROTO=extern void __ROKEN_HOSTCC_dummy_module_proto(void) -MD -Idefault/source4/heimdal_build -I../source4/heimdal_build -Idefault/source4/heimdal/lib/roken -I../source4/heimdal/lib/roken -Idefault/include/public -I../include/public -Idefault/source4 -I../source4 -Idefault/lib -I../lib -Idefault/source4/lib -I../source4/lib -Idefault/source4/include -I../source4/include -Idefault/include -I../include -Idefault/lib/replace -I../lib/replace -Idefault/ctdb/include -I../ctdb/include -Idefault/ctdb -I../ctdb -Idefault -I.. -I/usr/local/include -D_SAMBA_BUILD_=4 -DHAVE_CONFIG_H=1 -D_GNU_SOURCE=1 -D_XOPEN_SOURCE_EXTENDED=1 ../source4/heimdal/lib/roken/vis.c -c -o default/source4/heimdal/lib/roken/vis_3.o [ 244/4157] Compiling source4/heimdal/lib/roken/strlwr.c 01:25:12 runner i686-pld-linux-gcc -O2 -fwrapv -pipe -Wformat -Werror=format-security -gdwarf-4 -fno-debug-types-section -fvar-tracking-assignments -g2 -Wp,-D_FORTIFY_SOURCE=2 -fstack-protector-strong --param=ssp-buffer-size=4 -fomit-frame-pointer -march=i686 -fasynchronous-unwind-tables -mtune=pentium4 -gdwarf-4 -fno-debug-types-section -fvar-tracking-assignments -g2 -DSOCKET_WRAPPER_DISABLE=1 -D_SAMBA_HOSTCC_ -fPIC -D_LARGEFILE_SOURCE -D_FILE_OFFSET_BITS=64 -D_REENTRANT -D_POSIX_PTHREAD_SEMANTICS -DCTDB_HELPER_BINDIR="/usr/libexec/ctdb" -DLOGDIR="/var/log" -DCTDB_DATADIR="/usr/share/ctdb" -DCTDB_ETCDIR="/etc/ctdb" -DCTDB_VARDIR="/var/lib/ctdb" -DCTDB_RUNDIR="/var/run/ctdb" -fstack-clash-protection -DSTATIC_ROKEN_HOSTCC_MODULES=NULL -DSTATIC_ROKEN_HOSTCC_MODULES_PROTO=extern void __ROKEN_HOSTCC_dummy_module_proto(void) -MD -Idefault/source4/heimdal_build -I../source4/heimdal_build -Idefault/source4/heimdal/lib/roken -I../source4/heimdal/lib/roken -Idefault/include/public -I../include/public -Idefault/source4 -I../source4 -Idefault/lib -I../lib -Idefault/source4/lib -I../source4/lib -Idefault/source4/include -I../source4/include -Idefault/include -I../include -Idefault/lib/replace -I../lib/replace -Idefault/ctdb/include -I../ctdb/include -Idefault/ctdb -I../ctdb -Idefault -I.. -I/usr/local/include -D_SAMBA_BUILD_=4 -DHAVE_CONFIG_H=1 -D_GNU_SOURCE=1 -D_XOPEN_SOURCE_EXTENDED=1 ../source4/heimdal/lib/roken/strlwr.c -c -o default/source4/heimdal/lib/roken/strlwr_3.o [ 245/4157] Compiling source4/heimdal/lib/roken/strsep_copy.c 01:25:12 runner i686-pld-linux-gcc -O2 -fwrapv -pipe -Wformat -Werror=format-security -gdwarf-4 -fno-debug-types-section -fvar-tracking-assignments -g2 -Wp,-D_FORTIFY_SOURCE=2 -fstack-protector-strong --param=ssp-buffer-size=4 -fomit-frame-pointer -march=i686 -fasynchronous-unwind-tables -mtune=pentium4 -gdwarf-4 -fno-debug-types-section -fvar-tracking-assignments -g2 -DSOCKET_WRAPPER_DISABLE=1 -D_SAMBA_HOSTCC_ -fPIC -D_LARGEFILE_SOURCE -D_FILE_OFFSET_BITS=64 -D_REENTRANT -D_POSIX_PTHREAD_SEMANTICS -DCTDB_HELPER_BINDIR="/usr/libexec/ctdb" -DLOGDIR="/var/log" -DCTDB_DATADIR="/usr/share/ctdb" -DCTDB_ETCDIR="/etc/ctdb" -DCTDB_VARDIR="/var/lib/ctdb" -DCTDB_RUNDIR="/var/run/ctdb" -fstack-clash-protection -DSTATIC_ROKEN_HOSTCC_MODULES=NULL -DSTATIC_ROKEN_HOSTCC_MODULES_PROTO=extern void __ROKEN_HOSTCC_dummy_module_proto(void) -MD -Idefault/source4/heimdal_build -I../source4/heimdal_build -Idefault/source4/heimdal/lib/roken -I../source4/heimdal/lib/roken -Idefault/include/public -I../include/public -Idefault/source4 -I../source4 -Idefault/lib -I../lib -Idefault/source4/lib -I../source4/lib -Idefault/source4/include -I../source4/include -Idefault/include -I../include -Idefault/lib/replace -I../lib/replace -Idefault/ctdb/include -I../ctdb/include -Idefault/ctdb -I../ctdb -Idefault -I.. -I/usr/local/include -D_SAMBA_BUILD_=4 -DHAVE_CONFIG_H=1 -D_GNU_SOURCE=1 -D_XOPEN_SOURCE_EXTENDED=1 ../source4/heimdal/lib/roken/strsep_copy.c -c -o default/source4/heimdal/lib/roken/strsep_copy_3.o [ 246/4157] Compiling source4/heimdal/lib/roken/strsep.c 01:25:12 runner i686-pld-linux-gcc -O2 -fwrapv -pipe -Wformat -Werror=format-security -gdwarf-4 -fno-debug-types-section -fvar-tracking-assignments -g2 -Wp,-D_FORTIFY_SOURCE=2 -fstack-protector-strong --param=ssp-buffer-size=4 -fomit-frame-pointer -march=i686 -fasynchronous-unwind-tables -mtune=pentium4 -gdwarf-4 -fno-debug-types-section -fvar-tracking-assignments -g2 -DSOCKET_WRAPPER_DISABLE=1 -D_SAMBA_HOSTCC_ -fPIC -D_LARGEFILE_SOURCE -D_FILE_OFFSET_BITS=64 -D_REENTRANT -D_POSIX_PTHREAD_SEMANTICS -DCTDB_HELPER_BINDIR="/usr/libexec/ctdb" -DLOGDIR="/var/log" -DCTDB_DATADIR="/usr/share/ctdb" -DCTDB_ETCDIR="/etc/ctdb" -DCTDB_VARDIR="/var/lib/ctdb" -DCTDB_RUNDIR="/var/run/ctdb" -fstack-clash-protection -DSTATIC_ROKEN_HOSTCC_MODULES=NULL -DSTATIC_ROKEN_HOSTCC_MODULES_PROTO=extern void __ROKEN_HOSTCC_dummy_module_proto(void) -MD -Idefault/source4/heimdal_build -I../source4/heimdal_build -Idefault/source4/heimdal/lib/roken -I../source4/heimdal/lib/roken -Idefault/include/public -I../include/public -Idefault/source4 -I../source4 -Idefault/lib -I../lib -Idefault/source4/lib -I../source4/lib -Idefault/source4/include -I../source4/include -Idefault/include -I../include -Idefault/lib/replace -I../lib/replace -Idefault/ctdb/include -I../ctdb/include -Idefault/ctdb -I../ctdb -Idefault -I.. -I/usr/local/include -D_SAMBA_BUILD_=4 -DHAVE_CONFIG_H=1 -D_GNU_SOURCE=1 -D_XOPEN_SOURCE_EXTENDED=1 ../source4/heimdal/lib/roken/strsep.c -c -o default/source4/heimdal/lib/roken/strsep_3.o [ 247/4157] Compiling source4/heimdal/lib/roken/strupr.c 01:25:12 runner i686-pld-linux-gcc -O2 -fwrapv -pipe -Wformat -Werror=format-security -gdwarf-4 -fno-debug-types-section -fvar-tracking-assignments -g2 -Wp,-D_FORTIFY_SOURCE=2 -fstack-protector-strong --param=ssp-buffer-size=4 -fomit-frame-pointer -march=i686 -fasynchronous-unwind-tables -mtune=pentium4 -gdwarf-4 -fno-debug-types-section -fvar-tracking-assignments -g2 -DSOCKET_WRAPPER_DISABLE=1 -D_SAMBA_HOSTCC_ -fPIC -D_LARGEFILE_SOURCE -D_FILE_OFFSET_BITS=64 -D_REENTRANT -D_POSIX_PTHREAD_SEMANTICS -DCTDB_HELPER_BINDIR="/usr/libexec/ctdb" -DLOGDIR="/var/log" -DCTDB_DATADIR="/usr/share/ctdb" -DCTDB_ETCDIR="/etc/ctdb" -DCTDB_VARDIR="/var/lib/ctdb" -DCTDB_RUNDIR="/var/run/ctdb" -fstack-clash-protection -DSTATIC_ROKEN_HOSTCC_MODULES=NULL -DSTATIC_ROKEN_HOSTCC_MODULES_PROTO=extern void __ROKEN_HOSTCC_dummy_module_proto(void) -MD -Idefault/source4/heimdal_build -I../source4/heimdal_build -Idefault/source4/heimdal/lib/roken -I../source4/heimdal/lib/roken -Idefault/include/public -I../include/public -Idefault/source4 -I../source4 -Idefault/lib -I../lib -Idefault/source4/lib -I../source4/lib -Idefault/source4/include -I../source4/include -Idefault/include -I../include -Idefault/lib/replace -I../lib/replace -Idefault/ctdb/include -I../ctdb/include -Idefault/ctdb -I../ctdb -Idefault -I.. -I/usr/local/include -D_SAMBA_BUILD_=4 -DHAVE_CONFIG_H=1 -D_GNU_SOURCE=1 -D_XOPEN_SOURCE_EXTENDED=1 ../source4/heimdal/lib/roken/strupr.c -c -o default/source4/heimdal/lib/roken/strupr_3.o [ 248/4157] Compiling source4/heimdal/lib/roken/strpool.c 01:25:12 runner i686-pld-linux-gcc -O2 -fwrapv -pipe -Wformat -Werror=format-security -gdwarf-4 -fno-debug-types-section -fvar-tracking-assignments -g2 -Wp,-D_FORTIFY_SOURCE=2 -fstack-protector-strong --param=ssp-buffer-size=4 -fomit-frame-pointer -march=i686 -fasynchronous-unwind-tables -mtune=pentium4 -gdwarf-4 -fno-debug-types-section -fvar-tracking-assignments -g2 -DSOCKET_WRAPPER_DISABLE=1 -D_SAMBA_HOSTCC_ -fPIC -D_LARGEFILE_SOURCE -D_FILE_OFFSET_BITS=64 -D_REENTRANT -D_POSIX_PTHREAD_SEMANTICS -DCTDB_HELPER_BINDIR="/usr/libexec/ctdb" -DLOGDIR="/var/log" -DCTDB_DATADIR="/usr/share/ctdb" -DCTDB_ETCDIR="/etc/ctdb" -DCTDB_VARDIR="/var/lib/ctdb" -DCTDB_RUNDIR="/var/run/ctdb" -fstack-clash-protection -DSTATIC_ROKEN_HOSTCC_MODULES=NULL -DSTATIC_ROKEN_HOSTCC_MODULES_PROTO=extern void __ROKEN_HOSTCC_dummy_module_proto(void) -MD -Idefault/source4/heimdal_build -I../source4/heimdal_build -Idefault/source4/heimdal/lib/roken -I../source4/heimdal/lib/roken -Idefault/include/public -I../include/public -Idefault/source4 -I../source4 -Idefault/lib -I../lib -Idefault/source4/lib -I../source4/lib -Idefault/source4/include -I../source4/include -Idefault/include -I../include -Idefault/lib/replace -I../lib/replace -Idefault/ctdb/include -I../ctdb/include -Idefault/ctdb -I../ctdb -Idefault -I.. -I/usr/local/include -D_SAMBA_BUILD_=4 -DHAVE_CONFIG_H=1 -D_GNU_SOURCE=1 -D_XOPEN_SOURCE_EXTENDED=1 ../source4/heimdal/lib/roken/strpool.c -c -o default/source4/heimdal/lib/roken/strpool_3.o [ 249/4157] Compiling source4/heimdal/lib/roken/estrdup.c 01:25:12 runner i686-pld-linux-gcc -O2 -fwrapv -pipe -Wformat -Werror=format-security -gdwarf-4 -fno-debug-types-section -fvar-tracking-assignments -g2 -Wp,-D_FORTIFY_SOURCE=2 -fstack-protector-strong --param=ssp-buffer-size=4 -fomit-frame-pointer -march=i686 -fasynchronous-unwind-tables -mtune=pentium4 -gdwarf-4 -fno-debug-types-section -fvar-tracking-assignments -g2 -DSOCKET_WRAPPER_DISABLE=1 -D_SAMBA_HOSTCC_ -fPIC -D_LARGEFILE_SOURCE -D_FILE_OFFSET_BITS=64 -D_REENTRANT -D_POSIX_PTHREAD_SEMANTICS -DCTDB_HELPER_BINDIR="/usr/libexec/ctdb" -DLOGDIR="/var/log" -DCTDB_DATADIR="/usr/share/ctdb" -DCTDB_ETCDIR="/etc/ctdb" -DCTDB_VARDIR="/var/lib/ctdb" -DCTDB_RUNDIR="/var/run/ctdb" -fstack-clash-protection -DSTATIC_ROKEN_HOSTCC_MODULES=NULL -DSTATIC_ROKEN_HOSTCC_MODULES_PROTO=extern void __ROKEN_HOSTCC_dummy_module_proto(void) -MD -Idefault/source4/heimdal_build -I../source4/heimdal_build -Idefault/source4/heimdal/lib/roken -I../source4/heimdal/lib/roken -Idefault/include/public -I../include/public -Idefault/source4 -I../source4 -Idefault/lib -I../lib -Idefault/source4/lib -I../source4/lib -Idefault/source4/include -I../source4/include -Idefault/include -I../include -Idefault/lib/replace -I../lib/replace -Idefault/ctdb/include -I../ctdb/include -Idefault/ctdb -I../ctdb -Idefault -I.. -I/usr/local/include -D_SAMBA_BUILD_=4 -DHAVE_CONFIG_H=1 -D_GNU_SOURCE=1 -D_XOPEN_SOURCE_EXTENDED=1 ../source4/heimdal/lib/roken/estrdup.c -c -o default/source4/heimdal/lib/roken/estrdup_3.o [ 250/4157] Compiling source4/heimdal/lib/roken/erealloc.c 01:25:12 runner i686-pld-linux-gcc -O2 -fwrapv -pipe -Wformat -Werror=format-security -gdwarf-4 -fno-debug-types-section -fvar-tracking-assignments -g2 -Wp,-D_FORTIFY_SOURCE=2 -fstack-protector-strong --param=ssp-buffer-size=4 -fomit-frame-pointer -march=i686 -fasynchronous-unwind-tables -mtune=pentium4 -gdwarf-4 -fno-debug-types-section -fvar-tracking-assignments -g2 -DSOCKET_WRAPPER_DISABLE=1 -D_SAMBA_HOSTCC_ -fPIC -D_LARGEFILE_SOURCE -D_FILE_OFFSET_BITS=64 -D_REENTRANT -D_POSIX_PTHREAD_SEMANTICS -DCTDB_HELPER_BINDIR="/usr/libexec/ctdb" -DLOGDIR="/var/log" -DCTDB_DATADIR="/usr/share/ctdb" -DCTDB_ETCDIR="/etc/ctdb" -DCTDB_VARDIR="/var/lib/ctdb" -DCTDB_RUNDIR="/var/run/ctdb" -fstack-clash-protection -DSTATIC_ROKEN_HOSTCC_MODULES=NULL -DSTATIC_ROKEN_HOSTCC_MODULES_PROTO=extern void __ROKEN_HOSTCC_dummy_module_proto(void) -MD -Idefault/source4/heimdal_build -I../source4/heimdal_build -Idefault/source4/heimdal/lib/roken -I../source4/heimdal/lib/roken -Idefault/include/public -I../include/public -Idefault/source4 -I../source4 -Idefault/lib -I../lib -Idefault/source4/lib -I../source4/lib -Idefault/source4/include -I../source4/include -Idefault/include -I../include -Idefault/lib/replace -I../lib/replace -Idefault/ctdb/include -I../ctdb/include -Idefault/ctdb -I../ctdb -Idefault -I.. -I/usr/local/include -D_SAMBA_BUILD_=4 -DHAVE_CONFIG_H=1 -D_GNU_SOURCE=1 -D_XOPEN_SOURCE_EXTENDED=1 ../source4/heimdal/lib/roken/erealloc.c -c -o default/source4/heimdal/lib/roken/erealloc_3.o [ 251/4157] Compiling source4/heimdal/lib/roken/simple_exec.c 01:25:12 runner i686-pld-linux-gcc -O2 -fwrapv -pipe -Wformat -Werror=format-security -gdwarf-4 -fno-debug-types-section -fvar-tracking-assignments -g2 -Wp,-D_FORTIFY_SOURCE=2 -fstack-protector-strong --param=ssp-buffer-size=4 -fomit-frame-pointer -march=i686 -fasynchronous-unwind-tables -mtune=pentium4 -gdwarf-4 -fno-debug-types-section -fvar-tracking-assignments -g2 -DSOCKET_WRAPPER_DISABLE=1 -D_SAMBA_HOSTCC_ -fPIC -D_LARGEFILE_SOURCE -D_FILE_OFFSET_BITS=64 -D_REENTRANT -D_POSIX_PTHREAD_SEMANTICS -DCTDB_HELPER_BINDIR="/usr/libexec/ctdb" -DLOGDIR="/var/log" -DCTDB_DATADIR="/usr/share/ctdb" -DCTDB_ETCDIR="/etc/ctdb" -DCTDB_VARDIR="/var/lib/ctdb" -DCTDB_RUNDIR="/var/run/ctdb" -fstack-clash-protection -DSTATIC_ROKEN_HOSTCC_MODULES=NULL -DSTATIC_ROKEN_HOSTCC_MODULES_PROTO=extern void __ROKEN_HOSTCC_dummy_module_proto(void) -MD -Idefault/source4/heimdal_build -I../source4/heimdal_build -Idefault/source4/heimdal/lib/roken -I../source4/heimdal/lib/roken -Idefault/include/public -I../include/public -Idefault/source4 -I../source4 -Idefault/lib -I../lib -Idefault/source4/lib -I../source4/lib -Idefault/source4/include -I../source4/include -Idefault/include -I../include -Idefault/lib/replace -I../lib/replace -Idefault/ctdb/include -I../ctdb/include -Idefault/ctdb -I../ctdb -Idefault -I.. -I/usr/local/include -D_SAMBA_BUILD_=4 -DHAVE_CONFIG_H=1 -D_GNU_SOURCE=1 -D_XOPEN_SOURCE_EXTENDED=1 ../source4/heimdal/lib/roken/simple_exec.c -c -o default/source4/heimdal/lib/roken/simple_exec_3.o [ 252/4157] Compiling source4/heimdal/lib/roken/strcollect.c 01:25:12 runner i686-pld-linux-gcc -O2 -fwrapv -pipe -Wformat -Werror=format-security -gdwarf-4 -fno-debug-types-section -fvar-tracking-assignments -g2 -Wp,-D_FORTIFY_SOURCE=2 -fstack-protector-strong --param=ssp-buffer-size=4 -fomit-frame-pointer -march=i686 -fasynchronous-unwind-tables -mtune=pentium4 -gdwarf-4 -fno-debug-types-section -fvar-tracking-assignments -g2 -DSOCKET_WRAPPER_DISABLE=1 -D_SAMBA_HOSTCC_ -fPIC -D_LARGEFILE_SOURCE -D_FILE_OFFSET_BITS=64 -D_REENTRANT -D_POSIX_PTHREAD_SEMANTICS -DCTDB_HELPER_BINDIR="/usr/libexec/ctdb" -DLOGDIR="/var/log" -DCTDB_DATADIR="/usr/share/ctdb" -DCTDB_ETCDIR="/etc/ctdb" -DCTDB_VARDIR="/var/lib/ctdb" -DCTDB_RUNDIR="/var/run/ctdb" -fstack-clash-protection -DSTATIC_ROKEN_HOSTCC_MODULES=NULL -DSTATIC_ROKEN_HOSTCC_MODULES_PROTO=extern void __ROKEN_HOSTCC_dummy_module_proto(void) -MD -Idefault/source4/heimdal_build -I../source4/heimdal_build -Idefault/source4/heimdal/lib/roken -I../source4/heimdal/lib/roken -Idefault/include/public -I../include/public -Idefault/source4 -I../source4 -Idefault/lib -I../lib -Idefault/source4/lib -I../source4/lib -Idefault/source4/include -I../source4/include -Idefault/include -I../include -Idefault/lib/replace -I../lib/replace -Idefault/ctdb/include -I../ctdb/include -Idefault/ctdb -I../ctdb -Idefault -I.. -I/usr/local/include -D_SAMBA_BUILD_=4 -DHAVE_CONFIG_H=1 -D_GNU_SOURCE=1 -D_XOPEN_SOURCE_EXTENDED=1 ../source4/heimdal/lib/roken/strcollect.c -c -o default/source4/heimdal/lib/roken/strcollect_3.o [ 253/4157] Compiling source4/heimdal/lib/roken/rtbl.c 01:25:12 runner i686-pld-linux-gcc -O2 -fwrapv -pipe -Wformat -Werror=format-security -gdwarf-4 -fno-debug-types-section -fvar-tracking-assignments -g2 -Wp,-D_FORTIFY_SOURCE=2 -fstack-protector-strong --param=ssp-buffer-size=4 -fomit-frame-pointer -march=i686 -fasynchronous-unwind-tables -mtune=pentium4 -gdwarf-4 -fno-debug-types-section -fvar-tracking-assignments -g2 -DSOCKET_WRAPPER_DISABLE=1 -D_SAMBA_HOSTCC_ -fPIC -D_LARGEFILE_SOURCE -D_FILE_OFFSET_BITS=64 -D_REENTRANT -D_POSIX_PTHREAD_SEMANTICS -DCTDB_HELPER_BINDIR="/usr/libexec/ctdb" -DLOGDIR="/var/log" -DCTDB_DATADIR="/usr/share/ctdb" -DCTDB_ETCDIR="/etc/ctdb" -DCTDB_VARDIR="/var/lib/ctdb" -DCTDB_RUNDIR="/var/run/ctdb" -fstack-clash-protection -DSTATIC_ROKEN_HOSTCC_MODULES=NULL -DSTATIC_ROKEN_HOSTCC_MODULES_PROTO=extern void __ROKEN_HOSTCC_dummy_module_proto(void) -MD -Idefault/source4/heimdal_build -I../source4/heimdal_build -Idefault/source4/heimdal/lib/roken -I../source4/heimdal/lib/roken -Idefault/include/public -I../include/public -Idefault/source4 -I../source4 -Idefault/lib -I../lib -Idefault/source4/lib -I../source4/lib -Idefault/source4/include -I../source4/include -Idefault/include -I../include -Idefault/lib/replace -I../lib/replace -Idefault/ctdb/include -I../ctdb/include -Idefault/ctdb -I../ctdb -Idefault -I.. -I/usr/local/include -D_SAMBA_BUILD_=4 -DHAVE_CONFIG_H=1 -D_GNU_SOURCE=1 -D_XOPEN_SOURCE_EXTENDED=1 ../source4/heimdal/lib/roken/rtbl.c -c -o default/source4/heimdal/lib/roken/rtbl_3.o [ 254/4157] Compiling source4/heimdal/lib/roken/rand.c 01:25:12 runner i686-pld-linux-gcc -O2 -fwrapv -pipe -Wformat -Werror=format-security -gdwarf-4 -fno-debug-types-section -fvar-tracking-assignments -g2 -Wp,-D_FORTIFY_SOURCE=2 -fstack-protector-strong --param=ssp-buffer-size=4 -fomit-frame-pointer -march=i686 -fasynchronous-unwind-tables -mtune=pentium4 -gdwarf-4 -fno-debug-types-section -fvar-tracking-assignments -g2 -DSOCKET_WRAPPER_DISABLE=1 -D_SAMBA_HOSTCC_ -fPIC -D_LARGEFILE_SOURCE -D_FILE_OFFSET_BITS=64 -D_REENTRANT -D_POSIX_PTHREAD_SEMANTICS -DCTDB_HELPER_BINDIR="/usr/libexec/ctdb" -DLOGDIR="/var/log" -DCTDB_DATADIR="/usr/share/ctdb" -DCTDB_ETCDIR="/etc/ctdb" -DCTDB_VARDIR="/var/lib/ctdb" -DCTDB_RUNDIR="/var/run/ctdb" -fstack-clash-protection -DSTATIC_ROKEN_HOSTCC_MODULES=NULL -DSTATIC_ROKEN_HOSTCC_MODULES_PROTO=extern void __ROKEN_HOSTCC_dummy_module_proto(void) -MD -Idefault/source4/heimdal_build -I../source4/heimdal_build -Idefault/source4/heimdal/lib/roken -I../source4/heimdal/lib/roken -Idefault/include/public -I../include/public -Idefault/source4 -I../source4 -Idefault/lib -I../lib -Idefault/source4/lib -I../source4/lib -Idefault/source4/include -I../source4/include -Idefault/include -I../include -Idefault/lib/replace -I../lib/replace -Idefault/ctdb/include -I../ctdb/include -Idefault/ctdb -I../ctdb -Idefault -I.. -I/usr/local/include -D_SAMBA_BUILD_=4 -DHAVE_CONFIG_H=1 -D_GNU_SOURCE=1 -D_XOPEN_SOURCE_EXTENDED=1 ../source4/heimdal/lib/roken/rand.c -c -o default/source4/heimdal/lib/roken/rand_3.o [ 255/4157] Compiling source4/heimdal/lib/roken/cloexec.c 01:25:12 runner i686-pld-linux-gcc -O2 -fwrapv -pipe -Wformat -Werror=format-security -gdwarf-4 -fno-debug-types-section -fvar-tracking-assignments -g2 -Wp,-D_FORTIFY_SOURCE=2 -fstack-protector-strong --param=ssp-buffer-size=4 -fomit-frame-pointer -march=i686 -fasynchronous-unwind-tables -mtune=pentium4 -gdwarf-4 -fno-debug-types-section -fvar-tracking-assignments -g2 -DSOCKET_WRAPPER_DISABLE=1 -D_SAMBA_HOSTCC_ -fPIC -D_LARGEFILE_SOURCE -D_FILE_OFFSET_BITS=64 -D_REENTRANT -D_POSIX_PTHREAD_SEMANTICS -DCTDB_HELPER_BINDIR="/usr/libexec/ctdb" -DLOGDIR="/var/log" -DCTDB_DATADIR="/usr/share/ctdb" -DCTDB_ETCDIR="/etc/ctdb" -DCTDB_VARDIR="/var/lib/ctdb" -DCTDB_RUNDIR="/var/run/ctdb" -fstack-clash-protection -DSTATIC_ROKEN_HOSTCC_MODULES=NULL -DSTATIC_ROKEN_HOSTCC_MODULES_PROTO=extern void __ROKEN_HOSTCC_dummy_module_proto(void) -MD -Idefault/source4/heimdal_build -I../source4/heimdal_build -Idefault/source4/heimdal/lib/roken -I../source4/heimdal/lib/roken -Idefault/include/public -I../include/public -Idefault/source4 -I../source4 -Idefault/lib -I../lib -Idefault/source4/lib -I../source4/lib -Idefault/source4/include -I../source4/include -Idefault/include -I../include -Idefault/lib/replace -I../lib/replace -Idefault/ctdb/include -I../ctdb/include -Idefault/ctdb -I../ctdb -Idefault -I.. -I/usr/local/include -D_SAMBA_BUILD_=4 -DHAVE_CONFIG_H=1 -D_GNU_SOURCE=1 -D_XOPEN_SOURCE_EXTENDED=1 ../source4/heimdal/lib/roken/cloexec.c -c -o default/source4/heimdal/lib/roken/cloexec_3.o [ 256/4157] Compiling source4/heimdal/lib/roken/xfree.c 01:25:12 runner i686-pld-linux-gcc -O2 -fwrapv -pipe -Wformat -Werror=format-security -gdwarf-4 -fno-debug-types-section -fvar-tracking-assignments -g2 -Wp,-D_FORTIFY_SOURCE=2 -fstack-protector-strong --param=ssp-buffer-size=4 -fomit-frame-pointer -march=i686 -fasynchronous-unwind-tables -mtune=pentium4 -gdwarf-4 -fno-debug-types-section -fvar-tracking-assignments -g2 -DSOCKET_WRAPPER_DISABLE=1 -D_SAMBA_HOSTCC_ -fPIC -D_LARGEFILE_SOURCE -D_FILE_OFFSET_BITS=64 -D_REENTRANT -D_POSIX_PTHREAD_SEMANTICS -DCTDB_HELPER_BINDIR="/usr/libexec/ctdb" -DLOGDIR="/var/log" -DCTDB_DATADIR="/usr/share/ctdb" -DCTDB_ETCDIR="/etc/ctdb" -DCTDB_VARDIR="/var/lib/ctdb" -DCTDB_RUNDIR="/var/run/ctdb" -fstack-clash-protection -DSTATIC_ROKEN_HOSTCC_MODULES=NULL -DSTATIC_ROKEN_HOSTCC_MODULES_PROTO=extern void __ROKEN_HOSTCC_dummy_module_proto(void) -MD -Idefault/source4/heimdal_build -I../source4/heimdal_build -Idefault/source4/heimdal/lib/roken -I../source4/heimdal/lib/roken -Idefault/include/public -I../include/public -Idefault/source4 -I../source4 -Idefault/lib -I../lib -Idefault/source4/lib -I../source4/lib -Idefault/source4/include -I../source4/include -Idefault/include -I../include -Idefault/lib/replace -I../lib/replace -Idefault/ctdb/include -I../ctdb/include -Idefault/ctdb -I../ctdb -Idefault -I.. -I/usr/local/include -D_SAMBA_BUILD_=4 -DHAVE_CONFIG_H=1 -D_GNU_SOURCE=1 -D_XOPEN_SOURCE_EXTENDED=1 ../source4/heimdal/lib/roken/xfree.c -c -o default/source4/heimdal/lib/roken/xfree_3.o ../source4/heimdal/lib/roken/simple_exec.c: In function 'rk_pipe_execv': ../source4/heimdal/lib/roken/simple_exec.c:153:2: warning: ignoring return value of 'pipe', declared with attribute warn_unused_result [-Wunused-result] pipe(in_fd); ^~~~~~~~~~~ ../source4/heimdal/lib/roken/simple_exec.c:155:2: warning: ignoring return value of 'pipe', declared with attribute warn_unused_result [-Wunused-result] pipe(out_fd); ^~~~~~~~~~~~ ../source4/heimdal/lib/roken/simple_exec.c:157:2: warning: ignoring return value of 'pipe', declared with attribute warn_unused_result [-Wunused-result] pipe(err_fd); ^~~~~~~~~~~~ [ 257/4157] Compiling source4/heimdal_build/replace.c [ 258/4157] Compiling source4/heimdal/lib/roken/closefrom.c 01:25:12 runner i686-pld-linux-gcc -O2 -fwrapv -pipe -Wformat -Werror=format-security -gdwarf-4 -fno-debug-types-section -fvar-tracking-assignments -g2 -Wp,-D_FORTIFY_SOURCE=2 -fstack-protector-strong --param=ssp-buffer-size=4 -fomit-frame-pointer -march=i686 -fasynchronous-unwind-tables -mtune=pentium4 -gdwarf-4 -fno-debug-types-section -fvar-tracking-assignments -g2 -DSOCKET_WRAPPER_DISABLE=1 -D_SAMBA_HOSTCC_ -fPIC -D_LARGEFILE_SOURCE -D_FILE_OFFSET_BITS=64 -D_REENTRANT -D_POSIX_PTHREAD_SEMANTICS -DCTDB_HELPER_BINDIR="/usr/libexec/ctdb" -DLOGDIR="/var/log" -DCTDB_DATADIR="/usr/share/ctdb" -DCTDB_ETCDIR="/etc/ctdb" -DCTDB_VARDIR="/var/lib/ctdb" -DCTDB_RUNDIR="/var/run/ctdb" -fstack-clash-protection -DSTATIC_ROKEN_HOSTCC_MODULES=NULL -DSTATIC_ROKEN_HOSTCC_MODULES_PROTO=extern void __ROKEN_HOSTCC_dummy_module_proto(void) -MD -Idefault/source4/heimdal_build -I../source4/heimdal_build -Idefault/source4/heimdal/lib/roken -I../source4/heimdal/lib/roken -Idefault/include/public -I../include/public -Idefault/source4 -I../source4 -Idefault/lib -I../lib -Idefault/source4/lib -I../source4/lib -Idefault/source4/include -I../source4/include -Idefault/include -I../include -Idefault/lib/replace -I../lib/replace -Idefault/ctdb/include -I../ctdb/include -Idefault/ctdb -I../ctdb -Idefault -I.. -I/usr/local/include -D_SAMBA_BUILD_=4 -DHAVE_CONFIG_H=1 -D_GNU_SOURCE=1 -D_XOPEN_SOURCE_EXTENDED=1 ../source4/heimdal_build/replace.c -c -o default/source4/heimdal_build/replace_3.o 01:25:12 runner i686-pld-linux-gcc -O2 -fwrapv -pipe -Wformat -Werror=format-security -gdwarf-4 -fno-debug-types-section -fvar-tracking-assignments -g2 -Wp,-D_FORTIFY_SOURCE=2 -fstack-protector-strong --param=ssp-buffer-size=4 -fomit-frame-pointer -march=i686 -fasynchronous-unwind-tables -mtune=pentium4 -gdwarf-4 -fno-debug-types-section -fvar-tracking-assignments -g2 -DSOCKET_WRAPPER_DISABLE=1 -D_SAMBA_HOSTCC_ -fPIC -D_LARGEFILE_SOURCE -D_FILE_OFFSET_BITS=64 -D_REENTRANT -D_POSIX_PTHREAD_SEMANTICS -DCTDB_HELPER_BINDIR="/usr/libexec/ctdb" -DLOGDIR="/var/log" -DCTDB_DATADIR="/usr/share/ctdb" -DCTDB_ETCDIR="/etc/ctdb" -DCTDB_VARDIR="/var/lib/ctdb" -DCTDB_RUNDIR="/var/run/ctdb" -fstack-clash-protection -DSTATIC_ROKEN_HOSTCC_MODULES=NULL -DSTATIC_ROKEN_HOSTCC_MODULES_PROTO=extern void __ROKEN_HOSTCC_dummy_module_proto(void) -MD -Idefault/source4/heimdal_build -I../source4/heimdal_build -Idefault/source4/heimdal/lib/roken -I../source4/heimdal/lib/roken -Idefault/include/public -I../include/public -Idefault/source4 -I../source4 -Idefault/lib -I../lib -Idefault/source4/lib -I../source4/lib -Idefault/source4/include -I../source4/include -Idefault/include -I../include -Idefault/lib/replace -I../lib/replace -Idefault/ctdb/include -I../ctdb/include -Idefault/ctdb -I../ctdb -Idefault -I.. -I/usr/local/include -D_SAMBA_BUILD_=4 -DHAVE_CONFIG_H=1 -D_GNU_SOURCE=1 -D_XOPEN_SOURCE_EXTENDED=1 ../source4/heimdal/lib/roken/closefrom.c -c -o default/source4/heimdal/lib/roken/closefrom_3.o [ 259/4157] Compiling source4/heimdal/lib/vers/print_version.c [ 260/4157] Compiling source4/heimdal_build/version.c 01:25:13 runner i686-pld-linux-gcc -O2 -fwrapv -pipe -Wformat -Werror=format-security -gdwarf-4 -fno-debug-types-section -fvar-tracking-assignments -g2 -Wp,-D_FORTIFY_SOURCE=2 -fstack-protector-strong --param=ssp-buffer-size=4 -fomit-frame-pointer -march=i686 -fasynchronous-unwind-tables -mtune=pentium4 -gdwarf-4 -fno-debug-types-section -fvar-tracking-assignments -g2 -fPIC -D_LARGEFILE_SOURCE -D_FILE_OFFSET_BITS=64 -D_REENTRANT -D_POSIX_PTHREAD_SEMANTICS -DCTDB_HELPER_BINDIR="/usr/libexec/ctdb" -DLOGDIR="/var/log" -DCTDB_DATADIR="/usr/share/ctdb" -DCTDB_ETCDIR="/etc/ctdb" -DCTDB_VARDIR="/var/lib/ctdb" -DCTDB_RUNDIR="/var/run/ctdb" -fstack-clash-protection -DSTATIC_HEIMDAL_VERS_HOSTCC_MODULES=NULL -DSTATIC_HEIMDAL_VERS_HOSTCC_MODULES_PROTO=extern void __HEIMDAL_VERS_HOSTCC_dummy_module_proto(void) -MD -Idefault/source4/heimdal_build -I../source4/heimdal_build -Idefault/include/public -I../include/public -Idefault/source4 -I../source4 -Idefault/lib -I../lib -Idefault/source4/lib -I../source4/lib -Idefault/source4/include -I../source4/include -Idefault/include -I../include -Idefault/lib/replace -I../lib/replace -Idefault/ctdb/include -I../ctdb/include -Idefault/ctdb -I../ctdb -Idefault -I.. -Idefault/source4/heimdal/lib/roken -I../source4/heimdal/lib/roken -I/usr/local/include -D_SAMBA_BUILD_=4 -DHAVE_CONFIG_H=1 -D_GNU_SOURCE=1 -D_XOPEN_SOURCE_EXTENDED=1 ../source4/heimdal/lib/vers/print_version.c -c -o default/source4/heimdal/lib/vers/print_version_128.o [ 261/4157] Compiling source4/heimdal/lib/vers/print_version.c [ 262/4157] Compiling source4/heimdal_build/version.c 01:25:13 runner i686-pld-linux-gcc -O2 -fwrapv -pipe -Wformat -Werror=format-security -gdwarf-4 -fno-debug-types-section -fvar-tracking-assignments -g2 -Wp,-D_FORTIFY_SOURCE=2 -fstack-protector-strong --param=ssp-buffer-size=4 -fomit-frame-pointer -march=i686 -fasynchronous-unwind-tables -mtune=pentium4 -gdwarf-4 -fno-debug-types-section -fvar-tracking-assignments -g2 -fPIC -D_LARGEFILE_SOURCE -D_FILE_OFFSET_BITS=64 -D_REENTRANT -D_POSIX_PTHREAD_SEMANTICS -DCTDB_HELPER_BINDIR="/usr/libexec/ctdb" -DLOGDIR="/var/log" -DCTDB_DATADIR="/usr/share/ctdb" -DCTDB_ETCDIR="/etc/ctdb" -DCTDB_VARDIR="/var/lib/ctdb" -DCTDB_RUNDIR="/var/run/ctdb" -fstack-clash-protection -DSTATIC_HEIMDAL_VERS_HOSTCC_MODULES=NULL -DSTATIC_HEIMDAL_VERS_HOSTCC_MODULES_PROTO=extern void __HEIMDAL_VERS_HOSTCC_dummy_module_proto(void) -MD -Idefault/source4/heimdal_build -I../source4/heimdal_build -Idefault/include/public -I../include/public -Idefault/source4 -I../source4 -Idefault/lib -I../lib -Idefault/source4/lib -I../source4/lib -Idefault/source4/include -I../source4/include -Idefault/include -I../include -Idefault/lib/replace -I../lib/replace -Idefault/ctdb/include -I../ctdb/include -Idefault/ctdb -I../ctdb -Idefault -I.. -Idefault/source4/heimdal/lib/roken -I../source4/heimdal/lib/roken -I/usr/local/include -D_SAMBA_BUILD_=4 -DHAVE_CONFIG_H=1 -D_GNU_SOURCE=1 -D_XOPEN_SOURCE_EXTENDED=1 ../source4/heimdal_build/version.c -c -o default/source4/heimdal_build/version_128.o [ 263/4157] Compiling source4/heimdal/lib/asn1/main.c 01:25:13 runner i686-pld-linux-gcc -O2 -fwrapv -pipe -Wformat -Werror=format-security -gdwarf-4 -fno-debug-types-section -fvar-tracking-assignments -g2 -Wp,-D_FORTIFY_SOURCE=2 -fstack-protector-strong --param=ssp-buffer-size=4 -fomit-frame-pointer -march=i686 -fasynchronous-unwind-tables -mtune=pentium4 -gdwarf-4 -fno-debug-types-section -fvar-tracking-assignments -g2 -fPIC -D_LARGEFILE_SOURCE -D_FILE_OFFSET_BITS=64 -D_REENTRANT -D_POSIX_PTHREAD_SEMANTICS -DCTDB_HELPER_BINDIR="/usr/libexec/ctdb" -DLOGDIR="/var/log" -DCTDB_DATADIR="/usr/share/ctdb" -DCTDB_ETCDIR="/etc/ctdb" -DCTDB_VARDIR="/var/lib/ctdb" -DCTDB_RUNDIR="/var/run/ctdb" -fstack-clash-protection -DSTATIC_HEIMDAL_VERS_MODULES=NULL -DSTATIC_HEIMDAL_VERS_MODULES_PROTO=extern void __HEIMDAL_VERS_dummy_module_proto(void) -MD -Idefault/source4/heimdal_build -I../source4/heimdal_build -Idefault/include/public -I../include/public -Idefault/source4 -I../source4 -Idefault/lib -I../lib -Idefault/source4/lib -I../source4/lib -Idefault/source4/include -I../source4/include -Idefault/include -I../include -Idefault/lib/replace -I../lib/replace -Idefault/ctdb/include -I../ctdb/include -Idefault/ctdb -I../ctdb -Idefault -I.. -Idefault/source4/heimdal/lib/roken -I../source4/heimdal/lib/roken -Idefault/source4/heimdal/include -I../source4/heimdal/include -I/usr/local/include -D_SAMBA_BUILD_=4 -DHAVE_CONFIG_H=1 -D_GNU_SOURCE=1 -D_XOPEN_SOURCE_EXTENDED=1 ../source4/heimdal/lib/vers/print_version.c -c -o default/source4/heimdal/lib/vers/print_version_129.o [ 264/4157] Compiling source4/heimdal/lib/asn1/gen.c 01:25:13 runner i686-pld-linux-gcc -O2 -fwrapv -pipe -Wformat -Werror=format-security -gdwarf-4 -fno-debug-types-section -fvar-tracking-assignments -g2 -Wp,-D_FORTIFY_SOURCE=2 -fstack-protector-strong --param=ssp-buffer-size=4 -fomit-frame-pointer -march=i686 -fasynchronous-unwind-tables -mtune=pentium4 -gdwarf-4 -fno-debug-types-section -fvar-tracking-assignments -g2 -fPIC -D_LARGEFILE_SOURCE -D_FILE_OFFSET_BITS=64 -D_REENTRANT -D_POSIX_PTHREAD_SEMANTICS -DCTDB_HELPER_BINDIR="/usr/libexec/ctdb" -DLOGDIR="/var/log" -DCTDB_DATADIR="/usr/share/ctdb" -DCTDB_ETCDIR="/etc/ctdb" -DCTDB_VARDIR="/var/lib/ctdb" -DCTDB_RUNDIR="/var/run/ctdb" -fstack-clash-protection -DSTATIC_HEIMDAL_VERS_MODULES=NULL -DSTATIC_HEIMDAL_VERS_MODULES_PROTO=extern void __HEIMDAL_VERS_dummy_module_proto(void) -MD -Idefault/source4/heimdal_build -I../source4/heimdal_build -Idefault/include/public -I../include/public -Idefault/source4 -I../source4 -Idefault/lib -I../lib -Idefault/source4/lib -I../source4/lib -Idefault/source4/include -I../source4/include -Idefault/include -I../include -Idefault/lib/replace -I../lib/replace -Idefault/ctdb/include -I../ctdb/include -Idefault/ctdb -I../ctdb -Idefault -I.. -Idefault/source4/heimdal/lib/roken -I../source4/heimdal/lib/roken -Idefault/source4/heimdal/include -I../source4/heimdal/include -I/usr/local/include -D_SAMBA_BUILD_=4 -DHAVE_CONFIG_H=1 -D_GNU_SOURCE=1 -D_XOPEN_SOURCE_EXTENDED=1 ../source4/heimdal_build/version.c -c -o default/source4/heimdal_build/version_129.o [ 265/4157] Compiling source4/heimdal/lib/asn1/gen_copy.c [ 266/4157] Compiling source4/heimdal/lib/asn1/gen_decode.c 01:25:13 runner i686-pld-linux-gcc -O2 -fwrapv -pipe -Wformat -Werror=format-security -gdwarf-4 -fno-debug-types-section -fvar-tracking-assignments -g2 -Wp,-D_FORTIFY_SOURCE=2 -fstack-protector-strong --param=ssp-buffer-size=4 -fomit-frame-pointer -march=i686 -fasynchronous-unwind-tables -mtune=pentium4 -gdwarf-4 -fno-debug-types-section -fvar-tracking-assignments -g2 -DSOCKET_WRAPPER_DISABLE=1 -D_SAMBA_HOSTCC_ -fPIC -D_LARGEFILE_SOURCE -D_FILE_OFFSET_BITS=64 -D_REENTRANT -D_POSIX_PTHREAD_SEMANTICS -DCTDB_HELPER_BINDIR="/usr/libexec/ctdb" -DLOGDIR="/var/log" -DCTDB_DATADIR="/usr/share/ctdb" -DCTDB_ETCDIR="/etc/ctdb" -DCTDB_VARDIR="/var/lib/ctdb" -DCTDB_RUNDIR="/var/run/ctdb" -fstack-clash-protection -DSTATIC_asn1_compile_MODULES=NULL -DSTATIC_asn1_compile_MODULES_PROTO=extern void __asn1_compile_dummy_module_proto(void) -MD -Idefault/source4/heimdal_build -I../source4/heimdal_build -Idefault/source4/heimdal/lib/asn1 -I../source4/heimdal/lib/asn1 -Idefault/include/public -I../include/public -Idefault/source4 -I../source4 -Idefault/lib -I../lib -Idefault/source4/lib -I../source4/lib -Idefault/source4/include -I../source4/include -Idefault/include -I../include -Idefault/lib/replace -I../lib/replace -Idefault/ctdb/include -I../ctdb/include -Idefault/ctdb -I../ctdb -Idefault -I.. -Idefault/source4/heimdal/lib/roken -I../source4/heimdal/lib/roken -I/usr/local/include -D_SAMBA_BUILD_=4 -DHAVE_CONFIG_H=1 -D_GNU_SOURCE=1 -D_XOPEN_SOURCE_EXTENDED=1 ../source4/heimdal/lib/asn1/main.c -c -o default/source4/heimdal/lib/asn1/main_130.o [ 267/4157] Compiling source4/heimdal/lib/asn1/gen_encode.c 01:25:13 runner i686-pld-linux-gcc -O2 -fwrapv -pipe -Wformat -Werror=format-security -gdwarf-4 -fno-debug-types-section -fvar-tracking-assignments -g2 -Wp,-D_FORTIFY_SOURCE=2 -fstack-protector-strong --param=ssp-buffer-size=4 -fomit-frame-pointer -march=i686 -fasynchronous-unwind-tables -mtune=pentium4 -gdwarf-4 -fno-debug-types-section -fvar-tracking-assignments -g2 -DSOCKET_WRAPPER_DISABLE=1 -D_SAMBA_HOSTCC_ -fPIC -D_LARGEFILE_SOURCE -D_FILE_OFFSET_BITS=64 -D_REENTRANT -D_POSIX_PTHREAD_SEMANTICS -DCTDB_HELPER_BINDIR="/usr/libexec/ctdb" -DLOGDIR="/var/log" -DCTDB_DATADIR="/usr/share/ctdb" -DCTDB_ETCDIR="/etc/ctdb" -DCTDB_VARDIR="/var/lib/ctdb" -DCTDB_RUNDIR="/var/run/ctdb" -fstack-clash-protection -DSTATIC_asn1_compile_MODULES=NULL -DSTATIC_asn1_compile_MODULES_PROTO=extern void __asn1_compile_dummy_module_proto(void) -MD -Idefault/source4/heimdal_build -I../source4/heimdal_build -Idefault/source4/heimdal/lib/asn1 -I../source4/heimdal/lib/asn1 -Idefault/include/public -I../include/public -Idefault/source4 -I../source4 -Idefault/lib -I../lib -Idefault/source4/lib -I../source4/lib -Idefault/source4/include -I../source4/include -Idefault/include -I../include -Idefault/lib/replace -I../lib/replace -Idefault/ctdb/include -I../ctdb/include -Idefault/ctdb -I../ctdb -Idefault -I.. -Idefault/source4/heimdal/lib/roken -I../source4/heimdal/lib/roken -I/usr/local/include -D_SAMBA_BUILD_=4 -DHAVE_CONFIG_H=1 -D_GNU_SOURCE=1 -D_XOPEN_SOURCE_EXTENDED=1 ../source4/heimdal/lib/asn1/gen_decode.c -c -o default/source4/heimdal/lib/asn1/gen_decode_130.o 01:25:13 runner i686-pld-linux-gcc -O2 -fwrapv -pipe -Wformat -Werror=format-security -gdwarf-4 -fno-debug-types-section -fvar-tracking-assignments -g2 -Wp,-D_FORTIFY_SOURCE=2 -fstack-protector-strong --param=ssp-buffer-size=4 -fomit-frame-pointer -march=i686 -fasynchronous-unwind-tables -mtune=pentium4 -gdwarf-4 -fno-debug-types-section -fvar-tracking-assignments -g2 -DSOCKET_WRAPPER_DISABLE=1 -D_SAMBA_HOSTCC_ -fPIC -D_LARGEFILE_SOURCE -D_FILE_OFFSET_BITS=64 -D_REENTRANT -D_POSIX_PTHREAD_SEMANTICS -DCTDB_HELPER_BINDIR="/usr/libexec/ctdb" -DLOGDIR="/var/log" -DCTDB_DATADIR="/usr/share/ctdb" -DCTDB_ETCDIR="/etc/ctdb" -DCTDB_VARDIR="/var/lib/ctdb" -DCTDB_RUNDIR="/var/run/ctdb" -fstack-clash-protection -DSTATIC_asn1_compile_MODULES=NULL -DSTATIC_asn1_compile_MODULES_PROTO=extern void __asn1_compile_dummy_module_proto(void) -MD -Idefault/source4/heimdal_build -I../source4/heimdal_build -Idefault/source4/heimdal/lib/asn1 -I../source4/heimdal/lib/asn1 -Idefault/include/public -I../include/public -Idefault/source4 -I../source4 -Idefault/lib -I../lib -Idefault/source4/lib -I../source4/lib -Idefault/source4/include -I../source4/include -Idefault/include -I../include -Idefault/lib/replace -I../lib/replace -Idefault/ctdb/include -I../ctdb/include -Idefault/ctdb -I../ctdb -Idefault -I.. -Idefault/source4/heimdal/lib/roken -I../source4/heimdal/lib/roken -I/usr/local/include -D_SAMBA_BUILD_=4 -DHAVE_CONFIG_H=1 -D_GNU_SOURCE=1 -D_XOPEN_SOURCE_EXTENDED=1 ../source4/heimdal/lib/asn1/gen_encode.c -c -o default/source4/heimdal/lib/asn1/gen_encode_130.o 01:25:13 runner i686-pld-linux-gcc -O2 -fwrapv -pipe -Wformat -Werror=format-security -gdwarf-4 -fno-debug-types-section -fvar-tracking-assignments -g2 -Wp,-D_FORTIFY_SOURCE=2 -fstack-protector-strong --param=ssp-buffer-size=4 -fomit-frame-pointer -march=i686 -fasynchronous-unwind-tables -mtune=pentium4 -gdwarf-4 -fno-debug-types-section -fvar-tracking-assignments -g2 -DSOCKET_WRAPPER_DISABLE=1 -D_SAMBA_HOSTCC_ -fPIC -D_LARGEFILE_SOURCE -D_FILE_OFFSET_BITS=64 -D_REENTRANT -D_POSIX_PTHREAD_SEMANTICS -DCTDB_HELPER_BINDIR="/usr/libexec/ctdb" -DLOGDIR="/var/log" -DCTDB_DATADIR="/usr/share/ctdb" -DCTDB_ETCDIR="/etc/ctdb" -DCTDB_VARDIR="/var/lib/ctdb" -DCTDB_RUNDIR="/var/run/ctdb" -fstack-clash-protection -DSTATIC_asn1_compile_MODULES=NULL -DSTATIC_asn1_compile_MODULES_PROTO=extern void __asn1_compile_dummy_module_proto(void) -MD -Idefault/source4/heimdal_build -I../source4/heimdal_build -Idefault/source4/heimdal/lib/asn1 -I../source4/heimdal/lib/asn1 -Idefault/include/public -I../include/public -Idefault/source4 -I../source4 -Idefault/lib -I../lib -Idefault/source4/lib -I../source4/lib -Idefault/source4/include -I../source4/include -Idefault/include -I../include -Idefault/lib/replace -I../lib/replace -Idefault/ctdb/include -I../ctdb/include -Idefault/ctdb -I../ctdb -Idefault -I.. -Idefault/source4/heimdal/lib/roken -I../source4/heimdal/lib/roken -I/usr/local/include -D_SAMBA_BUILD_=4 -DHAVE_CONFIG_H=1 -D_GNU_SOURCE=1 -D_XOPEN_SOURCE_EXTENDED=1 ../source4/heimdal/lib/asn1/gen.c -c -o default/source4/heimdal/lib/asn1/gen_130.o 01:25:13 runner i686-pld-linux-gcc -O2 -fwrapv -pipe -Wformat -Werror=format-security -gdwarf-4 -fno-debug-types-section -fvar-tracking-assignments -g2 -Wp,-D_FORTIFY_SOURCE=2 -fstack-protector-strong --param=ssp-buffer-size=4 -fomit-frame-pointer -march=i686 -fasynchronous-unwind-tables -mtune=pentium4 -gdwarf-4 -fno-debug-types-section -fvar-tracking-assignments -g2 -DSOCKET_WRAPPER_DISABLE=1 -D_SAMBA_HOSTCC_ -fPIC -D_LARGEFILE_SOURCE -D_FILE_OFFSET_BITS=64 -D_REENTRANT -D_POSIX_PTHREAD_SEMANTICS -DCTDB_HELPER_BINDIR="/usr/libexec/ctdb" -DLOGDIR="/var/log" -DCTDB_DATADIR="/usr/share/ctdb" -DCTDB_ETCDIR="/etc/ctdb" -DCTDB_VARDIR="/var/lib/ctdb" -DCTDB_RUNDIR="/var/run/ctdb" -fstack-clash-protection -DSTATIC_asn1_compile_MODULES=NULL -DSTATIC_asn1_compile_MODULES_PROTO=extern void __asn1_compile_dummy_module_proto(void) -MD -Idefault/source4/heimdal_build -I../source4/heimdal_build -Idefault/source4/heimdal/lib/asn1 -I../source4/heimdal/lib/asn1 -Idefault/include/public -I../include/public -Idefault/source4 -I../source4 -Idefault/lib -I../lib -Idefault/source4/lib -I../source4/lib -Idefault/source4/include -I../source4/include -Idefault/include -I../include -Idefault/lib/replace -I../lib/replace -Idefault/ctdb/include -I../ctdb/include -Idefault/ctdb -I../ctdb -Idefault -I.. -Idefault/source4/heimdal/lib/roken -I../source4/heimdal/lib/roken -I/usr/local/include -D_SAMBA_BUILD_=4 -DHAVE_CONFIG_H=1 -D_GNU_SOURCE=1 -D_XOPEN_SOURCE_EXTENDED=1 ../source4/heimdal/lib/asn1/gen_copy.c -c -o default/source4/heimdal/lib/asn1/gen_copy_130.o [ 268/4157] Compiling source4/heimdal/lib/asn1/gen_free.c 01:25:13 runner i686-pld-linux-gcc -O2 -fwrapv -pipe -Wformat -Werror=format-security -gdwarf-4 -fno-debug-types-section -fvar-tracking-assignments -g2 -Wp,-D_FORTIFY_SOURCE=2 -fstack-protector-strong --param=ssp-buffer-size=4 -fomit-frame-pointer -march=i686 -fasynchronous-unwind-tables -mtune=pentium4 -gdwarf-4 -fno-debug-types-section -fvar-tracking-assignments -g2 -DSOCKET_WRAPPER_DISABLE=1 -D_SAMBA_HOSTCC_ -fPIC -D_LARGEFILE_SOURCE -D_FILE_OFFSET_BITS=64 -D_REENTRANT -D_POSIX_PTHREAD_SEMANTICS -DCTDB_HELPER_BINDIR="/usr/libexec/ctdb" -DLOGDIR="/var/log" -DCTDB_DATADIR="/usr/share/ctdb" -DCTDB_ETCDIR="/etc/ctdb" -DCTDB_VARDIR="/var/lib/ctdb" -DCTDB_RUNDIR="/var/run/ctdb" -fstack-clash-protection -DSTATIC_asn1_compile_MODULES=NULL -DSTATIC_asn1_compile_MODULES_PROTO=extern void __asn1_compile_dummy_module_proto(void) -MD -Idefault/source4/heimdal_build -I../source4/heimdal_build -Idefault/source4/heimdal/lib/asn1 -I../source4/heimdal/lib/asn1 -Idefault/include/public -I../include/public -Idefault/source4 -I../source4 -Idefault/lib -I../lib -Idefault/source4/lib -I../source4/lib -Idefault/source4/include -I../source4/include -Idefault/include -I../include -Idefault/lib/replace -I../lib/replace -Idefault/ctdb/include -I../ctdb/include -Idefault/ctdb -I../ctdb -Idefault -I.. -Idefault/source4/heimdal/lib/roken -I../source4/heimdal/lib/roken -I/usr/local/include -D_SAMBA_BUILD_=4 -DHAVE_CONFIG_H=1 -D_GNU_SOURCE=1 -D_XOPEN_SOURCE_EXTENDED=1 ../source4/heimdal/lib/asn1/gen_free.c -c -o default/source4/heimdal/lib/asn1/gen_free_130.o [ 269/4157] Compiling source4/heimdal/lib/asn1/gen_glue.c [ 270/4157] Compiling source4/heimdal/lib/asn1/gen_length.c 01:25:13 runner i686-pld-linux-gcc -O2 -fwrapv -pipe -Wformat -Werror=format-security -gdwarf-4 -fno-debug-types-section -fvar-tracking-assignments -g2 -Wp,-D_FORTIFY_SOURCE=2 -fstack-protector-strong --param=ssp-buffer-size=4 -fomit-frame-pointer -march=i686 -fasynchronous-unwind-tables -mtune=pentium4 -gdwarf-4 -fno-debug-types-section -fvar-tracking-assignments -g2 -DSOCKET_WRAPPER_DISABLE=1 -D_SAMBA_HOSTCC_ -fPIC -D_LARGEFILE_SOURCE -D_FILE_OFFSET_BITS=64 -D_REENTRANT -D_POSIX_PTHREAD_SEMANTICS -DCTDB_HELPER_BINDIR="/usr/libexec/ctdb" -DLOGDIR="/var/log" -DCTDB_DATADIR="/usr/share/ctdb" -DCTDB_ETCDIR="/etc/ctdb" -DCTDB_VARDIR="/var/lib/ctdb" -DCTDB_RUNDIR="/var/run/ctdb" -fstack-clash-protection -DSTATIC_asn1_compile_MODULES=NULL -DSTATIC_asn1_compile_MODULES_PROTO=extern void __asn1_compile_dummy_module_proto(void) -MD -Idefault/source4/heimdal_build -I../source4/heimdal_build -Idefault/source4/heimdal/lib/asn1 -I../source4/heimdal/lib/asn1 -Idefault/include/public -I../include/public -Idefault/source4 -I../source4 -Idefault/lib -I../lib -Idefault/source4/lib -I../source4/lib -Idefault/source4/include -I../source4/include -Idefault/include -I../include -Idefault/lib/replace -I../lib/replace -Idefault/ctdb/include -I../ctdb/include -Idefault/ctdb -I../ctdb -Idefault -I.. -Idefault/source4/heimdal/lib/roken -I../source4/heimdal/lib/roken -I/usr/local/include -D_SAMBA_BUILD_=4 -DHAVE_CONFIG_H=1 -D_GNU_SOURCE=1 -D_XOPEN_SOURCE_EXTENDED=1 ../source4/heimdal/lib/asn1/gen_glue.c -c -o default/source4/heimdal/lib/asn1/gen_glue_130.o 01:25:13 runner i686-pld-linux-gcc -O2 -fwrapv -pipe -Wformat -Werror=format-security -gdwarf-4 -fno-debug-types-section -fvar-tracking-assignments -g2 -Wp,-D_FORTIFY_SOURCE=2 -fstack-protector-strong --param=ssp-buffer-size=4 -fomit-frame-pointer -march=i686 -fasynchronous-unwind-tables -mtune=pentium4 -gdwarf-4 -fno-debug-types-section -fvar-tracking-assignments -g2 -DSOCKET_WRAPPER_DISABLE=1 -D_SAMBA_HOSTCC_ -fPIC -D_LARGEFILE_SOURCE -D_FILE_OFFSET_BITS=64 -D_REENTRANT -D_POSIX_PTHREAD_SEMANTICS -DCTDB_HELPER_BINDIR="/usr/libexec/ctdb" -DLOGDIR="/var/log" -DCTDB_DATADIR="/usr/share/ctdb" -DCTDB_ETCDIR="/etc/ctdb" -DCTDB_VARDIR="/var/lib/ctdb" -DCTDB_RUNDIR="/var/run/ctdb" -fstack-clash-protection -DSTATIC_asn1_compile_MODULES=NULL -DSTATIC_asn1_compile_MODULES_PROTO=extern void __asn1_compile_dummy_module_proto(void) -MD -Idefault/source4/heimdal_build -I../source4/heimdal_build -Idefault/source4/heimdal/lib/asn1 -I../source4/heimdal/lib/asn1 -Idefault/include/public -I../include/public -Idefault/source4 -I../source4 -Idefault/lib -I../lib -Idefault/source4/lib -I../source4/lib -Idefault/source4/include -I../source4/include -Idefault/include -I../include -Idefault/lib/replace -I../lib/replace -Idefault/ctdb/include -I../ctdb/include -Idefault/ctdb -I../ctdb -Idefault -I.. -Idefault/source4/heimdal/lib/roken -I../source4/heimdal/lib/roken -I/usr/local/include -D_SAMBA_BUILD_=4 -DHAVE_CONFIG_H=1 -D_GNU_SOURCE=1 -D_XOPEN_SOURCE_EXTENDED=1 ../source4/heimdal/lib/asn1/gen_length.c -c -o default/source4/heimdal/lib/asn1/gen_length_130.o [ 271/4157] Compiling source4/heimdal/lib/asn1/gen_seq.c 01:25:13 runner i686-pld-linux-gcc -O2 -fwrapv -pipe -Wformat -Werror=format-security -gdwarf-4 -fno-debug-types-section -fvar-tracking-assignments -g2 -Wp,-D_FORTIFY_SOURCE=2 -fstack-protector-strong --param=ssp-buffer-size=4 -fomit-frame-pointer -march=i686 -fasynchronous-unwind-tables -mtune=pentium4 -gdwarf-4 -fno-debug-types-section -fvar-tracking-assignments -g2 -DSOCKET_WRAPPER_DISABLE=1 -D_SAMBA_HOSTCC_ -fPIC -D_LARGEFILE_SOURCE -D_FILE_OFFSET_BITS=64 -D_REENTRANT -D_POSIX_PTHREAD_SEMANTICS -DCTDB_HELPER_BINDIR="/usr/libexec/ctdb" -DLOGDIR="/var/log" -DCTDB_DATADIR="/usr/share/ctdb" -DCTDB_ETCDIR="/etc/ctdb" -DCTDB_VARDIR="/var/lib/ctdb" -DCTDB_RUNDIR="/var/run/ctdb" -fstack-clash-protection -DSTATIC_asn1_compile_MODULES=NULL -DSTATIC_asn1_compile_MODULES_PROTO=extern void __asn1_compile_dummy_module_proto(void) -MD -Idefault/source4/heimdal_build -I../source4/heimdal_build -Idefault/source4/heimdal/lib/asn1 -I../source4/heimdal/lib/asn1 -Idefault/include/public -I../include/public -Idefault/source4 -I../source4 -Idefault/lib -I../lib -Idefault/source4/lib -I../source4/lib -Idefault/source4/include -I../source4/include -Idefault/include -I../include -Idefault/lib/replace -I../lib/replace -Idefault/ctdb/include -I../ctdb/include -Idefault/ctdb -I../ctdb -Idefault -I.. -Idefault/source4/heimdal/lib/roken -I../source4/heimdal/lib/roken -I/usr/local/include -D_SAMBA_BUILD_=4 -DHAVE_CONFIG_H=1 -D_GNU_SOURCE=1 -D_XOPEN_SOURCE_EXTENDED=1 ../source4/heimdal/lib/asn1/gen_seq.c -c -o default/source4/heimdal/lib/asn1/gen_seq_130.o [ 272/4157] Compiling source4/heimdal/lib/asn1/gen_template.c 01:25:13 runner i686-pld-linux-gcc -O2 -fwrapv -pipe -Wformat -Werror=format-security -gdwarf-4 -fno-debug-types-section -fvar-tracking-assignments -g2 -Wp,-D_FORTIFY_SOURCE=2 -fstack-protector-strong --param=ssp-buffer-size=4 -fomit-frame-pointer -march=i686 -fasynchronous-unwind-tables -mtune=pentium4 -gdwarf-4 -fno-debug-types-section -fvar-tracking-assignments -g2 -DSOCKET_WRAPPER_DISABLE=1 -D_SAMBA_HOSTCC_ -fPIC -D_LARGEFILE_SOURCE -D_FILE_OFFSET_BITS=64 -D_REENTRANT -D_POSIX_PTHREAD_SEMANTICS -DCTDB_HELPER_BINDIR="/usr/libexec/ctdb" -DLOGDIR="/var/log" -DCTDB_DATADIR="/usr/share/ctdb" -DCTDB_ETCDIR="/etc/ctdb" -DCTDB_VARDIR="/var/lib/ctdb" -DCTDB_RUNDIR="/var/run/ctdb" -fstack-clash-protection -DSTATIC_asn1_compile_MODULES=NULL -DSTATIC_asn1_compile_MODULES_PROTO=extern void __asn1_compile_dummy_module_proto(void) -MD -Idefault/source4/heimdal_build -I../source4/heimdal_build -Idefault/source4/heimdal/lib/asn1 -I../source4/heimdal/lib/asn1 -Idefault/include/public -I../include/public -Idefault/source4 -I../source4 -Idefault/lib -I../lib -Idefault/source4/lib -I../source4/lib -Idefault/source4/include -I../source4/include -Idefault/include -I../include -Idefault/lib/replace -I../lib/replace -Idefault/ctdb/include -I../ctdb/include -Idefault/ctdb -I../ctdb -Idefault -I.. -Idefault/source4/heimdal/lib/roken -I../source4/heimdal/lib/roken -I/usr/local/include -D_SAMBA_BUILD_=4 -DHAVE_CONFIG_H=1 -D_GNU_SOURCE=1 -D_XOPEN_SOURCE_EXTENDED=1 ../source4/heimdal/lib/asn1/gen_template.c -c -o default/source4/heimdal/lib/asn1/gen_template_130.o [ 273/4157] Compiling source4/heimdal/lib/asn1/hash.c 01:25:13 runner i686-pld-linux-gcc -O2 -fwrapv -pipe -Wformat -Werror=format-security -gdwarf-4 -fno-debug-types-section -fvar-tracking-assignments -g2 -Wp,-D_FORTIFY_SOURCE=2 -fstack-protector-strong --param=ssp-buffer-size=4 -fomit-frame-pointer -march=i686 -fasynchronous-unwind-tables -mtune=pentium4 -gdwarf-4 -fno-debug-types-section -fvar-tracking-assignments -g2 -DSOCKET_WRAPPER_DISABLE=1 -D_SAMBA_HOSTCC_ -fPIC -D_LARGEFILE_SOURCE -D_FILE_OFFSET_BITS=64 -D_REENTRANT -D_POSIX_PTHREAD_SEMANTICS -DCTDB_HELPER_BINDIR="/usr/libexec/ctdb" -DLOGDIR="/var/log" -DCTDB_DATADIR="/usr/share/ctdb" -DCTDB_ETCDIR="/etc/ctdb" -DCTDB_VARDIR="/var/lib/ctdb" -DCTDB_RUNDIR="/var/run/ctdb" -fstack-clash-protection -DSTATIC_asn1_compile_MODULES=NULL -DSTATIC_asn1_compile_MODULES_PROTO=extern void __asn1_compile_dummy_module_proto(void) -MD -Idefault/source4/heimdal_build -I../source4/heimdal_build -Idefault/source4/heimdal/lib/asn1 -I../source4/heimdal/lib/asn1 -Idefault/include/public -I../include/public -Idefault/source4 -I../source4 -Idefault/lib -I../lib -Idefault/source4/lib -I../source4/lib -Idefault/source4/include -I../source4/include -Idefault/include -I../include -Idefault/lib/replace -I../lib/replace -Idefault/ctdb/include -I../ctdb/include -Idefault/ctdb -I../ctdb -Idefault -I.. -Idefault/source4/heimdal/lib/roken -I../source4/heimdal/lib/roken -I/usr/local/include -D_SAMBA_BUILD_=4 -DHAVE_CONFIG_H=1 -D_GNU_SOURCE=1 -D_XOPEN_SOURCE_EXTENDED=1 ../source4/heimdal/lib/asn1/hash.c -c -o default/source4/heimdal/lib/asn1/hash_130.o [ 274/4157] Compiling source4/heimdal/lib/asn1/symbol.c 01:25:13 runner i686-pld-linux-gcc -O2 -fwrapv -pipe -Wformat -Werror=format-security -gdwarf-4 -fno-debug-types-section -fvar-tracking-assignments -g2 -Wp,-D_FORTIFY_SOURCE=2 -fstack-protector-strong --param=ssp-buffer-size=4 -fomit-frame-pointer -march=i686 -fasynchronous-unwind-tables -mtune=pentium4 -gdwarf-4 -fno-debug-types-section -fvar-tracking-assignments -g2 -DSOCKET_WRAPPER_DISABLE=1 -D_SAMBA_HOSTCC_ -fPIC -D_LARGEFILE_SOURCE -D_FILE_OFFSET_BITS=64 -D_REENTRANT -D_POSIX_PTHREAD_SEMANTICS -DCTDB_HELPER_BINDIR="/usr/libexec/ctdb" -DLOGDIR="/var/log" -DCTDB_DATADIR="/usr/share/ctdb" -DCTDB_ETCDIR="/etc/ctdb" -DCTDB_VARDIR="/var/lib/ctdb" -DCTDB_RUNDIR="/var/run/ctdb" -fstack-clash-protection -DSTATIC_asn1_compile_MODULES=NULL -DSTATIC_asn1_compile_MODULES_PROTO=extern void __asn1_compile_dummy_module_proto(void) -MD -Idefault/source4/heimdal_build -I../source4/heimdal_build -Idefault/source4/heimdal/lib/asn1 -I../source4/heimdal/lib/asn1 -Idefault/include/public -I../include/public -Idefault/source4 -I../source4 -Idefault/lib -I../lib -Idefault/source4/lib -I../source4/lib -Idefault/source4/include -I../source4/include -Idefault/include -I../include -Idefault/lib/replace -I../lib/replace -Idefault/ctdb/include -I../ctdb/include -Idefault/ctdb -I../ctdb -Idefault -I.. -Idefault/source4/heimdal/lib/roken -I../source4/heimdal/lib/roken -I/usr/local/include -D_SAMBA_BUILD_=4 -DHAVE_CONFIG_H=1 -D_GNU_SOURCE=1 -D_XOPEN_SOURCE_EXTENDED=1 ../source4/heimdal/lib/asn1/symbol.c -c -o default/source4/heimdal/lib/asn1/symbol_130.o [ 275/4157] Compiling source4/heimdal/lib/asn1/asn1parse.c 01:25:13 runner i686-pld-linux-gcc -O2 -fwrapv -pipe -Wformat -Werror=format-security -gdwarf-4 -fno-debug-types-section -fvar-tracking-assignments -g2 -Wp,-D_FORTIFY_SOURCE=2 -fstack-protector-strong --param=ssp-buffer-size=4 -fomit-frame-pointer -march=i686 -fasynchronous-unwind-tables -mtune=pentium4 -gdwarf-4 -fno-debug-types-section -fvar-tracking-assignments -g2 -DSOCKET_WRAPPER_DISABLE=1 -D_SAMBA_HOSTCC_ -fPIC -D_LARGEFILE_SOURCE -D_FILE_OFFSET_BITS=64 -D_REENTRANT -D_POSIX_PTHREAD_SEMANTICS -DCTDB_HELPER_BINDIR="/usr/libexec/ctdb" -DLOGDIR="/var/log" -DCTDB_DATADIR="/usr/share/ctdb" -DCTDB_ETCDIR="/etc/ctdb" -DCTDB_VARDIR="/var/lib/ctdb" -DCTDB_RUNDIR="/var/run/ctdb" -fstack-clash-protection -DSTATIC_asn1_compile_MODULES=NULL -DSTATIC_asn1_compile_MODULES_PROTO=extern void __asn1_compile_dummy_module_proto(void) -MD -Idefault/source4/heimdal_build -I../source4/heimdal_build -Idefault/source4/heimdal/lib/asn1 -I../source4/heimdal/lib/asn1 -Idefault/include/public -I../include/public -Idefault/source4 -I../source4 -Idefault/lib -I../lib -Idefault/source4/lib -I../source4/lib -Idefault/source4/include -I../source4/include -Idefault/include -I../include -Idefault/lib/replace -I../lib/replace -Idefault/ctdb/include -I../ctdb/include -Idefault/ctdb -I../ctdb -Idefault -I.. -Idefault/source4/heimdal/lib/roken -I../source4/heimdal/lib/roken -I/usr/local/include -D_SAMBA_BUILD_=4 -DHAVE_CONFIG_H=1 -D_GNU_SOURCE=1 -D_XOPEN_SOURCE_EXTENDED=1 ../source4/heimdal/lib/asn1/asn1parse.c -c -o default/source4/heimdal/lib/asn1/asn1parse_130.o [ 276/4157] Compiling source4/heimdal/lib/asn1/lex.c 01:25:13 runner i686-pld-linux-gcc -O2 -fwrapv -pipe -Wformat -Werror=format-security -gdwarf-4 -fno-debug-types-section -fvar-tracking-assignments -g2 -Wp,-D_FORTIFY_SOURCE=2 -fstack-protector-strong --param=ssp-buffer-size=4 -fomit-frame-pointer -march=i686 -fasynchronous-unwind-tables -mtune=pentium4 -gdwarf-4 -fno-debug-types-section -fvar-tracking-assignments -g2 -DSOCKET_WRAPPER_DISABLE=1 -D_SAMBA_HOSTCC_ -fPIC -D_LARGEFILE_SOURCE -D_FILE_OFFSET_BITS=64 -D_REENTRANT -D_POSIX_PTHREAD_SEMANTICS -DCTDB_HELPER_BINDIR="/usr/libexec/ctdb" -DLOGDIR="/var/log" -DCTDB_DATADIR="/usr/share/ctdb" -DCTDB_ETCDIR="/etc/ctdb" -DCTDB_VARDIR="/var/lib/ctdb" -DCTDB_RUNDIR="/var/run/ctdb" -fstack-clash-protection -DSTATIC_asn1_compile_MODULES=NULL -DSTATIC_asn1_compile_MODULES_PROTO=extern void __asn1_compile_dummy_module_proto(void) -MD -Idefault/source4/heimdal_build -I../source4/heimdal_build -Idefault/source4/heimdal/lib/asn1 -I../source4/heimdal/lib/asn1 -Idefault/include/public -I../include/public -Idefault/source4 -I../source4 -Idefault/lib -I../lib -Idefault/source4/lib -I../source4/lib -Idefault/source4/include -I../source4/include -Idefault/include -I../include -Idefault/lib/replace -I../lib/replace -Idefault/ctdb/include -I../ctdb/include -Idefault/ctdb -I../ctdb -Idefault -I.. -Idefault/source4/heimdal/lib/roken -I../source4/heimdal/lib/roken -I/usr/local/include -D_SAMBA_BUILD_=4 -DHAVE_CONFIG_H=1 -D_GNU_SOURCE=1 -D_XOPEN_SOURCE_EXTENDED=1 ../source4/heimdal/lib/asn1/lex.c -c -o default/source4/heimdal/lib/asn1/lex_130.o [ 277/4157] Compiling source4/heimdal/lib/com_err/parse.c [ 278/4157] Compiling source4/heimdal/lib/com_err/lex.c 01:25:13 runner i686-pld-linux-gcc -O2 -fwrapv -pipe -Wformat -Werror=format-security -gdwarf-4 -fno-debug-types-section -fvar-tracking-assignments -g2 -Wp,-D_FORTIFY_SOURCE=2 -fstack-protector-strong --param=ssp-buffer-size=4 -fomit-frame-pointer -march=i686 -fasynchronous-unwind-tables -mtune=pentium4 -gdwarf-4 -fno-debug-types-section -fvar-tracking-assignments -g2 -DSOCKET_WRAPPER_DISABLE=1 -D_SAMBA_HOSTCC_ -fPIC -D_LARGEFILE_SOURCE -D_FILE_OFFSET_BITS=64 -D_REENTRANT -D_POSIX_PTHREAD_SEMANTICS -DCTDB_HELPER_BINDIR="/usr/libexec/ctdb" -DLOGDIR="/var/log" -DCTDB_DATADIR="/usr/share/ctdb" -DCTDB_ETCDIR="/etc/ctdb" -DCTDB_VARDIR="/var/lib/ctdb" -DCTDB_RUNDIR="/var/run/ctdb" -fstack-clash-protection -DSTATIC_compile_et_MODULES=NULL -DSTATIC_compile_et_MODULES_PROTO=extern void __compile_et_dummy_module_proto(void) -MD -Idefault/source4/heimdal_build -I../source4/heimdal_build -Idefault/source4/heimdal/lib/com_err -I../source4/heimdal/lib/com_err -Idefault/include/public -I../include/public -Idefault/source4 -I../source4 -Idefault/lib -I../lib -Idefault/source4/lib -I../source4/lib -Idefault/source4/include -I../source4/include -Idefault/include -I../include -Idefault/lib/replace -I../lib/replace -Idefault/ctdb/include -I../ctdb/include -Idefault/ctdb -I../ctdb -Idefault -I.. -Idefault/source4/heimdal/lib/roken -I../source4/heimdal/lib/roken -I/usr/local/include -D_SAMBA_BUILD_=4 -DHAVE_CONFIG_H=1 -D_GNU_SOURCE=1 -D_XOPEN_SOURCE_EXTENDED=1 ../source4/heimdal/lib/com_err/parse.c -c -o default/source4/heimdal/lib/com_err/parse_132.o 01:25:13 runner i686-pld-linux-gcc -O2 -fwrapv -pipe -Wformat -Werror=format-security -gdwarf-4 -fno-debug-types-section -fvar-tracking-assignments -g2 -Wp,-D_FORTIFY_SOURCE=2 -fstack-protector-strong --param=ssp-buffer-size=4 -fomit-frame-pointer -march=i686 -fasynchronous-unwind-tables -mtune=pentium4 -gdwarf-4 -fno-debug-types-section -fvar-tracking-assignments -g2 -DSOCKET_WRAPPER_DISABLE=1 -D_SAMBA_HOSTCC_ -fPIC -D_LARGEFILE_SOURCE -D_FILE_OFFSET_BITS=64 -D_REENTRANT -D_POSIX_PTHREAD_SEMANTICS -DCTDB_HELPER_BINDIR="/usr/libexec/ctdb" -DLOGDIR="/var/log" -DCTDB_DATADIR="/usr/share/ctdb" -DCTDB_ETCDIR="/etc/ctdb" -DCTDB_VARDIR="/var/lib/ctdb" -DCTDB_RUNDIR="/var/run/ctdb" -fstack-clash-protection -DSTATIC_compile_et_MODULES=NULL -DSTATIC_compile_et_MODULES_PROTO=extern void __compile_et_dummy_module_proto(void) -MD -Idefault/source4/heimdal_build -I../source4/heimdal_build -Idefault/source4/heimdal/lib/com_err -I../source4/heimdal/lib/com_err -Idefault/include/public -I../include/public -Idefault/source4 -I../source4 -Idefault/lib -I../lib -Idefault/source4/lib -I../source4/lib -Idefault/source4/include -I../source4/include -Idefault/include -I../include -Idefault/lib/replace -I../lib/replace -Idefault/ctdb/include -I../ctdb/include -Idefault/ctdb -I../ctdb -Idefault -I.. -Idefault/source4/heimdal/lib/roken -I../source4/heimdal/lib/roken -I/usr/local/include -D_SAMBA_BUILD_=4 -DHAVE_CONFIG_H=1 -D_GNU_SOURCE=1 -D_XOPEN_SOURCE_EXTENDED=1 ../source4/heimdal/lib/com_err/lex.c -c -o default/source4/heimdal/lib/com_err/lex_132.o [ 279/4157] Compiling source4/heimdal/lib/com_err/compile_et.c 01:25:13 runner i686-pld-linux-gcc -O2 -fwrapv -pipe -Wformat -Werror=format-security -gdwarf-4 -fno-debug-types-section -fvar-tracking-assignments -g2 -Wp,-D_FORTIFY_SOURCE=2 -fstack-protector-strong --param=ssp-buffer-size=4 -fomit-frame-pointer -march=i686 -fasynchronous-unwind-tables -mtune=pentium4 -gdwarf-4 -fno-debug-types-section -fvar-tracking-assignments -g2 -DSOCKET_WRAPPER_DISABLE=1 -D_SAMBA_HOSTCC_ -fPIC -D_LARGEFILE_SOURCE -D_FILE_OFFSET_BITS=64 -D_REENTRANT -D_POSIX_PTHREAD_SEMANTICS -DCTDB_HELPER_BINDIR="/usr/libexec/ctdb" -DLOGDIR="/var/log" -DCTDB_DATADIR="/usr/share/ctdb" -DCTDB_ETCDIR="/etc/ctdb" -DCTDB_VARDIR="/var/lib/ctdb" -DCTDB_RUNDIR="/var/run/ctdb" -fstack-clash-protection -DSTATIC_compile_et_MODULES=NULL -DSTATIC_compile_et_MODULES_PROTO=extern void __compile_et_dummy_module_proto(void) -MD -Idefault/source4/heimdal_build -I../source4/heimdal_build -Idefault/source4/heimdal/lib/com_err -I../source4/heimdal/lib/com_err -Idefault/include/public -I../include/public -Idefault/source4 -I../source4 -Idefault/lib -I../lib -Idefault/source4/lib -I../source4/lib -Idefault/source4/include -I../source4/include -Idefault/include -I../include -Idefault/lib/replace -I../lib/replace -Idefault/ctdb/include -I../ctdb/include -Idefault/ctdb -I../ctdb -Idefault -I.. -Idefault/source4/heimdal/lib/roken -I../source4/heimdal/lib/roken -I/usr/local/include -D_SAMBA_BUILD_=4 -DHAVE_CONFIG_H=1 -D_GNU_SOURCE=1 -D_XOPEN_SOURCE_EXTENDED=1 ../source4/heimdal/lib/com_err/compile_et.c -c -o default/source4/heimdal/lib/com_err/compile_et_132.o ../source4/heimdal/lib/com_err/parse.c: In function 'yyparse': ../source4/heimdal/lib/com_err/parse.c:537:7: warning: ignoring return value of 'asprintf', declared with attribute warn_unused_result [-Wunused-result] asprintf (&prefix, "%s_", yystack.l_mark[0].string); ^~~~~~~~~~~~~~~~~~~~~~~~~~~~~~~~~~~~~~~~~~~~~~~~~~~ ../source4/heimdal/lib/com_err/parse.c:561:4: warning: ignoring return value of 'asprintf', declared with attribute warn_unused_result [-Wunused-result] asprintf (&ec->name, "%s%s", prefix, yystack.l_mark[-2].string); ^~~~~~~~~~~~~~~~~~~~~~~~~~~~~~~~~~~~~~~~~~~~~~~~~~~~~~~~~~~~~~~ [ 280/4157] Linking default/source4/heimdal_build/asn1_compile [ 281/4157] Linking default/source4/heimdal_build/compile_et 01:25:14 runner i686-pld-linux-gcc default/source4/heimdal/lib/roken/base64_3.o default/source4/heimdal/lib/roken/ct_3.o default/source4/heimdal/lib/roken/hex_3.o default/source4/heimdal/lib/roken/bswap_3.o default/source4/heimdal/lib/roken/dumpdata_3.o default/source4/heimdal/lib/roken/emalloc_3.o default/source4/heimdal/lib/roken/ecalloc_3.o default/source4/heimdal/lib/roken/getarg_3.o default/source4/heimdal/lib/roken/get_window_size_3.o default/source4/heimdal/lib/roken/getdtablesize_3.o default/source4/heimdal/lib/roken/h_errno_3.o default/source4/heimdal/lib/roken/issuid_3.o default/source4/heimdal/lib/roken/net_read_3.o default/source4/heimdal/lib/roken/net_write_3.o default/source4/heimdal/lib/roken/parse_time_3.o default/source4/heimdal/lib/roken/parse_units_3.o default/source4/heimdal/lib/roken/vis_3.o default/source4/heimdal/lib/roken/strlwr_3.o default/source4/heimdal/lib/roken/strsep_copy_3.o default/source4/heimdal/lib/roken/strsep_3.o default/source4/heimdal/lib/roken/strupr_3.o default/source4/heimdal/lib/roken/strpool_3.o default/source4/heimdal/lib/roken/estrdup_3.o default/source4/heimdal/lib/roken/erealloc_3.o default/source4/heimdal/lib/roken/simple_exec_3.o default/source4/heimdal/lib/roken/strcollect_3.o default/source4/heimdal/lib/roken/rtbl_3.o default/source4/heimdal/lib/roken/rand_3.o default/source4/heimdal/lib/roken/cloexec_3.o default/source4/heimdal/lib/roken/xfree_3.o default/source4/heimdal_build/replace_3.o default/source4/heimdal/lib/roken/closefrom_3.o default/source4/heimdal/lib/vers/print_version_128.o default/source4/heimdal_build/version_128.o default/source4/heimdal/lib/com_err/parse_132.o default/source4/heimdal/lib/com_err/lex_132.o default/source4/heimdal/lib/com_err/compile_et_132.o default/lib/replace/replace_1.o -o /tmp/B.zYV1cz/BUILD/samba-4.9.3/bin/default/source4/heimdal_build/compile_et -Wl,--as-needed -Wl,--no-copy-dt-needed-entries -Wl,-z,relro -Wl,-z,combreloc -lpthread -Wl,-no-undefined -Wl,--export-dynamic -L/usr/local/lib -Wl,-Bdynamic -lbsd 01:25:14 runner i686-pld-linux-gcc default/source4/heimdal/lib/roken/base64_3.o default/source4/heimdal/lib/roken/ct_3.o default/source4/heimdal/lib/roken/hex_3.o default/source4/heimdal/lib/roken/bswap_3.o default/source4/heimdal/lib/roken/dumpdata_3.o default/source4/heimdal/lib/roken/emalloc_3.o default/source4/heimdal/lib/roken/ecalloc_3.o default/source4/heimdal/lib/roken/getarg_3.o default/source4/heimdal/lib/roken/get_window_size_3.o default/source4/heimdal/lib/roken/getdtablesize_3.o default/source4/heimdal/lib/roken/h_errno_3.o default/source4/heimdal/lib/roken/issuid_3.o default/source4/heimdal/lib/roken/net_read_3.o default/source4/heimdal/lib/roken/net_write_3.o default/source4/heimdal/lib/roken/parse_time_3.o default/source4/heimdal/lib/roken/parse_units_3.o default/source4/heimdal/lib/roken/vis_3.o default/source4/heimdal/lib/roken/strlwr_3.o default/source4/heimdal/lib/roken/strsep_copy_3.o default/source4/heimdal/lib/roken/strsep_3.o default/source4/heimdal/lib/roken/strupr_3.o default/source4/heimdal/lib/roken/strpool_3.o default/source4/heimdal/lib/roken/estrdup_3.o default/source4/heimdal/lib/roken/erealloc_3.o default/source4/heimdal/lib/roken/simple_exec_3.o default/source4/heimdal/lib/roken/strcollect_3.o default/source4/heimdal/lib/roken/rtbl_3.o default/source4/heimdal/lib/roken/rand_3.o default/source4/heimdal/lib/roken/cloexec_3.o default/source4/heimdal/lib/roken/xfree_3.o default/source4/heimdal_build/replace_3.o default/source4/heimdal/lib/roken/closefrom_3.o default/source4/heimdal/lib/vers/print_version_128.o default/source4/heimdal_build/version_128.o default/source4/heimdal/lib/asn1/main_130.o default/source4/heimdal/lib/asn1/gen_130.o default/source4/heimdal/lib/asn1/gen_copy_130.o default/source4/heimdal/lib/asn1/gen_decode_130.o default/source4/heimdal/lib/asn1/gen_encode_130.o default/source4/heimdal/lib/asn1/gen_free_130.o default/source4/heimdal/lib/asn1/gen_glue_130.o default/source4/heimdal/lib/asn1/gen_length_130.o default/source4/heimdal/lib/asn1/gen_seq_130.o default/source4/heimdal/lib/asn1/gen_template_130.o default/source4/heimdal/lib/asn1/hash_130.o default/source4/heimdal/lib/asn1/symbol_130.o default/source4/heimdal/lib/asn1/asn1parse_130.o default/source4/heimdal/lib/asn1/lex_130.o default/lib/replace/replace_1.o -o /tmp/B.zYV1cz/BUILD/samba-4.9.3/bin/default/source4/heimdal_build/asn1_compile -Wl,--as-needed -Wl,--no-copy-dt-needed-entries -Wl,-z,relro -Wl,-z,combreloc -lpthread -Wl,-no-undefined -Wl,--export-dynamic -L/usr/local/lib -Wl,-Bdynamic -lbsd [ 282/4157] Compiling ASN1 source4/heimdal/lib/asn1/kx509.asn1 01:25:14 runner cd "/tmp/B.zYV1cz/BUILD/samba-4.9.3/bin/default/source4/heimdal/lib/asn1" && "/tmp/B.zYV1cz/BUILD/samba-4.9.3/bin/asn1_compile" --one-code-file "/tmp/B.zYV1cz/BUILD/samba-4.9.3/source4/heimdal/lib/asn1/kx509.asn1" kx509_asn1 [ 283/4157] Compiling ASN1 source4/heimdal/lib/asn1/digest.asn1 [ 284/4157] Compiling ASN1 source4/heimdal/lib/hdb/hdb.asn1 01:25:14 runner cd "/tmp/B.zYV1cz/BUILD/samba-4.9.3/bin/default/source4/heimdal/lib/asn1" && "/tmp/B.zYV1cz/BUILD/samba-4.9.3/bin/asn1_compile" --sequence=HDB-Ext-KeySet --sequence=Keys --one-code-file "/tmp/B.zYV1cz/BUILD/samba-4.9.3/source4/heimdal/lib/hdb/hdb.asn1" hdb_asn1 [ 285/4157] Compiling ASN1 source4/heimdal/lib/gssapi/mech/gssapi.asn1 [ 286/4157] Compiling ASN1 source4/heimdal/lib/gssapi/spnego/spnego.asn1 01:25:14 runner cd "/tmp/B.zYV1cz/BUILD/samba-4.9.3/bin/default/source4/heimdal/lib/asn1" && "/tmp/B.zYV1cz/BUILD/samba-4.9.3/bin/asn1_compile" --one-code-file "/tmp/B.zYV1cz/BUILD/samba-4.9.3/source4/heimdal/lib/asn1/digest.asn1" digest_asn1 [ 287/4157] Compiling ASN1 source4/heimdal/lib/asn1/rfc2459.asn1 [ 288/4157] Compiling ASN1 source4/heimdal/lib/asn1/krb5.asn1 01:25:14 runner cd "/tmp/B.zYV1cz/BUILD/samba-4.9.3/bin/default/source4/heimdal/lib/gssapi" && "/tmp/B.zYV1cz/BUILD/samba-4.9.3/bin/asn1_compile" --one-code-file "/tmp/B.zYV1cz/BUILD/samba-4.9.3/source4/heimdal/lib/gssapi/mech/gssapi.asn1" gssapi_asn1 [ 289/4157] Compiling ASN1 source4/heimdal/lib/asn1/pkinit.asn1 01:25:14 runner cd "/tmp/B.zYV1cz/BUILD/samba-4.9.3/bin/default/source4/heimdal/lib/gssapi" && "/tmp/B.zYV1cz/BUILD/samba-4.9.3/bin/asn1_compile" --sequence=MechTypeList --one-code-file "/tmp/B.zYV1cz/BUILD/samba-4.9.3/source4/heimdal/lib/gssapi/spnego/spnego.asn1" spnego_asn1 01:25:14 runner cd "/tmp/B.zYV1cz/BUILD/samba-4.9.3/bin/default/source4/heimdal/lib/asn1" && "/tmp/B.zYV1cz/BUILD/samba-4.9.3/bin/asn1_compile" --preserve-binary=TBSCertificate --preserve-binary=TBSCRLCertList --preserve-binary=Name --sequence=GeneralNames --sequence=Extensions --sequence=CRLDistributionPoints --one-code-file "/tmp/B.zYV1cz/BUILD/samba-4.9.3/source4/heimdal/lib/asn1/rfc2459.asn1" rfc2459_asn1 [ 290/4157] Compiling ASN1 source4/heimdal/lib/asn1/cms.asn1 01:25:14 runner cd "/tmp/B.zYV1cz/BUILD/samba-4.9.3/bin/default/source4/heimdal/lib/asn1" && "/tmp/B.zYV1cz/BUILD/samba-4.9.3/bin/asn1_compile" --one-code-file "/tmp/B.zYV1cz/BUILD/samba-4.9.3/source4/heimdal/lib/asn1/pkinit.asn1" pkinit_asn1 01:25:14 runner cd "/tmp/B.zYV1cz/BUILD/samba-4.9.3/bin/default/source4/heimdal/lib/asn1" && "/tmp/B.zYV1cz/BUILD/samba-4.9.3/bin/asn1_compile" --option-file='/tmp/B.zYV1cz/BUILD/samba-4.9.3/source4/heimdal/lib/asn1/krb5.opt' --one-code-file "/tmp/B.zYV1cz/BUILD/samba-4.9.3/source4/heimdal/lib/asn1/krb5.asn1" krb5_asn1 01:25:14 runner cd "/tmp/B.zYV1cz/BUILD/samba-4.9.3/bin/default/source4/heimdal/lib/asn1" && "/tmp/B.zYV1cz/BUILD/samba-4.9.3/bin/asn1_compile" --option-file='/tmp/B.zYV1cz/BUILD/samba-4.9.3/source4/heimdal/lib/asn1/cms.opt' --one-code-file "/tmp/B.zYV1cz/BUILD/samba-4.9.3/source4/heimdal/lib/asn1/cms.asn1" cms_asn1 [ 291/4157] Compiling ASN1 source4/heimdal/lib/hx509/ocsp.asn1 01:25:14 runner cd "/tmp/B.zYV1cz/BUILD/samba-4.9.3/bin/default/source4/heimdal/lib/hx509" && "/tmp/B.zYV1cz/BUILD/samba-4.9.3/bin/asn1_compile" --preserve-binary=OCSPTBSRequest --preserve-binary=OCSPResponseData --one-code-file "/tmp/B.zYV1cz/BUILD/samba-4.9.3/source4/heimdal/lib/hx509/ocsp.asn1" ocsp_asn1 [ 292/4157] Compiling ASN1 source4/heimdal/lib/asn1/pkcs8.asn1 [ 293/4157] Compiling ASN1 source4/heimdal/lib/asn1/pkcs9.asn1 01:25:14 runner cd "/tmp/B.zYV1cz/BUILD/samba-4.9.3/bin/default/source4/heimdal/lib/asn1" && "/tmp/B.zYV1cz/BUILD/samba-4.9.3/bin/asn1_compile" --one-code-file "/tmp/B.zYV1cz/BUILD/samba-4.9.3/source4/heimdal/lib/asn1/pkcs8.asn1" pkcs8_asn1 01:25:14 runner cd "/tmp/B.zYV1cz/BUILD/samba-4.9.3/bin/default/source4/heimdal/lib/asn1" && "/tmp/B.zYV1cz/BUILD/samba-4.9.3/bin/asn1_compile" --one-code-file "/tmp/B.zYV1cz/BUILD/samba-4.9.3/source4/heimdal/lib/asn1/pkcs9.asn1" pkcs9_asn1 [ 294/4157] Compiling ASN1 source4/heimdal/lib/asn1/pkcs12.asn1 [ 295/4157] Compiling ASN1 source4/heimdal/lib/hx509/pkcs10.asn1 01:25:14 runner cd "/tmp/B.zYV1cz/BUILD/samba-4.9.3/bin/default/source4/heimdal/lib/asn1" && "/tmp/B.zYV1cz/BUILD/samba-4.9.3/bin/asn1_compile" --one-code-file "/tmp/B.zYV1cz/BUILD/samba-4.9.3/source4/heimdal/lib/asn1/pkcs12.asn1" pkcs12_asn1 [ 296/4157] Generating param_functions.c 01:25:14 runner cd "/tmp/B.zYV1cz/BUILD/samba-4.9.3/bin/default/source4/heimdal/lib/hx509" && "/tmp/B.zYV1cz/BUILD/samba-4.9.3/bin/asn1_compile" --preserve-binary=CertificationRequestInfo --one-code-file "/tmp/B.zYV1cz/BUILD/samba-4.9.3/source4/heimdal/lib/hx509/pkcs10.asn1" pkcs10_asn1 [ 297/4157] Generating param_functions.h 01:25:14 runner /usr/bin/python /tmp/B.zYV1cz/BUILD/samba-4.9.3/script/generate_param.py --file /tmp/B.zYV1cz/BUILD/samba-4.9.3/bin/default/docs-xml/smbdotconf/parameters.all.xml --output default/lib/param/param_functions.c --mode=FUNCTIONS 01:25:14 runner /usr/bin/python /tmp/B.zYV1cz/BUILD/samba-4.9.3/script/generate_param.py --file /tmp/B.zYV1cz/BUILD/samba-4.9.3/bin/default/docs-xml/smbdotconf/parameters.all.xml --output default/lib/param/param_functions.h --mode=LIBPROTO [ 298/4157] Generating param_local.h 01:25:14 runner /usr/bin/python /tmp/B.zYV1cz/BUILD/samba-4.9.3/script/generate_param.py --file /tmp/B.zYV1cz/BUILD/samba-4.9.3/bin/default/docs-xml/smbdotconf/parameters.all.xml --output default/lib/param/param_local.h --mode=PARAMDEFS --scope=LOCAL [ 299/4157] Generating param_global.h [ 300/4157] Generating param_table_gen.c 01:25:14 runner /usr/bin/python /tmp/B.zYV1cz/BUILD/samba-4.9.3/script/generate_param.py --file /tmp/B.zYV1cz/BUILD/samba-4.9.3/bin/default/docs-xml/smbdotconf/parameters.all.xml --output default/lib/param/param_global.h --mode=PARAMDEFS --scope=GLOBAL [ 301/4157] Compiling IDL librpc/idl/atsvc.idl [ 302/4157] Compiling IDL librpc/idl/auth.idl [ 303/4157] Compiling IDL librpc/idl/drsuapi.idl 01:25:14 runner cd .. && CPP="/usr/bin/cpp" CC="i686-pld-linux-gcc" /usr/bin/perl "/tmp/B.zYV1cz/BUILD/samba-4.9.3/pidl/pidl" --quiet --header --ndr-parser --samba3-ndr-server --server --client --python --outputdir bin/default/librpc/gen_ndr -- "/tmp/B.zYV1cz/BUILD/samba-4.9.3/librpc/idl/atsvc.idl" 01:25:14 runner /usr/bin/python /tmp/B.zYV1cz/BUILD/samba-4.9.3/script/generate_param.py --file /tmp/B.zYV1cz/BUILD/samba-4.9.3/bin/default/docs-xml/smbdotconf/parameters.all.xml --output default/lib/param/param_table_gen.c --mode=PARAMTABLE [ 304/4157] Compiling IDL librpc/idl/epmapper.idl 01:25:14 runner cd .. && CPP="/usr/bin/cpp" CC="i686-pld-linux-gcc" /usr/bin/perl "/tmp/B.zYV1cz/BUILD/samba-4.9.3/pidl/pidl" --quiet --header --ndr-parser --samba3-ndr-server --server --client --python --outputdir bin/default/librpc/gen_ndr -- "/tmp/B.zYV1cz/BUILD/samba-4.9.3/librpc/idl/drsuapi.idl" 01:25:14 runner cd .. && CPP="/usr/bin/cpp" CC="i686-pld-linux-gcc" /usr/bin/perl "/tmp/B.zYV1cz/BUILD/samba-4.9.3/pidl/pidl" --quiet --header --ndr-parser --samba3-ndr-server --server --client --python --outputdir bin/default/librpc/gen_ndr -- "/tmp/B.zYV1cz/BUILD/samba-4.9.3/librpc/idl/epmapper.idl" 01:25:14 runner cd .. && CPP="/usr/bin/cpp" CC="i686-pld-linux-gcc" /usr/bin/perl "/tmp/B.zYV1cz/BUILD/samba-4.9.3/pidl/pidl" --quiet --header --ndr-parser --samba3-ndr-server --server --client --python --outputdir bin/default/librpc/gen_ndr -- "/tmp/B.zYV1cz/BUILD/samba-4.9.3/librpc/idl/auth.idl" [ 305/4157] Compiling IDL librpc/idl/initshutdown.idl 01:25:14 runner cd .. && CPP="/usr/bin/cpp" CC="i686-pld-linux-gcc" /usr/bin/perl "/tmp/B.zYV1cz/BUILD/samba-4.9.3/pidl/pidl" --quiet --header --ndr-parser --samba3-ndr-server --server --client --python --outputdir bin/default/librpc/gen_ndr -- "/tmp/B.zYV1cz/BUILD/samba-4.9.3/librpc/idl/initshutdown.idl" [ 306/4157] Compiling IDL librpc/idl/misc.idl 01:25:14 runner cd .. && CPP="/usr/bin/cpp" CC="i686-pld-linux-gcc" /usr/bin/perl "/tmp/B.zYV1cz/BUILD/samba-4.9.3/pidl/pidl" --quiet --header --ndr-parser --samba3-ndr-server --server --client --python --outputdir bin/default/librpc/gen_ndr -- "/tmp/B.zYV1cz/BUILD/samba-4.9.3/librpc/idl/misc.idl" [ 307/4157] Compiling IDL librpc/idl/ntlmssp.idl 01:25:14 runner cd .. && CPP="/usr/bin/cpp" CC="i686-pld-linux-gcc" /usr/bin/perl "/tmp/B.zYV1cz/BUILD/samba-4.9.3/pidl/pidl" --quiet --header --ndr-parser --samba3-ndr-server --server --client --python --outputdir bin/default/librpc/gen_ndr -- "/tmp/B.zYV1cz/BUILD/samba-4.9.3/librpc/idl/ntlmssp.idl" [ 308/4157] Compiling IDL librpc/idl/negoex.idl 01:25:14 runner cd .. && CPP="/usr/bin/cpp" CC="i686-pld-linux-gcc" /usr/bin/perl "/tmp/B.zYV1cz/BUILD/samba-4.9.3/pidl/pidl" --quiet --header --ndr-parser --samba3-ndr-server --server --client --python --outputdir bin/default/librpc/gen_ndr -- "/tmp/B.zYV1cz/BUILD/samba-4.9.3/librpc/idl/negoex.idl" /tmp/B.zYV1cz/BUILD/samba-4.9.3/librpc/idl/epmapper.idl:203: warning: subcontext() is deprecated. Use represent_as() or transmit_as() instead /tmp/B.zYV1cz/BUILD/samba-4.9.3/librpc/idl/epmapper.idl:204: warning: subcontext() is deprecated. Use represent_as() or transmit_as() instead /tmp/B.zYV1cz/BUILD/samba-4.9.3/librpc/idl/epmapper.idl:219: warning: subcontext() is deprecated. Use represent_as() or transmit_as() instead [ 309/4157] Compiling IDL librpc/idl/schannel.idl 01:25:14 runner cd .. && CPP="/usr/bin/cpp" CC="i686-pld-linux-gcc" /usr/bin/perl "/tmp/B.zYV1cz/BUILD/samba-4.9.3/pidl/pidl" --quiet --header --ndr-parser --samba3-ndr-server --server --client --python --outputdir bin/default/librpc/gen_ndr -- "/tmp/B.zYV1cz/BUILD/samba-4.9.3/librpc/idl/schannel.idl" [ 310/4157] Compiling IDL librpc/idl/trkwks.idl 01:25:14 runner cd .. && CPP="/usr/bin/cpp" CC="i686-pld-linux-gcc" /usr/bin/perl "/tmp/B.zYV1cz/BUILD/samba-4.9.3/pidl/pidl" --quiet --header --ndr-parser --samba3-ndr-server --server --client --python --outputdir bin/default/librpc/gen_ndr -- "/tmp/B.zYV1cz/BUILD/samba-4.9.3/librpc/idl/trkwks.idl" [ 311/4157] Compiling IDL librpc/idl/audiosrv.idl 01:25:15 runner cd .. && CPP="/usr/bin/cpp" CC="i686-pld-linux-gcc" /usr/bin/perl "/tmp/B.zYV1cz/BUILD/samba-4.9.3/pidl/pidl" --quiet --header --ndr-parser --samba3-ndr-server --server --client --python --outputdir bin/default/librpc/gen_ndr -- "/tmp/B.zYV1cz/BUILD/samba-4.9.3/librpc/idl/audiosrv.idl" /tmp/B.zYV1cz/BUILD/samba-4.9.3/librpc/idl/negoex.idl:157: warning: helper() is pidl-specific and deprecated. Use `include' instead [ 312/4157] Compiling IDL librpc/idl/dfsblobs.idl 01:25:15 runner cd .. && CPP="/usr/bin/cpp" CC="i686-pld-linux-gcc" /usr/bin/perl "/tmp/B.zYV1cz/BUILD/samba-4.9.3/pidl/pidl" --quiet --header --ndr-parser --samba3-ndr-server --server --client --python --outputdir bin/default/librpc/gen_ndr -- "/tmp/B.zYV1cz/BUILD/samba-4.9.3/librpc/idl/dfsblobs.idl" [ 313/4157] Compiling IDL librpc/idl/dsbackup.idl 01:25:15 runner cd .. && CPP="/usr/bin/cpp" CC="i686-pld-linux-gcc" /usr/bin/perl "/tmp/B.zYV1cz/BUILD/samba-4.9.3/pidl/pidl" --quiet --header --ndr-parser --samba3-ndr-server --server --client --python --outputdir bin/default/librpc/gen_ndr -- "/tmp/B.zYV1cz/BUILD/samba-4.9.3/librpc/idl/dsbackup.idl" /tmp/B.zYV1cz/BUILD/samba-4.9.3/librpc/idl/ntlmssp.idl:330: warning: helper() is pidl-specific and deprecated. Use `include' instead [ 314/4157] Compiling IDL librpc/idl/eventlog.idl 01:25:15 runner cd .. && CPP="/usr/bin/cpp" CC="i686-pld-linux-gcc" /usr/bin/perl "/tmp/B.zYV1cz/BUILD/samba-4.9.3/pidl/pidl" --quiet --header --ndr-parser --samba3-ndr-server --server --client --python --outputdir bin/default/librpc/gen_ndr -- "/tmp/B.zYV1cz/BUILD/samba-4.9.3/librpc/idl/eventlog.idl" [ 315/4157] Compiling IDL librpc/idl/file_id.idl 01:25:15 runner cd .. && CPP="/usr/bin/cpp" CC="i686-pld-linux-gcc" /usr/bin/perl "/tmp/B.zYV1cz/BUILD/samba-4.9.3/pidl/pidl" --quiet --header --ndr-parser --samba3-ndr-server --server --client --python --outputdir bin/default/librpc/gen_ndr -- "/tmp/B.zYV1cz/BUILD/samba-4.9.3/librpc/idl/file_id.idl" [ 316/4157] Compiling IDL librpc/idl/keysvc.idl 01:25:15 runner cd .. && CPP="/usr/bin/cpp" CC="i686-pld-linux-gcc" /usr/bin/perl "/tmp/B.zYV1cz/BUILD/samba-4.9.3/pidl/pidl" --quiet --header --ndr-parser --samba3-ndr-server --server --client --python --outputdir bin/default/librpc/gen_ndr -- "/tmp/B.zYV1cz/BUILD/samba-4.9.3/librpc/idl/keysvc.idl" [ 317/4157] Compiling IDL librpc/idl/msgsvc.idl 01:25:15 runner cd .. && CPP="/usr/bin/cpp" CC="i686-pld-linux-gcc" /usr/bin/perl "/tmp/B.zYV1cz/BUILD/samba-4.9.3/pidl/pidl" --quiet --header --ndr-parser --samba3-ndr-server --server --client --python --outputdir bin/default/librpc/gen_ndr -- "/tmp/B.zYV1cz/BUILD/samba-4.9.3/librpc/idl/msgsvc.idl" [ 318/4157] Compiling IDL librpc/idl/ntsvcs.idl 01:25:15 runner cd .. && CPP="/usr/bin/cpp" CC="i686-pld-linux-gcc" /usr/bin/perl "/tmp/B.zYV1cz/BUILD/samba-4.9.3/pidl/pidl" --quiet --header --ndr-parser --samba3-ndr-server --server --client --python --outputdir bin/default/librpc/gen_ndr -- "/tmp/B.zYV1cz/BUILD/samba-4.9.3/librpc/idl/ntsvcs.idl" [ 319/4157] Compiling IDL librpc/idl/remact.idl 01:25:15 runner cd .. && CPP="/usr/bin/cpp" CC="i686-pld-linux-gcc" /usr/bin/perl "/tmp/B.zYV1cz/BUILD/samba-4.9.3/pidl/pidl" --quiet --header --ndr-parser --samba3-ndr-server --server --client --python --outputdir bin/default/librpc/gen_ndr -- "/tmp/B.zYV1cz/BUILD/samba-4.9.3/librpc/idl/remact.idl" [ 320/4157] Compiling IDL librpc/idl/security.idl 01:25:15 runner cd .. && CPP="/usr/bin/cpp" CC="i686-pld-linux-gcc" /usr/bin/perl "/tmp/B.zYV1cz/BUILD/samba-4.9.3/pidl/pidl" --quiet --header --ndr-parser --samba3-ndr-server --server --client --python --outputdir bin/default/librpc/gen_ndr -- "/tmp/B.zYV1cz/BUILD/samba-4.9.3/librpc/idl/security.idl" [ 321/4157] Compiling IDL librpc/idl/smb_acl.idl 01:25:15 runner cd .. && CPP="/usr/bin/cpp" CC="i686-pld-linux-gcc" /usr/bin/perl "/tmp/B.zYV1cz/BUILD/samba-4.9.3/pidl/pidl" --quiet --header --ndr-parser --samba3-ndr-server --server --client --python --outputdir bin/default/librpc/gen_ndr -- "/tmp/B.zYV1cz/BUILD/samba-4.9.3/librpc/idl/smb_acl.idl" [ 322/4157] Compiling IDL librpc/idl/unixinfo.idl 01:25:15 runner cd .. && CPP="/usr/bin/cpp" CC="i686-pld-linux-gcc" /usr/bin/perl "/tmp/B.zYV1cz/BUILD/samba-4.9.3/pidl/pidl" --quiet --header --ndr-parser --samba3-ndr-server --server --client --python --outputdir bin/default/librpc/gen_ndr -- "/tmp/B.zYV1cz/BUILD/samba-4.9.3/librpc/idl/unixinfo.idl" /tmp/B.zYV1cz/BUILD/samba-4.9.3/librpc/idl/ntsvcs.idl:264: warning: top-level [out] pointer `unknown5a' is not a [ref] pointer /tmp/B.zYV1cz/BUILD/samba-4.9.3/librpc/idl/security.idl:601: warning: subcontext() is deprecated. Use represent_as() or transmit_as() instead [ 323/4157] Compiling IDL librpc/idl/wzcsvc.idl 01:25:15 runner cd .. && CPP="/usr/bin/cpp" CC="i686-pld-linux-gcc" /usr/bin/perl "/tmp/B.zYV1cz/BUILD/samba-4.9.3/pidl/pidl" --quiet --header --ndr-parser --samba3-ndr-server --server --client --python --outputdir bin/default/librpc/gen_ndr -- "/tmp/B.zYV1cz/BUILD/samba-4.9.3/librpc/idl/wzcsvc.idl" [ 324/4157] Compiling IDL librpc/idl/browser.idl 01:25:15 runner cd .. && CPP="/usr/bin/cpp" CC="i686-pld-linux-gcc" /usr/bin/perl "/tmp/B.zYV1cz/BUILD/samba-4.9.3/pidl/pidl" --quiet --header --ndr-parser --samba3-ndr-server --server --client --python --outputdir bin/default/librpc/gen_ndr -- "/tmp/B.zYV1cz/BUILD/samba-4.9.3/librpc/idl/browser.idl" [ 325/4157] Compiling IDL librpc/idl/dfs.idl 01:25:15 runner cd .. && CPP="/usr/bin/cpp" CC="i686-pld-linux-gcc" /usr/bin/perl "/tmp/B.zYV1cz/BUILD/samba-4.9.3/pidl/pidl" --quiet --header --ndr-parser --samba3-ndr-server --server --client --python --outputdir bin/default/librpc/gen_ndr -- "/tmp/B.zYV1cz/BUILD/samba-4.9.3/librpc/idl/dfs.idl" [ 326/4157] Compiling IDL librpc/idl/dssetup.idl 01:25:15 runner cd .. && CPP="/usr/bin/cpp" CC="i686-pld-linux-gcc" /usr/bin/perl "/tmp/B.zYV1cz/BUILD/samba-4.9.3/pidl/pidl" --quiet --header --ndr-parser --samba3-ndr-server --server --client --python --outputdir bin/default/librpc/gen_ndr -- "/tmp/B.zYV1cz/BUILD/samba-4.9.3/librpc/idl/dssetup.idl" [ 327/4157] Compiling IDL librpc/idl/frsapi.idl 01:25:16 runner cd .. && CPP="/usr/bin/cpp" CC="i686-pld-linux-gcc" /usr/bin/perl "/tmp/B.zYV1cz/BUILD/samba-4.9.3/pidl/pidl" --quiet --header --ndr-parser --samba3-ndr-server --server --client --python --outputdir bin/default/librpc/gen_ndr -- "/tmp/B.zYV1cz/BUILD/samba-4.9.3/librpc/idl/frsapi.idl" [ 328/4157] Compiling IDL librpc/idl/krb5pac.idl 01:25:16 runner cd .. && CPP="/usr/bin/cpp" CC="i686-pld-linux-gcc" /usr/bin/perl "/tmp/B.zYV1cz/BUILD/samba-4.9.3/pidl/pidl" --quiet --header --ndr-parser --samba3-ndr-server --server --client --python --outputdir bin/default/librpc/gen_ndr -- "/tmp/B.zYV1cz/BUILD/samba-4.9.3/librpc/idl/krb5pac.idl" /tmp/B.zYV1cz/BUILD/samba-4.9.3/librpc/idl/dssetup.idl:84: warning: top-level [out] pointer `info' is not a [ref] pointer [ 329/4157] Compiling IDL librpc/idl/named_pipe_auth.idl 01:25:16 runner cd .. && CPP="/usr/bin/cpp" CC="i686-pld-linux-gcc" /usr/bin/perl "/tmp/B.zYV1cz/BUILD/samba-4.9.3/pidl/pidl" --quiet --header --ndr-parser --samba3-ndr-server --server --client --python --outputdir bin/default/librpc/gen_ndr -- "/tmp/B.zYV1cz/BUILD/samba-4.9.3/librpc/idl/named_pipe_auth.idl" [ 330/4157] Compiling IDL librpc/idl/orpc.idl 01:25:16 runner cd .. && CPP="/usr/bin/cpp" CC="i686-pld-linux-gcc" /usr/bin/perl "/tmp/B.zYV1cz/BUILD/samba-4.9.3/pidl/pidl" --quiet --header --ndr-parser --samba3-ndr-server --server --client --python --outputdir bin/default/librpc/gen_ndr -- "/tmp/B.zYV1cz/BUILD/samba-4.9.3/librpc/idl/orpc.idl" [ 331/4157] Compiling IDL librpc/idl/rot.idl 01:25:16 runner cd .. && CPP="/usr/bin/cpp" CC="i686-pld-linux-gcc" /usr/bin/perl "/tmp/B.zYV1cz/BUILD/samba-4.9.3/pidl/pidl" --quiet --header --ndr-parser --samba3-ndr-server --server --client --python --outputdir bin/default/librpc/gen_ndr -- "/tmp/B.zYV1cz/BUILD/samba-4.9.3/librpc/idl/rot.idl" [ 332/4157] Compiling IDL librpc/idl/spoolss.idl 01:25:16 runner cd .. && CPP="/usr/bin/cpp" CC="i686-pld-linux-gcc" /usr/bin/perl "/tmp/B.zYV1cz/BUILD/samba-4.9.3/pidl/pidl" --quiet --header --ndr-parser --samba3-ndr-server --server --client --python --outputdir bin/default/librpc/gen_ndr -- "/tmp/B.zYV1cz/BUILD/samba-4.9.3/librpc/idl/spoolss.idl" /tmp/B.zYV1cz/BUILD/samba-4.9.3/librpc/idl/orpc.idl:214: warning: subcontext() is deprecated. Use represent_as() or transmit_as() instead [ 333/4157] Compiling IDL librpc/idl/w32time.idl 01:25:16 runner cd .. && CPP="/usr/bin/cpp" CC="i686-pld-linux-gcc" /usr/bin/perl "/tmp/B.zYV1cz/BUILD/samba-4.9.3/pidl/pidl" --quiet --header --ndr-parser --samba3-ndr-server --server --client --python --outputdir bin/default/librpc/gen_ndr -- "/tmp/B.zYV1cz/BUILD/samba-4.9.3/librpc/idl/w32time.idl" [ 334/4157] Compiling IDL librpc/idl/dbgidl.idl 01:25:16 runner cd .. && CPP="/usr/bin/cpp" CC="i686-pld-linux-gcc" /usr/bin/perl "/tmp/B.zYV1cz/BUILD/samba-4.9.3/pidl/pidl" --quiet --header --ndr-parser --samba3-ndr-server --server --client --python --outputdir bin/default/librpc/gen_ndr -- "/tmp/B.zYV1cz/BUILD/samba-4.9.3/librpc/idl/dbgidl.idl" [ 335/4157] Compiling IDL librpc/idl/dnsserver.idl 01:25:16 runner cd .. && CPP="/usr/bin/cpp" CC="i686-pld-linux-gcc" /usr/bin/perl "/tmp/B.zYV1cz/BUILD/samba-4.9.3/pidl/pidl" --quiet --header --ndr-parser --samba3-ndr-server --server --client --python --outputdir bin/default/librpc/gen_ndr -- "/tmp/B.zYV1cz/BUILD/samba-4.9.3/librpc/idl/dnsserver.idl" /tmp/B.zYV1cz/BUILD/samba-4.9.3/librpc/idl/drsuapi.idl:1902: warning: helper() is pidl-specific and deprecated. Use `include' instead /tmp/B.zYV1cz/BUILD/samba-4.9.3/librpc/idl/drsuapi.idl:755: warning: subcontext() is deprecated. Use represent_as() or transmit_as() instead /tmp/B.zYV1cz/BUILD/samba-4.9.3/librpc/idl/drsuapi.idl:759: warning: subcontext() is deprecated. Use represent_as() or transmit_as() instead /tmp/B.zYV1cz/BUILD/samba-4.9.3/librpc/idl/drsuapi.idl:767: warning: subcontext() is deprecated. Use represent_as() or transmit_as() instead /tmp/B.zYV1cz/BUILD/samba-4.9.3/librpc/idl/drsuapi.idl:775: warning: subcontext() is deprecated. Use represent_as() or transmit_as() instead /tmp/B.zYV1cz/BUILD/samba-4.9.3/librpc/idl/drsuapi.idl:783: warning: subcontext() is deprecated. Use represent_as() or transmit_as() instead /tmp/B.zYV1cz/BUILD/samba-4.9.3/librpc/idl/drsuapi.idl:791: warning: subcontext() is deprecated. Use represent_as() or transmit_as() instead [ 336/4157] Compiling IDL librpc/idl/echo.idl 01:25:16 runner cd .. && CPP="/usr/bin/cpp" CC="i686-pld-linux-gcc" /usr/bin/perl "/tmp/B.zYV1cz/BUILD/samba-4.9.3/pidl/pidl" --quiet --header --ndr-parser --samba3-ndr-server --server --client --python --outputdir bin/default/librpc/gen_ndr -- "/tmp/B.zYV1cz/BUILD/samba-4.9.3/librpc/idl/echo.idl" [ 337/4157] Compiling IDL librpc/idl/frsrpc.idl 01:25:16 runner cd .. && CPP="/usr/bin/cpp" CC="i686-pld-linux-gcc" /usr/bin/perl "/tmp/B.zYV1cz/BUILD/samba-4.9.3/pidl/pidl" --quiet --header --ndr-parser --samba3-ndr-server --server --client --python --outputdir bin/default/librpc/gen_ndr -- "/tmp/B.zYV1cz/BUILD/samba-4.9.3/librpc/idl/frsrpc.idl" [ 338/4157] Compiling IDL librpc/idl/lsa.idl 01:25:17 runner cd .. && CPP="/usr/bin/cpp" CC="i686-pld-linux-gcc" /usr/bin/perl "/tmp/B.zYV1cz/BUILD/samba-4.9.3/pidl/pidl" --quiet --header --ndr-parser --samba3-ndr-server --server --client --python --outputdir bin/default/librpc/gen_ndr -- "/tmp/B.zYV1cz/BUILD/samba-4.9.3/librpc/idl/lsa.idl" /tmp/B.zYV1cz/BUILD/samba-4.9.3/librpc/idl/dnsserver.idl:1530: warning: helper() is pidl-specific and deprecated. Use `include' instead /tmp/B.zYV1cz/BUILD/samba-4.9.3/librpc/idl/dnsserver.idl:1462: warning: subcontext() is deprecated. Use represent_as() or transmit_as() instead /tmp/B.zYV1cz/BUILD/samba-4.9.3/librpc/idl/dnsserver.idl:1518: warning: subcontext() is deprecated. Use represent_as() or transmit_as() instead /tmp/B.zYV1cz/BUILD/samba-4.9.3/librpc/idl/schannel.idl:114: warning: helper() is pidl-specific and deprecated. Use `include' instead /tmp/B.zYV1cz/BUILD/samba-4.9.3/librpc/idl/frsrpc.idl:459: warning: helper() is pidl-specific and deprecated. Use `include' instead /tmp/B.zYV1cz/BUILD/samba-4.9.3/librpc/idl/frsrpc.idl:22: warning: subcontext() is deprecated. Use represent_as() or transmit_as() instead /tmp/B.zYV1cz/BUILD/samba-4.9.3/librpc/idl/frsrpc.idl:23: warning: subcontext() is deprecated. Use represent_as() or transmit_as() instead /tmp/B.zYV1cz/BUILD/samba-4.9.3/librpc/idl/frsrpc.idl:279: warning: subcontext() is deprecated. Use represent_as() or transmit_as() instead /tmp/B.zYV1cz/BUILD/samba-4.9.3/librpc/idl/frsrpc.idl:283: warning: subcontext() is deprecated. Use represent_as() or transmit_as() instead /tmp/B.zYV1cz/BUILD/samba-4.9.3/librpc/idl/frsrpc.idl:285: warning: subcontext() is deprecated. Use represent_as() or transmit_as() instead /tmp/B.zYV1cz/BUILD/samba-4.9.3/librpc/idl/frsrpc.idl:287: warning: subcontext() is deprecated. Use represent_as() or transmit_as() instead /tmp/B.zYV1cz/BUILD/samba-4.9.3/librpc/idl/frsrpc.idl:299: warning: subcontext() is deprecated. Use represent_as() or transmit_as() instead /tmp/B.zYV1cz/BUILD/samba-4.9.3/librpc/idl/frsrpc.idl:301: warning: subcontext() is deprecated. Use represent_as() or transmit_as() instead /tmp/B.zYV1cz/BUILD/samba-4.9.3/librpc/idl/frsrpc.idl:305: warning: subcontext() is deprecated. Use represent_as() or transmit_as() instead /tmp/B.zYV1cz/BUILD/samba-4.9.3/librpc/idl/frsrpc.idl:307: warning: subcontext() is deprecated. Use represent_as() or transmit_as() instead /tmp/B.zYV1cz/BUILD/samba-4.9.3/librpc/idl/frsrpc.idl:316: warning: subcontext() is deprecated. Use represent_as() or transmit_as() instead /tmp/B.zYV1cz/BUILD/samba-4.9.3/librpc/idl/frsrpc.idl:352: warning: subcontext() is deprecated. Use represent_as() or transmit_as() instead /tmp/B.zYV1cz/BUILD/samba-4.9.3/librpc/idl/frsrpc.idl:391: warning: subcontext() is deprecated. Use represent_as() or transmit_as() instead /tmp/B.zYV1cz/BUILD/samba-4.9.3/librpc/idl/frsrpc.idl:393: warning: subcontext() is deprecated. Use represent_as() or transmit_as() instead /tmp/B.zYV1cz/BUILD/samba-4.9.3/librpc/idl/frsrpc.idl:396: warning: subcontext() is deprecated. Use represent_as() or transmit_as() instead [ 339/4157] Compiling IDL librpc/idl/nbt.idl 01:25:17 runner cd .. && CPP="/usr/bin/cpp" CC="i686-pld-linux-gcc" /usr/bin/perl "/tmp/B.zYV1cz/BUILD/samba-4.9.3/pidl/pidl" --quiet --header --ndr-parser --samba3-ndr-server --server --client --python --outputdir bin/default/librpc/gen_ndr -- "/tmp/B.zYV1cz/BUILD/samba-4.9.3/librpc/idl/nbt.idl" [ 340/4157] Compiling IDL librpc/idl/dns.idl 01:25:17 runner cd .. && CPP="/usr/bin/cpp" CC="i686-pld-linux-gcc" /usr/bin/perl "/tmp/B.zYV1cz/BUILD/samba-4.9.3/pidl/pidl" --quiet --header --ndr-parser --samba3-ndr-server --server --client --python --outputdir bin/default/librpc/gen_ndr -- "/tmp/B.zYV1cz/BUILD/samba-4.9.3/librpc/idl/dns.idl" [ 341/4157] Compiling IDL librpc/idl/oxidresolver.idl 01:25:17 runner cd .. && CPP="/usr/bin/cpp" CC="i686-pld-linux-gcc" /usr/bin/perl "/tmp/B.zYV1cz/BUILD/samba-4.9.3/pidl/pidl" --quiet --header --ndr-parser --samba3-ndr-server --server --client --python --outputdir bin/default/librpc/gen_ndr -- "/tmp/B.zYV1cz/BUILD/samba-4.9.3/librpc/idl/oxidresolver.idl" [ 342/4157] Compiling IDL librpc/idl/samr.idl 01:25:17 runner cd .. && CPP="/usr/bin/cpp" CC="i686-pld-linux-gcc" /usr/bin/perl "/tmp/B.zYV1cz/BUILD/samba-4.9.3/pidl/pidl" --quiet --header --ndr-parser --samba3-ndr-server --server --client --python --outputdir bin/default/librpc/gen_ndr -- "/tmp/B.zYV1cz/BUILD/samba-4.9.3/librpc/idl/samr.idl" /tmp/B.zYV1cz/BUILD/samba-4.9.3/librpc/idl/dns.idl:271: warning: helper() is pidl-specific and deprecated. Use `include' instead /tmp/B.zYV1cz/BUILD/samba-4.9.3/librpc/idl/nbt.idl:696: warning: helper() is pidl-specific and deprecated. Use `include' instead [ 343/4157] Compiling IDL librpc/idl/server_id.idl 01:25:18 runner cd .. && CPP="/usr/bin/cpp" CC="i686-pld-linux-gcc" /usr/bin/perl "/tmp/B.zYV1cz/BUILD/samba-4.9.3/pidl/pidl" --quiet --header --ndr-parser --samba3-ndr-server --server --client --python --outputdir bin/default/librpc/gen_ndr -- "/tmp/B.zYV1cz/BUILD/samba-4.9.3/librpc/idl/server_id.idl" [ 344/4157] Compiling IDL librpc/idl/srvsvc.idl 01:25:18 runner cd .. && CPP="/usr/bin/cpp" CC="i686-pld-linux-gcc" /usr/bin/perl "/tmp/B.zYV1cz/BUILD/samba-4.9.3/pidl/pidl" --quiet --header --ndr-parser --samba3-ndr-server --server --client --python --outputdir bin/default/librpc/gen_ndr -- "/tmp/B.zYV1cz/BUILD/samba-4.9.3/librpc/idl/srvsvc.idl" [ 345/4157] Compiling IDL librpc/idl/winreg.idl 01:25:18 runner cd .. && CPP="/usr/bin/cpp" CC="i686-pld-linux-gcc" /usr/bin/perl "/tmp/B.zYV1cz/BUILD/samba-4.9.3/pidl/pidl" --quiet --header --ndr-parser --samba3-ndr-server --server --client --python --outputdir bin/default/librpc/gen_ndr -- "/tmp/B.zYV1cz/BUILD/samba-4.9.3/librpc/idl/winreg.idl" [ 346/4157] Compiling IDL librpc/idl/dcerpc.idl 01:25:18 runner cd .. && CPP="/usr/bin/cpp" CC="i686-pld-linux-gcc" /usr/bin/perl "/tmp/B.zYV1cz/BUILD/samba-4.9.3/pidl/pidl" --quiet --header --ndr-parser --samba3-ndr-server --server --client --python --outputdir bin/default/librpc/gen_ndr -- "/tmp/B.zYV1cz/BUILD/samba-4.9.3/librpc/idl/dcerpc.idl" [ 347/4157] Compiling IDL librpc/idl/drsblobs.idl 01:25:18 runner cd .. && CPP="/usr/bin/cpp" CC="i686-pld-linux-gcc" /usr/bin/perl "/tmp/B.zYV1cz/BUILD/samba-4.9.3/pidl/pidl" --quiet --header --ndr-parser --samba3-ndr-server --server --client --python --outputdir bin/default/librpc/gen_ndr -- "/tmp/B.zYV1cz/BUILD/samba-4.9.3/librpc/idl/drsblobs.idl" /tmp/B.zYV1cz/BUILD/samba-4.9.3/librpc/idl/spoolss.idl:3514: warning: helper() is pidl-specific and deprecated. Use `include' instead /tmp/B.zYV1cz/BUILD/samba-4.9.3/librpc/idl/spoolss.idl:890: warning: subcontext() is deprecated. Use represent_as() or transmit_as() instead /tmp/B.zYV1cz/BUILD/samba-4.9.3/librpc/idl/spoolss.idl:1097: warning: subcontext() is deprecated. Use represent_as() or transmit_as() instead /tmp/B.zYV1cz/BUILD/samba-4.9.3/librpc/idl/spoolss.idl:1289: warning: subcontext() is deprecated. Use represent_as() or transmit_as() instead /tmp/B.zYV1cz/BUILD/samba-4.9.3/librpc/idl/spoolss.idl:1639: warning: subcontext() is deprecated. Use represent_as() or transmit_as() instead /tmp/B.zYV1cz/BUILD/samba-4.9.3/librpc/idl/spoolss.idl:1663: warning: subcontext() is deprecated. Use represent_as() or transmit_as() instead /tmp/B.zYV1cz/BUILD/samba-4.9.3/librpc/idl/spoolss.idl:1738: warning: subcontext() is deprecated. Use represent_as() or transmit_as() instead /tmp/B.zYV1cz/BUILD/samba-4.9.3/librpc/idl/spoolss.idl:2081: warning: subcontext() is deprecated. Use represent_as() or transmit_as() instead /tmp/B.zYV1cz/BUILD/samba-4.9.3/librpc/idl/spoolss.idl:2472: warning: subcontext() is deprecated. Use represent_as() or transmit_as() instead /tmp/B.zYV1cz/BUILD/samba-4.9.3/librpc/idl/spoolss.idl:863: warning: top-level [out] pointer `info' is not a [ref] pointer /tmp/B.zYV1cz/BUILD/samba-4.9.3/librpc/idl/spoolss.idl:1097: warning: top-level [out] pointer `info' is not a [ref] pointer /tmp/B.zYV1cz/BUILD/samba-4.9.3/librpc/idl/spoolss.idl:1110: warning: top-level [out] pointer `info' is not a [ref] pointer /tmp/B.zYV1cz/BUILD/samba-4.9.3/librpc/idl/spoolss.idl:1289: warning: top-level [out] pointer `info' is not a [ref] pointer /tmp/B.zYV1cz/BUILD/samba-4.9.3/librpc/idl/spoolss.idl:1611: warning: top-level [out] pointer `info' is not a [ref] pointer /tmp/B.zYV1cz/BUILD/samba-4.9.3/librpc/idl/spoolss.idl:1639: warning: top-level [out] pointer `info' is not a [ref] pointer /tmp/B.zYV1cz/BUILD/samba-4.9.3/librpc/idl/spoolss.idl:1663: warning: top-level [out] pointer `info' is not a [ref] pointer /tmp/B.zYV1cz/BUILD/samba-4.9.3/librpc/idl/spoolss.idl:1701: warning: top-level [out] pointer `info' is not a [ref] pointer /tmp/B.zYV1cz/BUILD/samba-4.9.3/librpc/idl/spoolss.idl:1738: warning: top-level [out] pointer `info' is not a [ref] pointer /tmp/B.zYV1cz/BUILD/samba-4.9.3/librpc/idl/spoolss.idl:2081: warning: top-level [out] pointer `info' is not a [ref] pointer /tmp/B.zYV1cz/BUILD/samba-4.9.3/librpc/idl/spoolss.idl:2100: warning: top-level [out] pointer `info' is not a [ref] pointer /tmp/B.zYV1cz/BUILD/samba-4.9.3/librpc/idl/spoolss.idl:2196: warning: top-level [out] pointer `info' is not a [ref] pointer /tmp/B.zYV1cz/BUILD/samba-4.9.3/librpc/idl/spoolss.idl:2238: warning: top-level [out] pointer `info' is not a [ref] pointer /tmp/B.zYV1cz/BUILD/samba-4.9.3/librpc/idl/spoolss.idl:2434: warning: top-level [out] pointer `info' is not a [ref] pointer /tmp/B.zYV1cz/BUILD/samba-4.9.3/librpc/idl/spoolss.idl:2472: warning: top-level [out] pointer `info' is not a [ref] pointer /tmp/B.zYV1cz/BUILD/samba-4.9.3/librpc/idl/spoolss.idl:2979: warning: [out] argument `info' not a pointer /tmp/B.zYV1cz/BUILD/samba-4.9.3/librpc/idl/dcerpc.idl:665: warning: helper() is pidl-specific and deprecated. Use `include' instead /tmp/B.zYV1cz/BUILD/samba-4.9.3/librpc/idl/dcerpc.idl:642: warning: subcontext() is deprecated. Use represent_as() or transmit_as() instead /tmp/B.zYV1cz/BUILD/samba-4.9.3/librpc/idl/auth.idl:122: warning: helper() is pidl-specific and deprecated. Use `include' instead /tmp/B.zYV1cz/BUILD/samba-4.9.3/librpc/idl/auth.idl:107: error: Unable to determine origin of type `struct cli_credentials' /tmp/B.zYV1cz/BUILD/samba-4.9.3/librpc/idl/auth.idl:107: error: Unable to determine origin of type `struct cli_credentials' [ 348/4157] Compiling IDL librpc/idl/efs.idl 01:25:18 runner cd .. && CPP="/usr/bin/cpp" CC="i686-pld-linux-gcc" /usr/bin/perl "/tmp/B.zYV1cz/BUILD/samba-4.9.3/pidl/pidl" --quiet --header --ndr-parser --samba3-ndr-server --server --client --python --outputdir bin/default/librpc/gen_ndr -- "/tmp/B.zYV1cz/BUILD/samba-4.9.3/librpc/idl/efs.idl" [ 349/4157] Compiling IDL librpc/idl/frstrans.idl 01:25:18 runner cd .. && CPP="/usr/bin/cpp" CC="i686-pld-linux-gcc" /usr/bin/perl "/tmp/B.zYV1cz/BUILD/samba-4.9.3/pidl/pidl" --quiet --header --ndr-parser --samba3-ndr-server --server --client --python --outputdir bin/default/librpc/gen_ndr -- "/tmp/B.zYV1cz/BUILD/samba-4.9.3/librpc/idl/frstrans.idl" /tmp/B.zYV1cz/BUILD/samba-4.9.3/librpc/idl/frstrans.idl:287: warning: frstrans_RawGetFileDataAsync: dcerpc client does not support pipe yet /tmp/B.zYV1cz/BUILD/samba-4.9.3/librpc/idl/frstrans.idl:294: warning: frstrans_RdcGetFileDataAsync: dcerpc client does not support pipe yet [ 350/4157] Compiling IDL librpc/idl/mgmt.idl 01:25:19 runner cd .. && CPP="/usr/bin/cpp" CC="i686-pld-linux-gcc" /usr/bin/perl "/tmp/B.zYV1cz/BUILD/samba-4.9.3/pidl/pidl" --quiet --header --ndr-parser --samba3-ndr-server --server --client --python --outputdir bin/default/librpc/gen_ndr -- "/tmp/B.zYV1cz/BUILD/samba-4.9.3/librpc/idl/mgmt.idl" Range iterator outside integer range at /tmp/B.zYV1cz/BUILD/samba-4.9.3/pidl/lib/Parse/Pidl/NDR.pm line 232. /tmp/B.zYV1cz/BUILD/samba-4.9.3/librpc/idl/krb5pac.idl:215: warning: helper() is pidl-specific and deprecated. Use `include' instead /tmp/B.zYV1cz/BUILD/samba-4.9.3/librpc/idl/krb5pac.idl:73: warning: subcontext() is deprecated. Use represent_as() or transmit_as() instead /tmp/B.zYV1cz/BUILD/samba-4.9.3/librpc/idl/krb5pac.idl:123: warning: subcontext() is deprecated. Use represent_as() or transmit_as() instead /tmp/B.zYV1cz/BUILD/samba-4.9.3/librpc/idl/krb5pac.idl:129: warning: subcontext() is deprecated. Use represent_as() or transmit_as() instead /tmp/B.zYV1cz/BUILD/samba-4.9.3/librpc/idl/winreg.idl:191: warning: Got pointer for `size', expected fully dereferenced variable /tmp/B.zYV1cz/BUILD/samba-4.9.3/librpc/idl/winreg.idl:191: warning: Got pointer for `length', expected fully dereferenced variable /tmp/B.zYV1cz/BUILD/samba-4.9.3/librpc/idl/winreg.idl:191: warning: Got pointer for `size', expected fully dereferenced variable /tmp/B.zYV1cz/BUILD/samba-4.9.3/librpc/idl/winreg.idl:191: warning: Got pointer for `length', expected fully dereferenced variable /tmp/B.zYV1cz/BUILD/samba-4.9.3/librpc/idl/winreg.idl:191: warning: Got pointer for `length', expected fully dereferenced variable /tmp/B.zYV1cz/BUILD/samba-4.9.3/librpc/idl/winreg.idl:191: warning: Got pointer for `length', expected fully dereferenced variable /tmp/B.zYV1cz/BUILD/samba-4.9.3/librpc/idl/winreg.idl:268: warning: Got pointer for `data_size', expected fully dereferenced variable /tmp/B.zYV1cz/BUILD/samba-4.9.3/librpc/idl/winreg.idl:268: warning: Got pointer for `data_length', expected fully dereferenced variable /tmp/B.zYV1cz/BUILD/samba-4.9.3/librpc/idl/winreg.idl:268: warning: Got pointer for `data_size', expected fully dereferenced variable /tmp/B.zYV1cz/BUILD/samba-4.9.3/librpc/idl/winreg.idl:268: warning: Got pointer for `data_length', expected fully dereferenced variable /tmp/B.zYV1cz/BUILD/samba-4.9.3/librpc/idl/winreg.idl:268: warning: Got pointer for `data_length', expected fully dereferenced variable /tmp/B.zYV1cz/BUILD/samba-4.9.3/librpc/idl/winreg.idl:268: warning: Got pointer for `data_length', expected fully dereferenced variable /tmp/B.zYV1cz/BUILD/samba-4.9.3/librpc/idl/drsblobs.idl:755: warning: helper() is pidl-specific and deprecated. Use `include' instead /tmp/B.zYV1cz/BUILD/samba-4.9.3/librpc/idl/drsblobs.idl:666: warning: subcontext() is deprecated. Use represent_as() or transmit_as() instead /tmp/B.zYV1cz/BUILD/samba-4.9.3/librpc/idl/drsblobs.idl:420: warning: pointless array cntr: 'cntr_service_keys_0': length=0 /tmp/B.zYV1cz/BUILD/samba-4.9.3/librpc/idl/drsblobs.idl:420: warning: pointless array `service_keys' will always have size 0 /tmp/B.zYV1cz/BUILD/samba-4.9.3/librpc/idl/drsblobs.idl:420: warning: pointless array `service_keys' will always have size 0 Waf: Leaving directory `/tmp/B.zYV1cz/BUILD/samba-4.9.3/bin' Build failed: -> task failed (err #255): {task: PIDL_SRVSVC srvsvc.idl,CUtil.pm,Compat.pm,Dump.pm,Expr.pm,IDL.pm,NDR.pm,ODL.pm,ClientNDR.pm,ServerNDR.pm,Template.pm,Header.pm,Proxy.pm,Stub.pm,Header.pm,Client.pm,Parser.pm,Server.pm,Python.pm,TDR.pm,Template.pm,Samba4.pm,Typelist.pm,Util.pm,Conformance.pm,NDR.pm,Pidl.pm,Driver.pm -> srvsvc.h,ndr_srvsvc.c,ndr_srvsvc.h,srv_srvsvc.c,srv_srvsvc.h,ndr_srvsvc_s.c,ndr_srvsvc_c.c,ndr_srvsvc_c.h,py_srvsvc.c} make: *** [Makefile:8: all] Error 1 error: Bad exit status from /tmp/B.zYV1cz/BUILD/tmp/rpm-tmp.72287 (%build) RPM build errors: Bad exit status from /tmp/B.zYV1cz/BUILD/tmp/rpm-tmp.72287 (%build) ended at: Wed Nov 28 01:25:22 2018, done in 0:01:48.590027 error: No files produced. + chmod -R u+rwX /tmp/B.zYV1cz/BUILD + rm -rf /tmp/B.zYV1cz/tmp /tmp/B.zYV1cz/BUILD + rm -rf /tmp/B.zYV1cz Begin-PLD-Builder-Info Build-Time: user:136.93s sys:36.60s real:155.34s (faults io:13 non-io:6284644) End-PLD-Builder-Info
[Back to list of logs] [View rpm -qa of builder]