FailedOk

th/SRPMS[OK]
th/x32[OK]
th/i686[OK]
th/x86_64[OK]

ac/SRPMS[OK]
ac/i386[OK]
ac/i586[OK]
ac/i686[OK]
ac/alpha[OK]
ac/amd64[OK]
ac/athlon[OK]
ac/ppc[OK]
ac/sparc[OK]
ac/sparc64[OK]

Advanced Search
main()
Powered by PLD Linux
(c) 2002-2021 PLD Team
$Revision: 1.37 $
Powered by penguin.
Your IP: 3.214.224.207

sipsak 0bb4942d-17f6-43fd-94cf-43c9df914852

Status:Failed
Source URL:https://buildlogs.pld-linux.org/pld/th/i686/FAIL/sipsak,0bb4942d-17f6-43fd-94cf-43c9df914852.bz2
text/plain URL:View!
full text:View!
rpm -qa of builder:View!
Date:2021/09/25 23:14:16
Runtime:0:00:08.126932

Toc:

  • error 1
  • collect2: error: ld returned 1 exit status
  • error 2
  • make[2]: *** [Makefile:478: sipsak] Error 1
  • error 3
  • make[1]: *** [Makefile:566: all-recursive] Error 1
  • error 4
  • error: Bad exit status from /tmp/B.41zalfw6/BUILD/tmp/rpm-tmp.FLvVlt (%build)
  • error 5
  • RPM build errors:
  • error 6
  • error: No files produced.

Content:

/usr/bin/ld: exit_code.o:/tmp/B.41zalfw6/BUILD/sipsak/sipsak.h:333: multiple definition of `domainname'; auth.o:/tmp/B.41zalfw6/BUILD/sipsak/sipsak.h:333: first defined here
/usr/bin/ld: exit_code.o:/tmp/B.41zalfw6/BUILD/sipsak/sipsak.h:333: multiple definition of `username'; auth.o:/tmp/B.41zalfw6/BUILD/sipsak/sipsak.h:333: first defined here
/usr/bin/ld: exit_code.o:/tmp/B.41zalfw6/BUILD/sipsak/sipsak.h:332: multiple definition of `timer_final'; auth.o:/tmp/B.41zalfw6/BUILD/sipsak/sipsak.h:332: first defined here
/usr/bin/ld: exit_code.o:/tmp/B.41zalfw6/BUILD/sipsak/sipsak.h:332: multiple definition of `timer_t2'; auth.o:/tmp/B.41zalfw6/BUILD/sipsak/sipsak.h:332: first defined here
/usr/bin/ld: exit_code.o:/tmp/B.41zalfw6/BUILD/sipsak/sipsak.h:332: multiple definition of `timer_t1'; auth.o:/tmp/B.41zalfw6/BUILD/sipsak/sipsak.h:332: first defined here
/usr/bin/ld: exit_code.o:/tmp/B.41zalfw6/BUILD/sipsak/sipsak.h:331: multiple definition of `outbound_proxy'; auth.o:/tmp/B.41zalfw6/BUILD/sipsak/sipsak.h:331: first defined here
/usr/bin/ld: exit_code.o:/tmp/B.41zalfw6/BUILD/sipsak/sipsak.h:331: multiple definition of `timing'; auth.o:/tmp/B.41zalfw6/BUILD/sipsak/sipsak.h:331: first defined here
/usr/bin/ld: exit_code.o:/tmp/B.41zalfw6/BUILD/sipsak/sipsak.h:331: multiple definition of `fix_crlf'; auth.o:/tmp/B.41zalfw6/BUILD/sipsak/sipsak.h:331: first defined here
/usr/bin/ld: exit_code.o:/tmp/B.41zalfw6/BUILD/sipsak/sipsak.h:331: multiple definition of `nagios_warn'; auth.o:/tmp/B.41zalfw6/BUILD/sipsak/sipsak.h:331: first defined here
/usr/bin/ld: exit_code.o:/tmp/B.41zalfw6/BUILD/sipsak/sipsak.h:331: multiple definition of `empty_contact'; auth.o:/tmp/B.41zalfw6/BUILD/sipsak/sipsak.h:331: first defined here
/usr/bin/ld: exit_code.o:/tmp/B.41zalfw6/BUILD/sipsak/sipsak.h:330: multiple definition of `replace_b'; auth.o:/tmp/B.41zalfw6/BUILD/sipsak/sipsak.h:330: first defined here
/usr/bin/ld: exit_code.o:/tmp/B.41zalfw6/BUILD/sipsak/sipsak.h:330: multiple definition of `rand_rem'; auth.o:/tmp/B.41zalfw6/BUILD/sipsak/sipsak.h:330: first defined here
/usr/bin/ld: exit_code.o:/tmp/B.41zalfw6/BUILD/sipsak/sipsak.h:330: multiple definition of `redirects'; auth.o:/tmp/B.41zalfw6/BUILD/sipsak/sipsak.h:330: first defined here
/usr/bin/ld: exit_code.o:/tmp/B.41zalfw6/BUILD/sipsak/sipsak.h:330: multiple definition of `usrloc'; auth.o:/tmp/B.41zalfw6/BUILD/sipsak/sipsak.h:330: first defined here
/usr/bin/ld: exit_code.o:/tmp/B.41zalfw6/BUILD/sipsak/sipsak.h:330: multiple definition of `via_ins'; auth.o:/tmp/B.41zalfw6/BUILD/sipsak/sipsak.h:330: first defined here
/usr/bin/ld: exit_code.o:/tmp/B.41zalfw6/BUILD/sipsak/sipsak.h:330: multiple definition of `trace'; auth.o:/tmp/B.41zalfw6/BUILD/sipsak/sipsak.h:330: first defined here
/usr/bin/ld: exit_code.o:/tmp/B.41zalfw6/BUILD/sipsak/sipsak.h:330: multiple definition of `uri_b'; auth.o:/tmp/B.41zalfw6/BUILD/sipsak/sipsak.h:330: first defined here
/usr/bin/ld: exit_code.o:/tmp/B.41zalfw6/BUILD/sipsak/sipsak.h:330: multiple definition of `file_b'; auth.o:/tmp/B.41zalfw6/BUILD/sipsak/sipsak.h:330: first defined here
/usr/bin/ld: exit_code.o:/tmp/B.41zalfw6/BUILD/sipsak/sipsak.h:329: multiple definition of `symmetric'; auth.o:/tmp/B.41zalfw6/BUILD/sipsak/sipsak.h:329: first defined here
/usr/bin/ld: exit_code.o:/tmp/B.41zalfw6/BUILD/sipsak/sipsak.h:329: multiple definition of `numeric'; auth.o:/tmp/B.41zalfw6/BUILD/sipsak/sipsak.h:329: first defined here
/usr/bin/ld: exit_code.o:/tmp/B.41zalfw6/BUILD/sipsak/sipsak.h:329: multiple definition of `trashchar'; auth.o:/tmp/B.41zalfw6/BUILD/sipsak/sipsak.h:329: first defined here
/usr/bin/ld: exit_code.o:/tmp/B.41zalfw6/BUILD/sipsak/sipsak.h:329: multiple definition of `randtrash'; auth.o:/tmp/B.41zalfw6/BUILD/sipsak/sipsak.h:329: first defined here
/usr/bin/ld: exit_code.o:/tmp/B.41zalfw6/BUILD/sipsak/sipsak.h:329: multiple definition of `rport'; auth.o:/tmp/B.41zalfw6/BUILD/sipsak/sipsak.h:329: first defined here
/usr/bin/ld: exit_code.o:/tmp/B.41zalfw6/BUILD/sipsak/sipsak.h:329: multiple definition of `lport'; auth.o:/tmp/B.41zalfw6/BUILD/sipsak/sipsak.h:329: first defined here
/usr/bin/ld: exit_code.o:/tmp/B.41zalfw6/BUILD/sipsak/sipsak.h:329: multiple definition of `maxforw'; auth.o:/tmp/B.41zalfw6/BUILD/sipsak/sipsak.h:329: first defined here
/usr/bin/ld: exit_code.o:/tmp/B.41zalfw6/BUILD/sipsak/sipsak.h:328: multiple definition of `message'; auth.o:/tmp/B.41zalfw6/BUILD/sipsak/sipsak.h:328: first defined here
/usr/bin/ld: exit_code.o:/tmp/B.41zalfw6/BUILD/sipsak/sipsak.h:328: multiple definition of `invite'; auth.o:/tmp/B.41zalfw6/BUILD/sipsak/sipsak.h:328: first defined here
/usr/bin/ld: exit_code.o:/tmp/B.41zalfw6/BUILD/sipsak/sipsak.h:328: multiple definition of `warning_ext'; auth.o:/tmp/B.41zalfw6/BUILD/sipsak/sipsak.h:328: first defined here
/usr/bin/ld: exit_code.o:/tmp/B.41zalfw6/BUILD/sipsak/sipsak.h:328: multiple definition of `flood'; auth.o:/tmp/B.41zalfw6/BUILD/sipsak/sipsak.h:328: first defined here
/usr/bin/ld: exit_code.o:/tmp/B.41zalfw6/BUILD/sipsak/sipsak.h:328: multiple definition of `expires_t'; auth.o:/tmp/B.41zalfw6/BUILD/sipsak/sipsak.h:328: first defined here
/usr/bin/ld: exit_code.o:/tmp/B.41zalfw6/BUILD/sipsak/sipsak.h:328: multiple definition of `namebeg'; auth.o:/tmp/B.41zalfw6/BUILD/sipsak/sipsak.h:328: first defined here
/usr/bin/ld: exit_code.o:/tmp/B.41zalfw6/BUILD/sipsak/sipsak.h:328: multiple definition of `nameend'; auth.o:/tmp/B.41zalfw6/BUILD/sipsak/sipsak.h:328: first defined here
/usr/bin/ld: exit_code.o:/tmp/B.41zalfw6/BUILD/sipsak/sipsak.h:328: multiple definition of `verbose'; auth.o:/tmp/B.41zalfw6/BUILD/sipsak/sipsak.h:328: first defined here
/usr/bin/ld: exit_code.o:/tmp/B.41zalfw6/BUILD/sipsak/sipsak.h:327: multiple definition of `cseq_counter'; auth.o:/tmp/B.41zalfw6/BUILD/sipsak/sipsak.h:327: first defined here
/usr/bin/ld: exit_code.o:/tmp/B.41zalfw6/BUILD/sipsak/sipsak.h:327: multiple definition of `processes'; auth.o:/tmp/B.41zalfw6/BUILD/sipsak/sipsak.h:327: first defined here
/usr/bin/ld: exit_code.o:/tmp/B.41zalfw6/BUILD/sipsak/sipsak.h:327: multiple definition of `sleep_ms'; auth.o:/tmp/B.41zalfw6/BUILD/sipsak/sipsak.h:327: first defined here
/usr/bin/ld: exit_code.o:/tmp/B.41zalfw6/BUILD/sipsak/sipsak.h:326: multiple definition of `transport'; auth.o:/tmp/B.41zalfw6/BUILD/sipsak/sipsak.h:326: first defined here
/usr/bin/ld: exit_code.o:/tmp/B.41zalfw6/BUILD/sipsak/sipsak.h:326: multiple definition of `nonce_count'; auth.o:/tmp/B.41zalfw6/BUILD/sipsak/sipsak.h:326: first defined here
/usr/bin/ld: exit_code.o:/tmp/B.41zalfw6/BUILD/sipsak/sipsak.h:325: multiple definition of `address'; auth.o:/tmp/B.41zalfw6/BUILD/sipsak/sipsak.h:325: first defined here
/usr/bin/ld: transport.o:/tmp/B.41zalfw6/BUILD/sipsak/sipsak.h:334: multiple definition of `local_ip'; auth.o:/tmp/B.41zalfw6/BUILD/sipsak/sipsak.h:334: first defined here
/usr/bin/ld: transport.o:/tmp/B.41zalfw6/BUILD/sipsak/sipsak.h:329: multiple definition of `lport'; auth.o:/tmp/B.41zalfw6/BUILD/sipsak/sipsak.h:329: first defined here
/usr/bin/ld: transport.o:/tmp/B.41zalfw6/BUILD/sipsak/sipsak.h:326: multiple definition of `transport'; auth.o:/tmp/B.41zalfw6/BUILD/sipsak/sipsak.h:326: first defined here
/usr/bin/ld: transport.o:/tmp/B.41zalfw6/BUILD/sipsak/sipsak.h:329: multiple definition of `symmetric'; auth.o:/tmp/B.41zalfw6/BUILD/sipsak/sipsak.h:329: first defined here
/usr/bin/ld: transport.o:/tmp/B.41zalfw6/BUILD/sipsak/sipsak.h:328: multiple definition of `verbose'; auth.o:/tmp/B.41zalfw6/BUILD/sipsak/sipsak.h:328: first defined here
/usr/bin/ld: transport.o:/tmp/B.41zalfw6/BUILD/sipsak/sipsak.h:329: multiple definition of `rport'; auth.o:/tmp/B.41zalfw6/BUILD/sipsak/sipsak.h:329: first defined here
/usr/bin/ld: transport.o:/tmp/B.41zalfw6/BUILD/sipsak/sipsak.h:336: multiple definition of `target_dot'; auth.o:/tmp/B.41zalfw6/BUILD/sipsak/sipsak.h:336: first defined here
/usr/bin/ld: transport.o:/tmp/B.41zalfw6/BUILD/sipsak/sipsak.h:337: multiple definition of `transport_str'; auth.o:/tmp/B.41zalfw6/BUILD/sipsak/sipsak.h:337: first defined here
/usr/bin/ld: transport.o:/tmp/B.41zalfw6/BUILD/sipsak/sipsak.h:329: multiple definition of `randtrash'; auth.o:/tmp/B.41zalfw6/BUILD/sipsak/sipsak.h:329: first defined here
/usr/bin/ld: transport.o:/tmp/B.41zalfw6/BUILD/sipsak/sipsak.h:337: multiple definition of `req'; auth.o:/tmp/B.41zalfw6/BUILD/sipsak/sipsak.h:337: first defined here
/usr/bin/ld: transport.o:/tmp/B.41zalfw6/BUILD/sipsak/sipsak.h:332: multiple definition of `timer_t1'; auth.o:/tmp/B.41zalfw6/BUILD/sipsak/sipsak.h:332: first defined here
/usr/bin/ld: transport.o:/tmp/B.41zalfw6/BUILD/sipsak/sipsak.h:330: multiple definition of `trace'; auth.o:/tmp/B.41zalfw6/BUILD/sipsak/sipsak.h:330: first defined here
/usr/bin/ld: transport.o:/tmp/B.41zalfw6/BUILD/sipsak/sipsak.h:330: multiple definition of `usrloc'; auth.o:/tmp/B.41zalfw6/BUILD/sipsak/sipsak.h:330: first defined here
/usr/bin/ld: transport.o:/tmp/B.41zalfw6/BUILD/sipsak/sipsak.h:328: multiple definition of `invite'; auth.o:/tmp/B.41zalfw6/BUILD/sipsak/sipsak.h:328: first defined here
/usr/bin/ld: transport.o:/tmp/B.41zalfw6/BUILD/sipsak/sipsak.h:328: multiple definition of `message'; auth.o:/tmp/B.41zalfw6/BUILD/sipsak/sipsak.h:328: first defined here
/usr/bin/ld: transport.o:/tmp/B.41zalfw6/BUILD/sipsak/sipsak.h:332: multiple definition of `timer_final'; auth.o:/tmp/B.41zalfw6/BUILD/sipsak/sipsak.h:332: first defined here
/usr/bin/ld: transport.o:/tmp/B.41zalfw6/BUILD/sipsak/sipsak.h:331: multiple definition of `timing'; auth.o:/tmp/B.41zalfw6/BUILD/sipsak/sipsak.h:331: first defined here
/usr/bin/ld: transport.o:/tmp/B.41zalfw6/BUILD/sipsak/shoot.h:47: multiple definition of `inv_trans'; header_f.o:/tmp/B.41zalfw6/BUILD/sipsak/shoot.h:47: first defined here
/usr/bin/ld: transport.o:/tmp/B.41zalfw6/BUILD/sipsak/sipsak.h:332: multiple definition of `timer_t2'; auth.o:/tmp/B.41zalfw6/BUILD/sipsak/sipsak.h:332: first defined here
/usr/bin/ld: transport.o:/tmp/B.41zalfw6/BUILD/sipsak/sipsak.h:328: multiple definition of `namebeg'; auth.o:/tmp/B.41zalfw6/BUILD/sipsak/sipsak.h:328: first defined here
/usr/bin/ld: transport.o:/tmp/B.41zalfw6/BUILD/sipsak/sipsak.h:337: multiple definition of `rep'; auth.o:/tmp/B.41zalfw6/BUILD/sipsak/sipsak.h:337: first defined here
/usr/bin/ld: transport.o:/tmp/B.41zalfw6/BUILD/sipsak/sipsak.h:328: multiple definition of `nameend'; auth.o:/tmp/B.41zalfw6/BUILD/sipsak/sipsak.h:328: first defined here
/usr/bin/ld: transport.o:/tmp/B.41zalfw6/BUILD/sipsak/sipsak.h:327: multiple definition of `cseq_counter'; auth.o:/tmp/B.41zalfw6/BUILD/sipsak/sipsak.h:327: first defined here
/usr/bin/ld: transport.o:/tmp/B.41zalfw6/BUILD/sipsak/sipsak.h:336: multiple definition of `source_dot'; auth.o:/tmp/B.41zalfw6/BUILD/sipsak/sipsak.h:336: first defined here
/usr/bin/ld: transport.o:/tmp/B.41zalfw6/BUILD/sipsak/sipsak.h:338: multiple definition of `re'; auth.o:/tmp/B.41zalfw6/BUILD/sipsak/sipsak.h:338: first defined here
/usr/bin/ld: transport.o:/tmp/B.41zalfw6/BUILD/sipsak/sipsak.h:337: multiple definition of `rec'; auth.o:/tmp/B.41zalfw6/BUILD/sipsak/sipsak.h:337: first defined here
/usr/bin/ld: transport.o:/tmp/B.41zalfw6/BUILD/sipsak/sipsak.h:335: multiple definition of `fqdn'; auth.o:/tmp/B.41zalfw6/BUILD/sipsak/sipsak.h:335: first defined here
/usr/bin/ld: transport.o:/tmp/B.41zalfw6/BUILD/sipsak/sipsak.h:334: multiple definition of `authhash'; auth.o:/tmp/B.41zalfw6/BUILD/sipsak/sipsak.h:334: first defined here
/usr/bin/ld: transport.o:/tmp/B.41zalfw6/BUILD/sipsak/sipsak.h:334: multiple definition of `headers'; auth.o:/tmp/B.41zalfw6/BUILD/sipsak/sipsak.h:334: first defined here
/usr/bin/ld: transport.o:/tmp/B.41zalfw6/BUILD/sipsak/sipsak.h:334: multiple definition of `from_uri'; auth.o:/tmp/B.41zalfw6/BUILD/sipsak/sipsak.h:334: first defined here
/usr/bin/ld: transport.o:/tmp/B.41zalfw6/BUILD/sipsak/sipsak.h:334: multiple definition of `auth_username'; auth.o:/tmp/B.41zalfw6/BUILD/sipsak/sipsak.h:334: first defined here
/usr/bin/ld: transport.o:/tmp/B.41zalfw6/BUILD/sipsak/sipsak.h:334: multiple definition of `con_dis'; auth.o:/tmp/B.41zalfw6/BUILD/sipsak/sipsak.h:334: first defined here
/usr/bin/ld: transport.o:/tmp/B.41zalfw6/BUILD/sipsak/sipsak.h:334: multiple definition of `mes_body'; auth.o:/tmp/B.41zalfw6/BUILD/sipsak/sipsak.h:334: first defined here
/usr/bin/ld: transport.o:/tmp/B.41zalfw6/BUILD/sipsak/sipsak.h:333: multiple definition of `contact_uri'; auth.o:/tmp/B.41zalfw6/BUILD/sipsak/sipsak.h:333: first defined here
/usr/bin/ld: transport.o:/tmp/B.41zalfw6/BUILD/sipsak/sipsak.h:333: multiple definition of `hostname'; auth.o:/tmp/B.41zalfw6/BUILD/sipsak/sipsak.h:333: first defined here
/usr/bin/ld: transport.o:/tmp/B.41zalfw6/BUILD/sipsak/sipsak.h:333: multiple definition of `replace_str'; auth.o:/tmp/B.41zalfw6/BUILD/sipsak/sipsak.h:333: first defined here
/usr/bin/ld: transport.o:/tmp/B.41zalfw6/BUILD/sipsak/sipsak.h:333: multiple definition of `password'; auth.o:/tmp/B.41zalfw6/BUILD/sipsak/sipsak.h:333: first defined here
/usr/bin/ld: transport.o:/tmp/B.41zalfw6/BUILD/sipsak/sipsak.h:333: multiple definition of `domainname'; auth.o:/tmp/B.41zalfw6/BUILD/sipsak/sipsak.h:333: first defined here
/usr/bin/ld: transport.o:/tmp/B.41zalfw6/BUILD/sipsak/sipsak.h:333: multiple definition of `username'; auth.o:/tmp/B.41zalfw6/BUILD/sipsak/sipsak.h:333: first defined here
/usr/bin/ld: transport.o:/tmp/B.41zalfw6/BUILD/sipsak/sipsak.h:332: multiple definition of `sysl'; auth.o:/tmp/B.41zalfw6/BUILD/sipsak/sipsak.h:332: first defined here
/usr/bin/ld: transport.o:/tmp/B.41zalfw6/BUILD/sipsak/sipsak.h:331: multiple definition of `outbound_proxy'; auth.o:/tmp/B.41zalfw6/BUILD/sipsak/sipsak.h:331: first defined here
/usr/bin/ld: transport.o:/tmp/B.41zalfw6/BUILD/sipsak/sipsak.h:331: multiple definition of `fix_crlf'; auth.o:/tmp/B.41zalfw6/BUILD/sipsak/sipsak.h:331: first defined here
/usr/bin/ld: transport.o:/tmp/B.41zalfw6/BUILD/sipsak/sipsak.h:331: multiple definition of `nagios_warn'; auth.o:/tmp/B.41zalfw6/BUILD/sipsak/sipsak.h:331: first defined here
/usr/bin/ld: transport.o:/tmp/B.41zalfw6/BUILD/sipsak/sipsak.h:331: multiple definition of `empty_contact'; auth.o:/tmp/B.41zalfw6/BUILD/sipsak/sipsak.h:331: first defined here
/usr/bin/ld: transport.o:/tmp/B.41zalfw6/BUILD/sipsak/sipsak.h:330: multiple definition of `replace_b'; auth.o:/tmp/B.41zalfw6/BUILD/sipsak/sipsak.h:330: first defined here
/usr/bin/ld: transport.o:/tmp/B.41zalfw6/BUILD/sipsak/sipsak.h:330: multiple definition of `rand_rem'; auth.o:/tmp/B.41zalfw6/BUILD/sipsak/sipsak.h:330: first defined here
/usr/bin/ld: transport.o:/tmp/B.41zalfw6/BUILD/sipsak/sipsak.h:330: multiple definition of `redirects'; auth.o:/tmp/B.41zalfw6/BUILD/sipsak/sipsak.h:330: first defined here
/usr/bin/ld: transport.o:/tmp/B.41zalfw6/BUILD/sipsak/sipsak.h:330: multiple definition of `via_ins'; auth.o:/tmp/B.41zalfw6/BUILD/sipsak/sipsak.h:330: first defined here
/usr/bin/ld: transport.o:/tmp/B.41zalfw6/BUILD/sipsak/sipsak.h:330: multiple definition of `uri_b'; auth.o:/tmp/B.41zalfw6/BUILD/sipsak/sipsak.h:330: first defined here
/usr/bin/ld: transport.o:/tmp/B.41zalfw6/BUILD/sipsak/sipsak.h:330: multiple definition of `file_b'; auth.o:/tmp/B.41zalfw6/BUILD/sipsak/sipsak.h:330: first defined here
/usr/bin/ld: transport.o:/tmp/B.41zalfw6/BUILD/sipsak/sipsak.h:329: multiple definition of `numeric'; auth.o:/tmp/B.41zalfw6/BUILD/sipsak/sipsak.h:329: first defined here
/usr/bin/ld: transport.o:/tmp/B.41zalfw6/BUILD/sipsak/sipsak.h:329: multiple definition of `trashchar'; auth.o:/tmp/B.41zalfw6/BUILD/sipsak/sipsak.h:329: first defined here
/usr/bin/ld: transport.o:/tmp/B.41zalfw6/BUILD/sipsak/sipsak.h:329: multiple definition of `maxforw'; auth.o:/tmp/B.41zalfw6/BUILD/sipsak/sipsak.h:329: first defined here
/usr/bin/ld: transport.o:/tmp/B.41zalfw6/BUILD/sipsak/sipsak.h:328: multiple definition of `warning_ext'; auth.o:/tmp/B.41zalfw6/BUILD/sipsak/sipsak.h:328: first defined here
/usr/bin/ld: transport.o:/tmp/B.41zalfw6/BUILD/sipsak/sipsak.h:328: multiple definition of `flood'; auth.o:/tmp/B.41zalfw6/BUILD/sipsak/sipsak.h:328: first defined here
/usr/bin/ld: transport.o:/tmp/B.41zalfw6/BUILD/sipsak/sipsak.h:328: multiple definition of `expires_t'; auth.o:/tmp/B.41zalfw6/BUILD/sipsak/sipsak.h:328: first defined here
/usr/bin/ld: transport.o:/tmp/B.41zalfw6/BUILD/sipsak/sipsak.h:327: multiple definition of `processes'; auth.o:/tmp/B.41zalfw6/BUILD/sipsak/sipsak.h:327: first defined here
/usr/bin/ld: transport.o:/tmp/B.41zalfw6/BUILD/sipsak/sipsak.h:327: multiple definition of `sleep_ms'; auth.o:/tmp/B.41zalfw6/BUILD/sipsak/sipsak.h:327: first defined here
/usr/bin/ld: transport.o:/tmp/B.41zalfw6/BUILD/sipsak/sipsak.h:326: multiple definition of `nonce_count'; auth.o:/tmp/B.41zalfw6/BUILD/sipsak/sipsak.h:326: first defined here
/usr/bin/ld: transport.o:/tmp/B.41zalfw6/BUILD/sipsak/sipsak.h:325: multiple definition of `address'; auth.o:/tmp/B.41zalfw6/BUILD/sipsak/sipsak.h:325: first defined here
collect2: error: ld returned 1 exit status
make[2]: *** [Makefile:478: sipsak] Error 1
make[2]: Leaving directory '/tmp/B.41zalfw6/BUILD/sipsak'
make[1]: *** [Makefile:566: all-recursive] Error 1
make: *** [Makefile:381: all] Error 2
error: Bad exit status from /tmp/B.41zalfw6/BUILD/tmp/rpm-tmp.FLvVlt (%build)


RPM build errors:
    Could not canonicalize hostname: nereid
    Bad exit status from /tmp/B.41zalfw6/BUILD/tmp/rpm-tmp.FLvVlt (%build)
ended at: Sat Sep 25 23:14:16 2021, done in 0:00:08.126932
error: No files produced.
+ chmod -R u+rwX /tmp/B.41zalfw6/BUILD
+ rm -rf /tmp/B.41zalfw6/tmp /tmp/B.41zalfw6/BUILD
+ rm -rf /tmp/B.41zalfw6
Begin-PLD-Builder-Info
Build-Time: user:9.98s sys:2.67s real:9.86s (faults io:4 non-io:673921)

End-PLD-Builder-Info
[Back to list of logs] [View rpm -qa of builder]