FailedOk

th/SRPMS[OK]
th/x32[OK]
th/i686[OK]
th/x86_64[OK]

ac/SRPMS[OK]
ac/i386[OK]
ac/i586[OK]
ac/i686[OK]
ac/alpha[OK]
ac/amd64[OK]
ac/athlon[OK]
ac/ppc[OK]
ac/sparc[OK]
ac/sparc64[OK]

Advanced Search
main()
Powered by PLD Linux
(c) 2002-2019 PLD Team
$Revision: 1.37 $
Powered by Multics.
Your IP: 18.207.132.114

sleuthkit 217444f9-ea34-454e-89ce-f442a898f24b

Status:Failed
Source URL:ftp://buildlogs.pld-linux.org/th/i686/FAIL/sleuthkit,217444f9-ea34-454e-89ce-f442a898f24b.bz2
text/plain URL:View!
full text:View!
rpm -qa of builder:View!
Date:2019/08/06 10:02:11
Runtime:0:00:11.784819

Toc:

  • error 1
  • rpm: error: Failed build dependencies:
  • error 2
  • error: ftp://ftp1.pld-linux.org/dists/th/test/i686/RPMS/packages.ndir.gz: broken file
  • error 3
  • error: ftp://ftp1.pld-linux.org/dists/th/test/i686/RPMS/packages.ndir.gz: broken file
  • error 4
  • poldek: error: ftp://ftp1.pld-linux.org/dists/th/test/i686/RPMS/packages.ndir.gz: broken file
  • error 5
  • poldek: error: ftp://ftp1.pld-linux.org/dists/th/test/i686/RPMS/packages.ndir.gz: broken file
  • error 6
  • rpm: error: Failed build dependencies:
  • error 7
  • error: ftp://ftp1.pld-linux.org/dists/th/test/i686/RPMS/packages.ndir.gz: broken file
  • error 8
  • error: ftp://ftp1.pld-linux.org/dists/th/test/i686/RPMS/packages.ndir.gz: broken file
  • prep
  • Executing(%prep): /bin/sh -e /tmp/B.Bfe1ra/BUILD/tmp/rpm-tmp.83437
  • build
  • Executing(%build): /bin/sh -e /tmp/B.Bfe1ra/BUILD/tmp/rpm-tmp.83437
  • error 9
  • ewf.cpp:70:11: error: 'libewf_handle_read_random' was not declared in this scope
  • error 10
  • make[3]: *** [Makefile:444: ewf.lo] Error 1
  • error 11
  • make[2]: *** [Makefile:510: all-recursive] Error 1
  • error 12
  • make[1]: *** [Makefile:405: all] Error 2
  • error 13
  • error: Bad exit status from /tmp/B.Bfe1ra/BUILD/tmp/rpm-tmp.83437 (%build)
  • error 14
  • RPM build errors:
  • error 15
  • error: No files produced.

Content:

checking if we should skip the build
started at: Tue Aug  6 10:01:39 2019
killing old processes on a builder
sending signal 9 to pid -1
Killed
cleaning up /tmp
fetching https://srcbuilder.pld-linux.org/th//srpms/217444f9-ea34-454e-89ce-f442a898f24b/sleuthkit-4.6.7-1.src.rpm
fetched 8683547 bytes, 4582.5 K/s
installing srpm: sleuthkit-4.6.7-1.src.rpm
+ install -d /tmp/B.Bfe1ra/BUILD /tmp/B.Bfe1ra/RPMS
+ LC_ALL=en_US.UTF-8
+ rpm -qp --changelog sleuthkit-4.6.7-1.src.rpm
* Tue Aug 06 2019 PLD Linux Team <feedback@pld-linux.org>
- For complete changelog see: http://git.pld-linux.org/?p=packages/sleuthkit.git;a=log;h=master
* Tue Aug 06 2019 Adam Gołębiowski <adamg@pld-linux.org> e699c2a
- updated to 4.6.7 * Wed Nov 14 2018 Adam Gołębiowski <adamg@pld-linux.org> 9f2cba3
- devel, libs, static subpackages * Wed Nov 14 2018 Adam Gołębiowski <adamg@pld-linux.org> afd8a78
- aff bcond * Wed Nov 14 2018 Adam Gołębiowski <adamg@pld-linux.org> 84d5f8a
- java subpackage * Sun Nov 11 2018 Adam Gołębiowski <adamg@pld-linux.org> 5ffcae2
- java todo * Sun Nov 11 2018 Adam Gołębiowski <adamg@pld-linux.org> 00ea86f
- updated to 4.6.4 + rpm -Uhv --nodeps --define '_topdir /tmp/B.Bfe1ra' --define '_specdir %{_topdir}' --define '_sourcedir %{_specdir}' --define '_rpmdir %{_topdir}/RPMS' --define '_builddir %{_topdir}/BUILD' sleuthkit-4.6.7-1.src.rpm Preparing... ################################################## sleuthkit ################################################## + rm -f sleuthkit-4.6.7-1.src.rpm + install -m 700 -d /tmp/B.Bfe1ra/BUILD/tmp + TMPDIR=/tmp/B.Bfe1ra/BUILD/tmp + exec nice -n 0 rpmbuild -bp --short-circuit --nodeps --define '_topdir /tmp/B.Bfe1ra' --define '_specdir %{_topdir}' --define '_sourcedir %{_specdir}' --define '_rpmdir %{_topdir}/RPMS' --define '_builddir %{_topdir}/BUILD' --target i686-pld-linux --define 'prep exit 0' /tmp/B.Bfe1ra/sleuthkit.spec Building target platforms: i686-pld-linux checking BuildConflict-ing packages no BuildConflicts found checking BR rpm: error: Failed build dependencies: rpm: afflib-devel is needed by sleuthkit-4.6.7-1.src rpm: Building target platforms: i686-pld-linux updating poldek cache... ready is up to date Retrieving th::packages.ndir.md... th is up to date Retrieving th::packages.ndir.md... th is up to date Retrieving th-ready::packages.ndir.md... th-ready is up to date Retrieving th-ready::packages.ndir.md... th-ready is up to date error: ftp://ftp1.pld-linux.org/dists/th/test/i686/RPMS/packages.ndir.gz: broken file Retrieving th-test::packages.ndir.md... Retrieving th-test::packages.ndir.gz... ..............................done error: ftp://ftp1.pld-linux.org/dists/th/test/i686/RPMS/packages.ndir.gz: broken file Retrieving th-test::packages.ndir.md... th-test is up to date checking conflicting packages in BRed packages poldek: error: ftp://ftp1.pld-linux.org/dists/th/test/i686/RPMS/packages.ndir.gz: broken file poldek: Retrieving th-test::packages.ndir.md... poldek: Retrieving th-test::packages.ndir.gz... poldek: ..............................done poldek: error: ftp://ftp1.pld-linux.org/dists/th/test/i686/RPMS/packages.ndir.gz: broken file poldek: warn: ftp://ftp1.pld-linux.org/dists/th/test/i686/RPMS/: load failed, skipped poldek: Loading [pndir]ready... poldek: Loading [pndir]th-test... poldek: Loading [pndir]th-ready... poldek: Loading [pndir]th-ready... poldek: Loading [pndir]th... poldek: Loading [pndir]th... poldek: 28717 packages read poldek: Removed 998 duplicate packages from available set poldek: Processing dependencies... poldek: afflib-devel-3.7.17-2.i686 marks afflib-3.7.17-2.i686 (cap afflib = 3.7.17-2) poldek: There are 2 packages to install (1 marked by dependencies): poldek: I afflib-devel-3.7.17-2.i686 poldek: D afflib-3.7.17-2.i686 poldek: This operation will use 503.9KB of disk space. poldek: Need to get 222.4KB of archives (222.4KB to download). poldek: poldek: Retrieving [1/2] th::afflib-3.7.17-2.i686.rpm... poldek: ..............................done poldek: Retrieving [2/2] th::afflib-devel-3.7.17-2.i686.rpm... poldek: ..............................done poldek: Executing pm-command.sh --upgrade -vh --test --root / --define _check_dirname_deps 1... poldek: Preparing... ################################################## no conflicts found checking BR rpm: error: Failed build dependencies: rpm: afflib-devel is needed by sleuthkit-4.6.7-1.src rpm: Building target platforms: i686-pld-linux installing BR: afflib\-devel + poldek --noask --caplookup -Q -v '--ignore=hhvm-*' '--ignore=php4-*' '--ignore=php52-*' '--ignore=php54-*' '--ignore=php55-*' '--ignore=php56-*' '--ignore=php70-*' '--ignore=php71-*' '--ignore=php72-*' '--ignore=php73-*' '--ignore=php74-*' --upgrade afflib-devel error: ftp://ftp1.pld-linux.org/dists/th/test/i686/RPMS/packages.ndir.gz: broken file Retrieving th-test::packages.ndir.md... Retrieving th-test::packages.ndir.gz... ..............................done error: ftp://ftp1.pld-linux.org/dists/th/test/i686/RPMS/packages.ndir.gz: broken file warn: ftp://ftp1.pld-linux.org/dists/th/test/i686/RPMS/: load failed, skipped Loading [pndir]ready... Loading [pndir]th-test... Loading [pndir]th-ready... Loading [pndir]th-ready... Loading [pndir]th... Loading [pndir]th... 28717 packages read Removed 998 duplicate packages from available set Processing dependencies... afflib-devel-3.7.17-2.i686 marks afflib-3.7.17-2.i686 (cap afflib = 3.7.17-2) There are 2 packages to install (1 marked by dependencies): I afflib-devel-3.7.17-2.i686 D afflib-3.7.17-2.i686 This operation will use 503.9KB of disk space. Need to get 222.4KB of archives. Executing pm-command.sh --upgrade -vh --root / --define _check_dirname_deps 1... Preparing... ################################################## afflib ################################################## afflib-devel ################################################## building RPM using: set -ex; : build-id: 217444f9-ea34-454e-89ce-f442a898f24b; TMPDIR=/tmp/B.Bfe1ra/BUILD/tmp exec nice -n 0 rpmbuild -bb --define '_smp_mflags -j9' --define '_make_opts -Otarget' --define '_pld_builder 1' --define '_topdir /tmp/B.Bfe1ra' --define '_specdir %{_topdir}' --define '_sourcedir %{_specdir}' --define '_rpmdir %{_topdir}/RPMS' --define '_builddir %{_topdir}/BUILD' --target i686-pld-linux /tmp/B.Bfe1ra/sleuthkit.spec + : build-id: 217444f9-ea34-454e-89ce-f442a898f24b + TMPDIR=/tmp/B.Bfe1ra/BUILD/tmp + exec nice -n 0 rpmbuild -bb --define '_smp_mflags -j9' --define '_make_opts -Otarget' --define '_pld_builder 1' --define '_topdir /tmp/B.Bfe1ra' --define '_specdir %{_topdir}' --define '_sourcedir %{_specdir}' --define '_rpmdir %{_topdir}/RPMS' --define '_builddir %{_topdir}/BUILD' --target i686-pld-linux /tmp/B.Bfe1ra/sleuthkit.spec Building target platforms: i686-pld-linux Executing(%prep): /bin/sh -e /tmp/B.Bfe1ra/BUILD/tmp/rpm-tmp.83437 + umask 022 + cd /tmp/B.Bfe1ra/BUILD + cd /tmp/B.Bfe1ra/BUILD + rm -rf sleuthkit-4.6.7 + /usr/bin/gzip -dc /tmp/B.Bfe1ra/sleuthkit-4.6.7.tar.gz + /bin/tar -xf - + STATUS=0 + '[' 0 -ne 0 ']' + cd sleuthkit-4.6.7 + /bin/id -u + '[' 1001 '=' 0 ']' + /bin/id -u + '[' 1001 '=' 0 ']' + /bin/chmod -Rf a+rX,u+w,g-w,o-w . + sed -i -e s/-static// samples/Makefile.in tests/Makefile.in tools/autotools/Makefile.in tools/fstools/Makefile.in tools/hashtools/Makefile.in tools/imgtools/Makefile.in tools/srchtools/Makefile.in tools/vstools/Makefile.in + exit 0 Executing(%build): /bin/sh -e /tmp/B.Bfe1ra/BUILD/tmp/rpm-tmp.83437 TMP=/home/users/builder/tmp HOME=/home/users/builder PATH=/home/users/builder/GNUstep/Tools:/usr/local/bin:/usr/bin:/bin:/home/users/builder/bin TMPDIR=/tmp/B.Bfe1ra/BUILD/tmp + umask 022 + cd /tmp/B.Bfe1ra/BUILD + cd sleuthkit-4.6.7 + ./configure 'LDFLAGS=-Wl,--as-needed -Wl,--no-copy-dt-needed-entries -Wl,-z,relro -Wl,-z,combreloc ' 'CFLAGS=-O2 -fwrapv -pipe -Wformat -Werror=format-security -gdwarf-4 -fno-debug-types-section -fvar-tracking-assignments -g2 -Wp,-D_FORTIFY_SOURCE=2 -fstack-protector-strong --param=ssp-buffer-size=4 -Werror=trampolines -fomit-frame-pointer -march=i686 -fasynchronous-unwind-tables -mtune=pentium4 -gdwarf-4 -fno-debug-types-section -fvar-tracking-assignments -g2 ' 'CXXFLAGS=-O2 -fwrapv -pipe -Wformat -Werror=format-security -gdwarf-4 -fno-debug-types-section -fvar-tracking-assignments -g2 -Wp,-D_FORTIFY_SOURCE=2 -fstack-protector-strong --param=ssp-buffer-size=4 -Werror=trampolines -fomit-frame-pointer -march=i686 -fasynchronous-unwind-tables -mtune=pentium4 -gdwarf-4 -fno-debug-types-section -fvar-tracking-assignments -g2 ' 'FFLAGS=-O2 -fwrapv -pipe -Wformat -Werror=format-security -gdwarf-4 -fno-debug-types-section -fvar-tracking-assignments -g2 -Wp,-D_FORTIFY_SOURCE=2 -fstack-protector-strong --param=ssp-buffer-size=4 -Werror=trampolines -fomit-frame-pointer -march=i686 -fasynchronous-unwind-tables -mtune=pentium4 -gdwarf-4 -fno-debug-types-section -fvar-tracking-assignments -g2 ' 'FCFLAGS=-O2 -fwrapv -pipe -Wformat -Werror=format-security -gdwarf-4 -fno-debug-types-section -fvar-tracking-assignments -g2 -Wp,-D_FORTIFY_SOURCE=2 -fstack-protector-strong --param=ssp-buffer-size=4 -Werror=trampolines -fomit-frame-pointer -march=i686 -fasynchronous-unwind-tables -mtune=pentium4 -gdwarf-4 -fno-debug-types-section -fvar-tracking-assignments -g2 ' 'CPPFLAGS=' 'CC=i686-pld-linux-gcc' 'CXX=i686-pld-linux-g++' '--host=i686-pld-linux' '--build=i686-pld-linux' '--prefix=/usr' '--exec-prefix=/usr' '--bindir=/usr/bin' '--sbindir=/usr/sbin' '--sysconfdir=/etc' '--datadir=/usr/share' '--includedir=/usr/include' '--libdir=/usr/lib' '--libexecdir=/usr/libexec' '--localstatedir=/var' '--sharedstatedir=/var/lib' '--mandir=/usr/share/man' '--infodir=/usr/share/info' '--x-libraries=/usr/lib' checking for a BSD-compatible install... /usr/bin/install -c checking whether build environment is sane... yes checking for a thread-safe mkdir -p... /bin/mkdir -p checking for gawk... gawk checking whether make sets $(MAKE)... yes checking whether make supports nested variables... yes checking for cppunit-config... no checking for Cppunit - version >= 1.12.1... no checking build system type... i686-pld-linux-gnu checking host system type... i686-pld-linux-gnu checking how to print strings... print -r checking for style of include used by make... GNU checking for i686-pld-linux-gcc... i686-pld-linux-gcc checking whether the C compiler works... yes checking for C compiler default output file name... a.out checking for suffix of executables... checking whether we are cross compiling... no checking for suffix of object files... o checking whether we are using the GNU C compiler... yes checking whether i686-pld-linux-gcc accepts -g... yes checking for i686-pld-linux-gcc option to accept ISO C89... none needed checking whether i686-pld-linux-gcc understands -c and -o together... yes checking dependency style of i686-pld-linux-gcc... gcc3 checking for a sed that does not truncate output... /bin/sed checking for grep that handles long lines and -e... /bin/grep checking for egrep... /bin/grep -E checking for fgrep... /bin/grep -F checking for ld used by i686-pld-linux-gcc... /usr/bin/ld checking if the linker (/usr/bin/ld) is GNU ld... yes checking for BSD- or MS-compatible name lister (nm)... /usr/bin/nm -B checking the name lister (/usr/bin/nm -B) interface... BSD nm checking whether ln -s works... yes checking the maximum length of command line arguments... 1572864 checking how to convert i686-pld-linux-gnu file names to i686-pld-linux-gnu format... func_convert_file_noop checking how to convert i686-pld-linux-gnu file names to toolchain format... func_convert_file_noop checking for /usr/bin/ld option to reload object files... -r checking for i686-pld-linux-objdump... no checking for objdump... objdump checking how to recognize dependent libraries... pass_all checking for i686-pld-linux-dlltool... no checking for dlltool... no checking how to associate runtime and link libraries... print -r -- checking for i686-pld-linux-ar... no checking for ar... ar checking for archiver @FILE support... @ checking for i686-pld-linux-strip... no checking for strip... strip checking for i686-pld-linux-ranlib... no checking for ranlib... ranlib checking command to parse /usr/bin/nm -B output from i686-pld-linux-gcc object... ok checking for sysroot... no checking for a working dd... /bin/dd checking how to truncate binary pipes... /bin/dd bs=4096 count=1 checking for i686-pld-linux-mt... no checking for mt... no checking if : is a manifest tool... no checking how to run the C preprocessor... i686-pld-linux-gcc -E checking for ANSI C header files... yes checking for sys/types.h... yes checking for sys/stat.h... yes checking for stdlib.h... yes checking for string.h... yes checking for memory.h... yes checking for strings.h... yes checking for inttypes.h... yes checking for stdint.h... yes checking for unistd.h... yes checking for dlfcn.h... yes checking for objdir... .libs checking if i686-pld-linux-gcc supports -fno-rtti -fno-exceptions... no checking for i686-pld-linux-gcc option to produce PIC... -fPIC -DPIC checking if i686-pld-linux-gcc PIC flag -fPIC -DPIC works... yes checking if i686-pld-linux-gcc static flag -static works... yes checking if i686-pld-linux-gcc supports -c -o file.o... yes checking if i686-pld-linux-gcc supports -c -o file.o... (cached) yes checking whether the i686-pld-linux-gcc linker (/usr/bin/ld) supports shared libraries... yes checking whether -lc should be explicitly linked in... no checking dynamic linker characteristics... GNU/Linux ld.so checking how to hardcode library paths into programs... immediate checking whether stripping libraries is possible... yes checking if libtool supports shared libraries... yes checking whether to build shared libraries... yes checking whether to build static libraries... yes checking whether to enable maintainer-specific portions of Makefiles... no checking whether we are using the GNU C++ compiler... yes checking whether i686-pld-linux-g++ accepts -g... yes checking dependency style of i686-pld-linux-g++... gcc3 checking how to run the C++ preprocessor... i686-pld-linux-g++ -E checking for ld used by i686-pld-linux-g++... /usr/bin/ld checking if the linker (/usr/bin/ld) is GNU ld... yes checking whether the i686-pld-linux-g++ linker (/usr/bin/ld) supports shared libraries... yes checking for i686-pld-linux-g++ option to produce PIC... -fPIC -DPIC checking if i686-pld-linux-g++ PIC flag -fPIC -DPIC works... yes checking if i686-pld-linux-g++ static flag -static works... yes checking if i686-pld-linux-g++ supports -c -o file.o... yes checking if i686-pld-linux-g++ supports -c -o file.o... (cached) yes checking whether the i686-pld-linux-g++ linker (/usr/bin/ld) supports shared libraries... yes checking dynamic linker characteristics... (cached) GNU/Linux ld.so checking how to hardcode library paths into programs... immediate checking for i686-pld-linux-gcc... (cached) i686-pld-linux-gcc checking whether we are using the GNU C compiler... (cached) yes checking whether i686-pld-linux-gcc accepts -g... (cached) yes checking for i686-pld-linux-gcc option to accept ISO C89... (cached) none needed checking whether i686-pld-linux-gcc understands -c and -o together... (cached) yes checking dependency style of i686-pld-linux-gcc... (cached) gcc3 checking how to run the C preprocessor... i686-pld-linux-gcc -E checking whether ln -s works... yes checking whether make sets $(MAKE)... (cached) yes checking for perl... /usr/bin/perl checking for ANSI C header files... (cached) yes checking err.h usability... yes checking err.h presence... yes checking for err.h... yes checking for inttypes.h... (cached) yes checking for unistd.h... (cached) yes checking for stdint.h... (cached) yes checking sys/param.h usability... yes checking sys/param.h presence... yes checking for sys/param.h... yes checking sys/resource.h usability... yes checking sys/resource.h presence... yes checking for sys/resource.h... yes checking for stdbool.h that conforms to C99... yes checking for _Bool... yes checking for an ANSI C-conforming const... yes checking for uid_t in sys/types.h... yes checking for mode_t... yes checking for off_t... yes checking for size_t... yes checking for special C compiler options needed for large files... no checking for _FILE_OFFSET_BITS value needed for large files... 64 checking for working alloca.h... yes checking for alloca... yes checking for error_at_line... yes checking for _LARGEFILE_SOURCE value needed for large files... no checking whether i686-pld-linux-gcc needs -traditional... no checking whether lstat correctly handles trailing slash... yes checking whether lstat accepts an empty string... no checking whether lstat correctly handles trailing slash... (cached) yes checking sys/select.h usability... yes checking sys/select.h presence... yes checking for sys/select.h... yes checking sys/socket.h usability... yes checking sys/socket.h presence... yes checking for sys/socket.h... yes checking types of arguments for select... int,fd_set *,struct timeval * checking for utime.h... yes checking whether utime accepts a null argument... yes checking for vprintf... yes checking for _doprnt... no checking for ishexnumber... no checking for err... yes checking for errx... yes checking for warn... yes checking for warnx... yes checking for vasprintf... yes checking for getrusage... yes checking for strlcpy... no checking for strlcat... no checking for the pthreads library -lpthreads... no checking whether pthreads work without any flags... no checking whether pthreads work with -Kthread... no checking whether pthreads work with -kthread... no checking for the pthreads library -llthread... no checking whether pthreads work with -pthread... yes checking for joinable pthread attribute... PTHREAD_CREATE_JOINABLE checking if more special flags are required for pthreads... no checking for main in -lstdc++... yes checking for list... no checking for map... no checking for queue... no checking for set... no checking for stack... no checking for streambuf... no checking for string... no checking for vector... no checking sqlite3.h usability... yes checking sqlite3.h presence... yes checking for sqlite3.h... yes checking for dlopen in -ldl... yes checking for sqlite3_open in -lsqlite3... yes checking which sqlite3 to use... system checking postgresql/libpq-fe.h usability... no checking postgresql/libpq-fe.h presence... no checking for postgresql/libpq-fe.h... no checking libpq-fe.h usability... yes checking libpq-fe.h presence... yes checking for libpq-fe.h... yes checking for PQlibVersion in -lpq... yes checking afflib/afflib.h usability... yes checking afflib/afflib.h presence... yes checking for afflib/afflib.h... yes checking for af_open in -lafflib... yes configure: checking for zlib checking zlib.h usability... yes checking zlib.h presence... yes checking for zlib.h... yes checking for inflate in -lz... yes checking for dlopen in -ldl... (cached) yes checking libewf.h usability... yes checking libewf.h presence... yes checking for libewf.h... yes checking for libewf_get_version in -lewf... yes checking libvhdi.h usability... no checking libvhdi.h presence... no checking for libvhdi.h... no checking libvmdk.h usability... no checking libvmdk.h presence... no checking for libvmdk.h... no checking for gcj... no checking for guavac... no checking for jikes... no checking for javac... javac checking if javac works... yes checking for /usr/lib/jvm/java/include/jni.h... yes checking for kaffe... no checking for java... java checking for uudecode... yes checking if uudecode can decode base 64 file... yes checking if java works... configure: WARNING: The Java VM java failed (see config.log, check the CLASSPATH?) checking for ant... /usr/bin/ant checking if libtool needs -no-undefined flag to build shared libraries... no checking for getline... yes checking for library containing regexec... none required checking that generated files are newer than configure... done configure: creating ./config.status config.status: creating Makefile config.status: creating tsk/Makefile config.status: creating tsk/base/Makefile config.status: creating tsk/img/Makefile config.status: creating tsk/vs/Makefile config.status: creating tsk/fs/Makefile config.status: creating tsk/hashdb/Makefile config.status: creating tsk/auto/Makefile config.status: creating tools/Makefile config.status: creating tools/imgtools/Makefile config.status: creating tools/vstools/Makefile config.status: creating tools/fstools/Makefile config.status: creating tools/hashtools/Makefile config.status: creating tools/srchtools/Makefile config.status: creating tools/autotools/Makefile config.status: creating tools/sorter/Makefile config.status: creating tools/timeline/Makefile config.status: creating tools/fiwalk/Makefile config.status: creating tools/fiwalk/src/Makefile config.status: creating tools/fiwalk/plugins/Makefile config.status: creating tests/Makefile config.status: creating samples/Makefile config.status: creating man/Makefile config.status: creating bindings/java/Makefile config.status: creating bindings/java/jni/Makefile config.status: creating unit_tests/Makefile config.status: creating unit_tests/base/Makefile config.status: creating tsk/tsk_config.h config.status: executing depfiles commands config.status: executing libtool commands config.status: executing tsk/tsk_incs.h commands configure: Building: afflib support: yes libewf support: yes zlib support: yes libvhdi support: no libvmdk support: no postgresql support: yes Features: Java/JNI support: yes Multithreading: yes + sed -i -e 's/^\(LIBS = -lewf\)/\1 -ldl -lpthread/' tools/autotools/Makefile tsk/Makefile + /usr/bin/make -Otarget -j9 Making all in tsk /usr/bin/make all-recursive Making all in base make[3]: Entering directory '/tmp/B.Bfe1ra/BUILD/sleuthkit-4.6.7/tsk/base' /bin/sh ../../libtool --tag=CC --mode=compile i686-pld-linux-gcc -DHAVE_CONFIG_H -I. -I../../tsk -I../.. -pthread -I/usr/local/include -Wall -Wextra -Wno-unused-parameter -O2 -fwrapv -pipe -Wformat -Werror=format-security -gdwarf-4 -fno-debug-types-section -fvar-tracking-assignments -g2 -Wp,-D_FORTIFY_SOURCE=2 -fstack-protector-strong --param=ssp-buffer-size=4 -Werror=trampolines -fomit-frame-pointer -march=i686 -fasynchronous-unwind-tables -mtune=pentium4 -gdwarf-4 -fno-debug-types-section -fvar-tracking-assignments -g2 -MT mymalloc.lo -MD -MP -MF .deps/mymalloc.Tpo -c -o mymalloc.lo mymalloc.c libtool: compile: i686-pld-linux-gcc -DHAVE_CONFIG_H -I. -I../../tsk -I../.. -pthread -I/usr/local/include -Wall -Wextra -Wno-unused-parameter -O2 -fwrapv -pipe -Wformat -Werror=format-security -gdwarf-4 -fno-debug-types-section -fvar-tracking-assignments -g2 -Wp,-D_FORTIFY_SOURCE=2 -fstack-protector-strong --param=ssp-buffer-size=4 -Werror=trampolines -fomit-frame-pointer -march=i686 -fasynchronous-unwind-tables -mtune=pentium4 -gdwarf-4 -fno-debug-types-section -fvar-tracking-assignments -g2 -MT mymalloc.lo -MD -MP -MF .deps/mymalloc.Tpo -c mymalloc.c -fPIC -DPIC -o .libs/mymalloc.o libtool: compile: i686-pld-linux-gcc -DHAVE_CONFIG_H -I. -I../../tsk -I../.. -pthread -I/usr/local/include -Wall -Wextra -Wno-unused-parameter -O2 -fwrapv -pipe -Wformat -Werror=format-security -gdwarf-4 -fno-debug-types-section -fvar-tracking-assignments -g2 -Wp,-D_FORTIFY_SOURCE=2 -fstack-protector-strong --param=ssp-buffer-size=4 -Werror=trampolines -fomit-frame-pointer -march=i686 -fasynchronous-unwind-tables -mtune=pentium4 -gdwarf-4 -fno-debug-types-section -fvar-tracking-assignments -g2 -MT mymalloc.lo -MD -MP -MF .deps/mymalloc.Tpo -c mymalloc.c -o mymalloc.o >/dev/null 2>&1 mv -f .deps/mymalloc.Tpo .deps/mymalloc.Plo make[3]: Leaving directory '/tmp/B.Bfe1ra/BUILD/sleuthkit-4.6.7/tsk/base' make[3]: Entering directory '/tmp/B.Bfe1ra/BUILD/sleuthkit-4.6.7/tsk/base' /bin/sh ../../libtool --tag=CC --mode=compile i686-pld-linux-gcc -DHAVE_CONFIG_H -I. -I../../tsk -I../.. -pthread -I/usr/local/include -Wall -Wextra -Wno-unused-parameter -O2 -fwrapv -pipe -Wformat -Werror=format-security -gdwarf-4 -fno-debug-types-section -fvar-tracking-assignments -g2 -Wp,-D_FORTIFY_SOURCE=2 -fstack-protector-strong --param=ssp-buffer-size=4 -Werror=trampolines -fomit-frame-pointer -march=i686 -fasynchronous-unwind-tables -mtune=pentium4 -gdwarf-4 -fno-debug-types-section -fvar-tracking-assignments -g2 -MT tsk_parse.lo -MD -MP -MF .deps/tsk_parse.Tpo -c -o tsk_parse.lo tsk_parse.c libtool: compile: i686-pld-linux-gcc -DHAVE_CONFIG_H -I. -I../../tsk -I../.. -pthread -I/usr/local/include -Wall -Wextra -Wno-unused-parameter -O2 -fwrapv -pipe -Wformat -Werror=format-security -gdwarf-4 -fno-debug-types-section -fvar-tracking-assignments -g2 -Wp,-D_FORTIFY_SOURCE=2 -fstack-protector-strong --param=ssp-buffer-size=4 -Werror=trampolines -fomit-frame-pointer -march=i686 -fasynchronous-unwind-tables -mtune=pentium4 -gdwarf-4 -fno-debug-types-section -fvar-tracking-assignments -g2 -MT tsk_parse.lo -MD -MP -MF .deps/tsk_parse.Tpo -c tsk_parse.c -fPIC -DPIC -o .libs/tsk_parse.o libtool: compile: i686-pld-linux-gcc -DHAVE_CONFIG_H -I. -I../../tsk -I../.. -pthread -I/usr/local/include -Wall -Wextra -Wno-unused-parameter -O2 -fwrapv -pipe -Wformat -Werror=format-security -gdwarf-4 -fno-debug-types-section -fvar-tracking-assignments -g2 -Wp,-D_FORTIFY_SOURCE=2 -fstack-protector-strong --param=ssp-buffer-size=4 -Werror=trampolines -fomit-frame-pointer -march=i686 -fasynchronous-unwind-tables -mtune=pentium4 -gdwarf-4 -fno-debug-types-section -fvar-tracking-assignments -g2 -MT tsk_parse.lo -MD -MP -MF .deps/tsk_parse.Tpo -c tsk_parse.c -o tsk_parse.o >/dev/null 2>&1 mv -f .deps/tsk_parse.Tpo .deps/tsk_parse.Plo make[3]: Leaving directory '/tmp/B.Bfe1ra/BUILD/sleuthkit-4.6.7/tsk/base' make[3]: Entering directory '/tmp/B.Bfe1ra/BUILD/sleuthkit-4.6.7/tsk/base' /bin/sh ../../libtool --tag=CC --mode=compile i686-pld-linux-gcc -DHAVE_CONFIG_H -I. -I../../tsk -I../.. -pthread -I/usr/local/include -Wall -Wextra -Wno-unused-parameter -O2 -fwrapv -pipe -Wformat -Werror=format-security -gdwarf-4 -fno-debug-types-section -fvar-tracking-assignments -g2 -Wp,-D_FORTIFY_SOURCE=2 -fstack-protector-strong --param=ssp-buffer-size=4 -Werror=trampolines -fomit-frame-pointer -march=i686 -fasynchronous-unwind-tables -mtune=pentium4 -gdwarf-4 -fno-debug-types-section -fvar-tracking-assignments -g2 -MT tsk_printf.lo -MD -MP -MF .deps/tsk_printf.Tpo -c -o tsk_printf.lo tsk_printf.c libtool: compile: i686-pld-linux-gcc -DHAVE_CONFIG_H -I. -I../../tsk -I../.. -pthread -I/usr/local/include -Wall -Wextra -Wno-unused-parameter -O2 -fwrapv -pipe -Wformat -Werror=format-security -gdwarf-4 -fno-debug-types-section -fvar-tracking-assignments -g2 -Wp,-D_FORTIFY_SOURCE=2 -fstack-protector-strong --param=ssp-buffer-size=4 -Werror=trampolines -fomit-frame-pointer -march=i686 -fasynchronous-unwind-tables -mtune=pentium4 -gdwarf-4 -fno-debug-types-section -fvar-tracking-assignments -g2 -MT tsk_printf.lo -MD -MP -MF .deps/tsk_printf.Tpo -c tsk_printf.c -fPIC -DPIC -o .libs/tsk_printf.o libtool: compile: i686-pld-linux-gcc -DHAVE_CONFIG_H -I. -I../../tsk -I../.. -pthread -I/usr/local/include -Wall -Wextra -Wno-unused-parameter -O2 -fwrapv -pipe -Wformat -Werror=format-security -gdwarf-4 -fno-debug-types-section -fvar-tracking-assignments -g2 -Wp,-D_FORTIFY_SOURCE=2 -fstack-protector-strong --param=ssp-buffer-size=4 -Werror=trampolines -fomit-frame-pointer -march=i686 -fasynchronous-unwind-tables -mtune=pentium4 -gdwarf-4 -fno-debug-types-section -fvar-tracking-assignments -g2 -MT tsk_printf.lo -MD -MP -MF .deps/tsk_printf.Tpo -c tsk_printf.c -o tsk_printf.o >/dev/null 2>&1 mv -f .deps/tsk_printf.Tpo .deps/tsk_printf.Plo make[3]: Leaving directory '/tmp/B.Bfe1ra/BUILD/sleuthkit-4.6.7/tsk/base' make[3]: Entering directory '/tmp/B.Bfe1ra/BUILD/sleuthkit-4.6.7/tsk/base' /bin/sh ../../libtool --tag=CC --mode=compile i686-pld-linux-gcc -DHAVE_CONFIG_H -I. -I../../tsk -I../.. -pthread -I/usr/local/include -Wall -Wextra -Wno-unused-parameter -O2 -fwrapv -pipe -Wformat -Werror=format-security -gdwarf-4 -fno-debug-types-section -fvar-tracking-assignments -g2 -Wp,-D_FORTIFY_SOURCE=2 -fstack-protector-strong --param=ssp-buffer-size=4 -Werror=trampolines -fomit-frame-pointer -march=i686 -fasynchronous-unwind-tables -mtune=pentium4 -gdwarf-4 -fno-debug-types-section -fvar-tracking-assignments -g2 -MT crc.lo -MD -MP -MF .deps/crc.Tpo -c -o crc.lo crc.c libtool: compile: i686-pld-linux-gcc -DHAVE_CONFIG_H -I. -I../../tsk -I../.. -pthread -I/usr/local/include -Wall -Wextra -Wno-unused-parameter -O2 -fwrapv -pipe -Wformat -Werror=format-security -gdwarf-4 -fno-debug-types-section -fvar-tracking-assignments -g2 -Wp,-D_FORTIFY_SOURCE=2 -fstack-protector-strong --param=ssp-buffer-size=4 -Werror=trampolines -fomit-frame-pointer -march=i686 -fasynchronous-unwind-tables -mtune=pentium4 -gdwarf-4 -fno-debug-types-section -fvar-tracking-assignments -g2 -MT crc.lo -MD -MP -MF .deps/crc.Tpo -c crc.c -fPIC -DPIC -o .libs/crc.o libtool: compile: i686-pld-linux-gcc -DHAVE_CONFIG_H -I. -I../../tsk -I../.. -pthread -I/usr/local/include -Wall -Wextra -Wno-unused-parameter -O2 -fwrapv -pipe -Wformat -Werror=format-security -gdwarf-4 -fno-debug-types-section -fvar-tracking-assignments -g2 -Wp,-D_FORTIFY_SOURCE=2 -fstack-protector-strong --param=ssp-buffer-size=4 -Werror=trampolines -fomit-frame-pointer -march=i686 -fasynchronous-unwind-tables -mtune=pentium4 -gdwarf-4 -fno-debug-types-section -fvar-tracking-assignments -g2 -MT crc.lo -MD -MP -MF .deps/crc.Tpo -c crc.c -o crc.o >/dev/null 2>&1 mv -f .deps/crc.Tpo .deps/crc.Plo make[3]: Leaving directory '/tmp/B.Bfe1ra/BUILD/sleuthkit-4.6.7/tsk/base' make[3]: Entering directory '/tmp/B.Bfe1ra/BUILD/sleuthkit-4.6.7/tsk/base' /bin/sh ../../libtool --tag=CC --mode=compile i686-pld-linux-gcc -DHAVE_CONFIG_H -I. -I../../tsk -I../.. -pthread -I/usr/local/include -Wall -Wextra -Wno-unused-parameter -O2 -fwrapv -pipe -Wformat -Werror=format-security -gdwarf-4 -fno-debug-types-section -fvar-tracking-assignments -g2 -Wp,-D_FORTIFY_SOURCE=2 -fstack-protector-strong --param=ssp-buffer-size=4 -Werror=trampolines -fomit-frame-pointer -march=i686 -fasynchronous-unwind-tables -mtune=pentium4 -gdwarf-4 -fno-debug-types-section -fvar-tracking-assignments -g2 -MT tsk_endian.lo -MD -MP -MF .deps/tsk_endian.Tpo -c -o tsk_endian.lo tsk_endian.c libtool: compile: i686-pld-linux-gcc -DHAVE_CONFIG_H -I. -I../../tsk -I../.. -pthread -I/usr/local/include -Wall -Wextra -Wno-unused-parameter -O2 -fwrapv -pipe -Wformat -Werror=format-security -gdwarf-4 -fno-debug-types-section -fvar-tracking-assignments -g2 -Wp,-D_FORTIFY_SOURCE=2 -fstack-protector-strong --param=ssp-buffer-size=4 -Werror=trampolines -fomit-frame-pointer -march=i686 -fasynchronous-unwind-tables -mtune=pentium4 -gdwarf-4 -fno-debug-types-section -fvar-tracking-assignments -g2 -MT tsk_endian.lo -MD -MP -MF .deps/tsk_endian.Tpo -c tsk_endian.c -fPIC -DPIC -o .libs/tsk_endian.o libtool: compile: i686-pld-linux-gcc -DHAVE_CONFIG_H -I. -I../../tsk -I../.. -pthread -I/usr/local/include -Wall -Wextra -Wno-unused-parameter -O2 -fwrapv -pipe -Wformat -Werror=format-security -gdwarf-4 -fno-debug-types-section -fvar-tracking-assignments -g2 -Wp,-D_FORTIFY_SOURCE=2 -fstack-protector-strong --param=ssp-buffer-size=4 -Werror=trampolines -fomit-frame-pointer -march=i686 -fasynchronous-unwind-tables -mtune=pentium4 -gdwarf-4 -fno-debug-types-section -fvar-tracking-assignments -g2 -MT tsk_endian.lo -MD -MP -MF .deps/tsk_endian.Tpo -c tsk_endian.c -o tsk_endian.o >/dev/null 2>&1 mv -f .deps/tsk_endian.Tpo .deps/tsk_endian.Plo make[3]: Leaving directory '/tmp/B.Bfe1ra/BUILD/sleuthkit-4.6.7/tsk/base' make[3]: Entering directory '/tmp/B.Bfe1ra/BUILD/sleuthkit-4.6.7/tsk/base' /bin/sh ../../libtool --tag=CC --mode=compile i686-pld-linux-gcc -DHAVE_CONFIG_H -I. -I../../tsk -I../.. -pthread -I/usr/local/include -Wall -Wextra -Wno-unused-parameter -O2 -fwrapv -pipe -Wformat -Werror=format-security -gdwarf-4 -fno-debug-types-section -fvar-tracking-assignments -g2 -Wp,-D_FORTIFY_SOURCE=2 -fstack-protector-strong --param=ssp-buffer-size=4 -Werror=trampolines -fomit-frame-pointer -march=i686 -fasynchronous-unwind-tables -mtune=pentium4 -gdwarf-4 -fno-debug-types-section -fvar-tracking-assignments -g2 -MT tsk_list.lo -MD -MP -MF .deps/tsk_list.Tpo -c -o tsk_list.lo tsk_list.c libtool: compile: i686-pld-linux-gcc -DHAVE_CONFIG_H -I. -I../../tsk -I../.. -pthread -I/usr/local/include -Wall -Wextra -Wno-unused-parameter -O2 -fwrapv -pipe -Wformat -Werror=format-security -gdwarf-4 -fno-debug-types-section -fvar-tracking-assignments -g2 -Wp,-D_FORTIFY_SOURCE=2 -fstack-protector-strong --param=ssp-buffer-size=4 -Werror=trampolines -fomit-frame-pointer -march=i686 -fasynchronous-unwind-tables -mtune=pentium4 -gdwarf-4 -fno-debug-types-section -fvar-tracking-assignments -g2 -MT tsk_list.lo -MD -MP -MF .deps/tsk_list.Tpo -c tsk_list.c -fPIC -DPIC -o .libs/tsk_list.o libtool: compile: i686-pld-linux-gcc -DHAVE_CONFIG_H -I. -I../../tsk -I../.. -pthread -I/usr/local/include -Wall -Wextra -Wno-unused-parameter -O2 -fwrapv -pipe -Wformat -Werror=format-security -gdwarf-4 -fno-debug-types-section -fvar-tracking-assignments -g2 -Wp,-D_FORTIFY_SOURCE=2 -fstack-protector-strong --param=ssp-buffer-size=4 -Werror=trampolines -fomit-frame-pointer -march=i686 -fasynchronous-unwind-tables -mtune=pentium4 -gdwarf-4 -fno-debug-types-section -fvar-tracking-assignments -g2 -MT tsk_list.lo -MD -MP -MF .deps/tsk_list.Tpo -c tsk_list.c -o tsk_list.o >/dev/null 2>&1 mv -f .deps/tsk_list.Tpo .deps/tsk_list.Plo make[3]: Leaving directory '/tmp/B.Bfe1ra/BUILD/sleuthkit-4.6.7/tsk/base' make[3]: Entering directory '/tmp/B.Bfe1ra/BUILD/sleuthkit-4.6.7/tsk/base' /bin/sh ../../libtool --tag=CC --mode=compile i686-pld-linux-gcc -DHAVE_CONFIG_H -I. -I../../tsk -I../.. -pthread -I/usr/local/include -Wall -Wextra -Wno-unused-parameter -O2 -fwrapv -pipe -Wformat -Werror=format-security -gdwarf-4 -fno-debug-types-section -fvar-tracking-assignments -g2 -Wp,-D_FORTIFY_SOURCE=2 -fstack-protector-strong --param=ssp-buffer-size=4 -Werror=trampolines -fomit-frame-pointer -march=i686 -fasynchronous-unwind-tables -mtune=pentium4 -gdwarf-4 -fno-debug-types-section -fvar-tracking-assignments -g2 -MT tsk_error.lo -MD -MP -MF .deps/tsk_error.Tpo -c -o tsk_error.lo tsk_error.c libtool: compile: i686-pld-linux-gcc -DHAVE_CONFIG_H -I. -I../../tsk -I../.. -pthread -I/usr/local/include -Wall -Wextra -Wno-unused-parameter -O2 -fwrapv -pipe -Wformat -Werror=format-security -gdwarf-4 -fno-debug-types-section -fvar-tracking-assignments -g2 -Wp,-D_FORTIFY_SOURCE=2 -fstack-protector-strong --param=ssp-buffer-size=4 -Werror=trampolines -fomit-frame-pointer -march=i686 -fasynchronous-unwind-tables -mtune=pentium4 -gdwarf-4 -fno-debug-types-section -fvar-tracking-assignments -g2 -MT tsk_error.lo -MD -MP -MF .deps/tsk_error.Tpo -c tsk_error.c -fPIC -DPIC -o .libs/tsk_error.o libtool: compile: i686-pld-linux-gcc -DHAVE_CONFIG_H -I. -I../../tsk -I../.. -pthread -I/usr/local/include -Wall -Wextra -Wno-unused-parameter -O2 -fwrapv -pipe -Wformat -Werror=format-security -gdwarf-4 -fno-debug-types-section -fvar-tracking-assignments -g2 -Wp,-D_FORTIFY_SOURCE=2 -fstack-protector-strong --param=ssp-buffer-size=4 -Werror=trampolines -fomit-frame-pointer -march=i686 -fasynchronous-unwind-tables -mtune=pentium4 -gdwarf-4 -fno-debug-types-section -fvar-tracking-assignments -g2 -MT tsk_error.lo -MD -MP -MF .deps/tsk_error.Tpo -c tsk_error.c -o tsk_error.o >/dev/null 2>&1 mv -f .deps/tsk_error.Tpo .deps/tsk_error.Plo make[3]: Leaving directory '/tmp/B.Bfe1ra/BUILD/sleuthkit-4.6.7/tsk/base' make[3]: Entering directory '/tmp/B.Bfe1ra/BUILD/sleuthkit-4.6.7/tsk/base' /bin/sh ../../libtool --tag=CC --mode=compile i686-pld-linux-gcc -DHAVE_CONFIG_H -I. -I../../tsk -I../.. -pthread -I/usr/local/include -Wall -Wextra -Wno-unused-parameter -O2 -fwrapv -pipe -Wformat -Werror=format-security -gdwarf-4 -fno-debug-types-section -fvar-tracking-assignments -g2 -Wp,-D_FORTIFY_SOURCE=2 -fstack-protector-strong --param=ssp-buffer-size=4 -Werror=trampolines -fomit-frame-pointer -march=i686 -fasynchronous-unwind-tables -mtune=pentium4 -gdwarf-4 -fno-debug-types-section -fvar-tracking-assignments -g2 -MT tsk_version.lo -MD -MP -MF .deps/tsk_version.Tpo -c -o tsk_version.lo tsk_version.c libtool: compile: i686-pld-linux-gcc -DHAVE_CONFIG_H -I. -I../../tsk -I../.. -pthread -I/usr/local/include -Wall -Wextra -Wno-unused-parameter -O2 -fwrapv -pipe -Wformat -Werror=format-security -gdwarf-4 -fno-debug-types-section -fvar-tracking-assignments -g2 -Wp,-D_FORTIFY_SOURCE=2 -fstack-protector-strong --param=ssp-buffer-size=4 -Werror=trampolines -fomit-frame-pointer -march=i686 -fasynchronous-unwind-tables -mtune=pentium4 -gdwarf-4 -fno-debug-types-section -fvar-tracking-assignments -g2 -MT tsk_version.lo -MD -MP -MF .deps/tsk_version.Tpo -c tsk_version.c -fPIC -DPIC -o .libs/tsk_version.o libtool: compile: i686-pld-linux-gcc -DHAVE_CONFIG_H -I. -I../../tsk -I../.. -pthread -I/usr/local/include -Wall -Wextra -Wno-unused-parameter -O2 -fwrapv -pipe -Wformat -Werror=format-security -gdwarf-4 -fno-debug-types-section -fvar-tracking-assignments -g2 -Wp,-D_FORTIFY_SOURCE=2 -fstack-protector-strong --param=ssp-buffer-size=4 -Werror=trampolines -fomit-frame-pointer -march=i686 -fasynchronous-unwind-tables -mtune=pentium4 -gdwarf-4 -fno-debug-types-section -fvar-tracking-assignments -g2 -MT tsk_version.lo -MD -MP -MF .deps/tsk_version.Tpo -c tsk_version.c -o tsk_version.o >/dev/null 2>&1 mv -f .deps/tsk_version.Tpo .deps/tsk_version.Plo make[3]: Leaving directory '/tmp/B.Bfe1ra/BUILD/sleuthkit-4.6.7/tsk/base' make[3]: Entering directory '/tmp/B.Bfe1ra/BUILD/sleuthkit-4.6.7/tsk/base' /bin/sh ../../libtool --tag=CC --mode=compile i686-pld-linux-gcc -DHAVE_CONFIG_H -I. -I../../tsk -I../.. -pthread -I/usr/local/include -Wall -Wextra -Wno-unused-parameter -O2 -fwrapv -pipe -Wformat -Werror=format-security -gdwarf-4 -fno-debug-types-section -fvar-tracking-assignments -g2 -Wp,-D_FORTIFY_SOURCE=2 -fstack-protector-strong --param=ssp-buffer-size=4 -Werror=trampolines -fomit-frame-pointer -march=i686 -fasynchronous-unwind-tables -mtune=pentium4 -gdwarf-4 -fno-debug-types-section -fvar-tracking-assignments -g2 -MT XGetopt.lo -MD -MP -MF .deps/XGetopt.Tpo -c -o XGetopt.lo XGetopt.c libtool: compile: i686-pld-linux-gcc -DHAVE_CONFIG_H -I. -I../../tsk -I../.. -pthread -I/usr/local/include -Wall -Wextra -Wno-unused-parameter -O2 -fwrapv -pipe -Wformat -Werror=format-security -gdwarf-4 -fno-debug-types-section -fvar-tracking-assignments -g2 -Wp,-D_FORTIFY_SOURCE=2 -fstack-protector-strong --param=ssp-buffer-size=4 -Werror=trampolines -fomit-frame-pointer -march=i686 -fasynchronous-unwind-tables -mtune=pentium4 -gdwarf-4 -fno-debug-types-section -fvar-tracking-assignments -g2 -MT XGetopt.lo -MD -MP -MF .deps/XGetopt.Tpo -c XGetopt.c -fPIC -DPIC -o .libs/XGetopt.o libtool: compile: i686-pld-linux-gcc -DHAVE_CONFIG_H -I. -I../../tsk -I../.. -pthread -I/usr/local/include -Wall -Wextra -Wno-unused-parameter -O2 -fwrapv -pipe -Wformat -Werror=format-security -gdwarf-4 -fno-debug-types-section -fvar-tracking-assignments -g2 -Wp,-D_FORTIFY_SOURCE=2 -fstack-protector-strong --param=ssp-buffer-size=4 -Werror=trampolines -fomit-frame-pointer -march=i686 -fasynchronous-unwind-tables -mtune=pentium4 -gdwarf-4 -fno-debug-types-section -fvar-tracking-assignments -g2 -MT XGetopt.lo -MD -MP -MF .deps/XGetopt.Tpo -c XGetopt.c -o XGetopt.o >/dev/null 2>&1 mv -f .deps/XGetopt.Tpo .deps/XGetopt.Plo make[3]: Leaving directory '/tmp/B.Bfe1ra/BUILD/sleuthkit-4.6.7/tsk/base' make[3]: Entering directory '/tmp/B.Bfe1ra/BUILD/sleuthkit-4.6.7/tsk/base' /bin/sh ../../libtool --tag=CC --mode=compile i686-pld-linux-gcc -DHAVE_CONFIG_H -I. -I../../tsk -I../.. -pthread -I/usr/local/include -Wall -Wextra -Wno-unused-parameter -O2 -fwrapv -pipe -Wformat -Werror=format-security -gdwarf-4 -fno-debug-types-section -fvar-tracking-assignments -g2 -Wp,-D_FORTIFY_SOURCE=2 -fstack-protector-strong --param=ssp-buffer-size=4 -Werror=trampolines -fomit-frame-pointer -march=i686 -fasynchronous-unwind-tables -mtune=pentium4 -gdwarf-4 -fno-debug-types-section -fvar-tracking-assignments -g2 -MT tsk_stack.lo -MD -MP -MF .deps/tsk_stack.Tpo -c -o tsk_stack.lo tsk_stack.c libtool: compile: i686-pld-linux-gcc -DHAVE_CONFIG_H -I. -I../../tsk -I../.. -pthread -I/usr/local/include -Wall -Wextra -Wno-unused-parameter -O2 -fwrapv -pipe -Wformat -Werror=format-security -gdwarf-4 -fno-debug-types-section -fvar-tracking-assignments -g2 -Wp,-D_FORTIFY_SOURCE=2 -fstack-protector-strong --param=ssp-buffer-size=4 -Werror=trampolines -fomit-frame-pointer -march=i686 -fasynchronous-unwind-tables -mtune=pentium4 -gdwarf-4 -fno-debug-types-section -fvar-tracking-assignments -g2 -MT tsk_stack.lo -MD -MP -MF .deps/tsk_stack.Tpo -c tsk_stack.c -fPIC -DPIC -o .libs/tsk_stack.o libtool: compile: i686-pld-linux-gcc -DHAVE_CONFIG_H -I. -I../../tsk -I../.. -pthread -I/usr/local/include -Wall -Wextra -Wno-unused-parameter -O2 -fwrapv -pipe -Wformat -Werror=format-security -gdwarf-4 -fno-debug-types-section -fvar-tracking-assignments -g2 -Wp,-D_FORTIFY_SOURCE=2 -fstack-protector-strong --param=ssp-buffer-size=4 -Werror=trampolines -fomit-frame-pointer -march=i686 -fasynchronous-unwind-tables -mtune=pentium4 -gdwarf-4 -fno-debug-types-section -fvar-tracking-assignments -g2 -MT tsk_stack.lo -MD -MP -MF .deps/tsk_stack.Tpo -c tsk_stack.c -o tsk_stack.o >/dev/null 2>&1 mv -f .deps/tsk_stack.Tpo .deps/tsk_stack.Plo make[3]: Leaving directory '/tmp/B.Bfe1ra/BUILD/sleuthkit-4.6.7/tsk/base' make[3]: Entering directory '/tmp/B.Bfe1ra/BUILD/sleuthkit-4.6.7/tsk/base' /bin/sh ../../libtool --tag=CC --mode=compile i686-pld-linux-gcc -DHAVE_CONFIG_H -I. -I../../tsk -I../.. -pthread -I/usr/local/include -Wall -Wextra -Wno-unused-parameter -O2 -fwrapv -pipe -Wformat -Werror=format-security -gdwarf-4 -fno-debug-types-section -fvar-tracking-assignments -g2 -Wp,-D_FORTIFY_SOURCE=2 -fstack-protector-strong --param=ssp-buffer-size=4 -Werror=trampolines -fomit-frame-pointer -march=i686 -fasynchronous-unwind-tables -mtune=pentium4 -gdwarf-4 -fno-debug-types-section -fvar-tracking-assignments -g2 -MT md5c.lo -MD -MP -MF .deps/md5c.Tpo -c -o md5c.lo md5c.c libtool: compile: i686-pld-linux-gcc -DHAVE_CONFIG_H -I. -I../../tsk -I../.. -pthread -I/usr/local/include -Wall -Wextra -Wno-unused-parameter -O2 -fwrapv -pipe -Wformat -Werror=format-security -gdwarf-4 -fno-debug-types-section -fvar-tracking-assignments -g2 -Wp,-D_FORTIFY_SOURCE=2 -fstack-protector-strong --param=ssp-buffer-size=4 -Werror=trampolines -fomit-frame-pointer -march=i686 -fasynchronous-unwind-tables -mtune=pentium4 -gdwarf-4 -fno-debug-types-section -fvar-tracking-assignments -g2 -MT md5c.lo -MD -MP -MF .deps/md5c.Tpo -c md5c.c -fPIC -DPIC -o .libs/md5c.o libtool: compile: i686-pld-linux-gcc -DHAVE_CONFIG_H -I. -I../../tsk -I../.. -pthread -I/usr/local/include -Wall -Wextra -Wno-unused-parameter -O2 -fwrapv -pipe -Wformat -Werror=format-security -gdwarf-4 -fno-debug-types-section -fvar-tracking-assignments -g2 -Wp,-D_FORTIFY_SOURCE=2 -fstack-protector-strong --param=ssp-buffer-size=4 -Werror=trampolines -fomit-frame-pointer -march=i686 -fasynchronous-unwind-tables -mtune=pentium4 -gdwarf-4 -fno-debug-types-section -fvar-tracking-assignments -g2 -MT md5c.lo -MD -MP -MF .deps/md5c.Tpo -c md5c.c -o md5c.o >/dev/null 2>&1 mv -f .deps/md5c.Tpo .deps/md5c.Plo make[3]: Leaving directory '/tmp/B.Bfe1ra/BUILD/sleuthkit-4.6.7/tsk/base' make[3]: Entering directory '/tmp/B.Bfe1ra/BUILD/sleuthkit-4.6.7/tsk/base' /bin/sh ../../libtool --tag=CC --mode=compile i686-pld-linux-gcc -DHAVE_CONFIG_H -I. -I../../tsk -I../.. -pthread -I/usr/local/include -Wall -Wextra -Wno-unused-parameter -O2 -fwrapv -pipe -Wformat -Werror=format-security -gdwarf-4 -fno-debug-types-section -fvar-tracking-assignments -g2 -Wp,-D_FORTIFY_SOURCE=2 -fstack-protector-strong --param=ssp-buffer-size=4 -Werror=trampolines -fomit-frame-pointer -march=i686 -fasynchronous-unwind-tables -mtune=pentium4 -gdwarf-4 -fno-debug-types-section -fvar-tracking-assignments -g2 -MT tsk_lock.lo -MD -MP -MF .deps/tsk_lock.Tpo -c -o tsk_lock.lo tsk_lock.c libtool: compile: i686-pld-linux-gcc -DHAVE_CONFIG_H -I. -I../../tsk -I../.. -pthread -I/usr/local/include -Wall -Wextra -Wno-unused-parameter -O2 -fwrapv -pipe -Wformat -Werror=format-security -gdwarf-4 -fno-debug-types-section -fvar-tracking-assignments -g2 -Wp,-D_FORTIFY_SOURCE=2 -fstack-protector-strong --param=ssp-buffer-size=4 -Werror=trampolines -fomit-frame-pointer -march=i686 -fasynchronous-unwind-tables -mtune=pentium4 -gdwarf-4 -fno-debug-types-section -fvar-tracking-assignments -g2 -MT tsk_lock.lo -MD -MP -MF .deps/tsk_lock.Tpo -c tsk_lock.c -fPIC -DPIC -o .libs/tsk_lock.o libtool: compile: i686-pld-linux-gcc -DHAVE_CONFIG_H -I. -I../../tsk -I../.. -pthread -I/usr/local/include -Wall -Wextra -Wno-unused-parameter -O2 -fwrapv -pipe -Wformat -Werror=format-security -gdwarf-4 -fno-debug-types-section -fvar-tracking-assignments -g2 -Wp,-D_FORTIFY_SOURCE=2 -fstack-protector-strong --param=ssp-buffer-size=4 -Werror=trampolines -fomit-frame-pointer -march=i686 -fasynchronous-unwind-tables -mtune=pentium4 -gdwarf-4 -fno-debug-types-section -fvar-tracking-assignments -g2 -MT tsk_lock.lo -MD -MP -MF .deps/tsk_lock.Tpo -c tsk_lock.c -o tsk_lock.o >/dev/null 2>&1 mv -f .deps/tsk_lock.Tpo .deps/tsk_lock.Plo make[3]: Leaving directory '/tmp/B.Bfe1ra/BUILD/sleuthkit-4.6.7/tsk/base' make[3]: Entering directory '/tmp/B.Bfe1ra/BUILD/sleuthkit-4.6.7/tsk/base' /bin/sh ../../libtool --tag=CXX --mode=compile i686-pld-linux-g++ -DHAVE_CONFIG_H -I. -I../../tsk -I../.. -pthread -I/usr/local/include -Wall -Wextra -Wno-unused-parameter -O2 -fwrapv -pipe -Wformat -Werror=format-security -gdwarf-4 -fno-debug-types-section -fvar-tracking-assignments -g2 -Wp,-D_FORTIFY_SOURCE=2 -fstack-protector-strong --param=ssp-buffer-size=4 -Werror=trampolines -fomit-frame-pointer -march=i686 -fasynchronous-unwind-tables -mtune=pentium4 -gdwarf-4 -fno-debug-types-section -fvar-tracking-assignments -g2 -MT tsk_error_win32.lo -MD -MP -MF .deps/tsk_error_win32.Tpo -c -o tsk_error_win32.lo tsk_error_win32.cpp libtool: compile: i686-pld-linux-g++ -DHAVE_CONFIG_H -I. -I../../tsk -I../.. -pthread -I/usr/local/include -Wall -Wextra -Wno-unused-parameter -O2 -fwrapv -pipe -Wformat -Werror=format-security -gdwarf-4 -fno-debug-types-section -fvar-tracking-assignments -g2 -Wp,-D_FORTIFY_SOURCE=2 -fstack-protector-strong --param=ssp-buffer-size=4 -Werror=trampolines -fomit-frame-pointer -march=i686 -fasynchronous-unwind-tables -mtune=pentium4 -gdwarf-4 -fno-debug-types-section -fvar-tracking-assignments -g2 -MT tsk_error_win32.lo -MD -MP -MF .deps/tsk_error_win32.Tpo -c tsk_error_win32.cpp -fPIC -DPIC -o .libs/tsk_error_win32.o libtool: compile: i686-pld-linux-g++ -DHAVE_CONFIG_H -I. -I../../tsk -I../.. -pthread -I/usr/local/include -Wall -Wextra -Wno-unused-parameter -O2 -fwrapv -pipe -Wformat -Werror=format-security -gdwarf-4 -fno-debug-types-section -fvar-tracking-assignments -g2 -Wp,-D_FORTIFY_SOURCE=2 -fstack-protector-strong --param=ssp-buffer-size=4 -Werror=trampolines -fomit-frame-pointer -march=i686 -fasynchronous-unwind-tables -mtune=pentium4 -gdwarf-4 -fno-debug-types-section -fvar-tracking-assignments -g2 -MT tsk_error_win32.lo -MD -MP -MF .deps/tsk_error_win32.Tpo -c tsk_error_win32.cpp -o tsk_error_win32.o >/dev/null 2>&1 mv -f .deps/tsk_error_win32.Tpo .deps/tsk_error_win32.Plo make[3]: Leaving directory '/tmp/B.Bfe1ra/BUILD/sleuthkit-4.6.7/tsk/base' make[3]: Entering directory '/tmp/B.Bfe1ra/BUILD/sleuthkit-4.6.7/tsk/base' /bin/sh ../../libtool --tag=CC --mode=compile i686-pld-linux-gcc -DHAVE_CONFIG_H -I. -I../../tsk -I../.. -pthread -I/usr/local/include -Wall -Wextra -Wno-unused-parameter -O2 -fwrapv -pipe -Wformat -Werror=format-security -gdwarf-4 -fno-debug-types-section -fvar-tracking-assignments -g2 -Wp,-D_FORTIFY_SOURCE=2 -fstack-protector-strong --param=ssp-buffer-size=4 -Werror=trampolines -fomit-frame-pointer -march=i686 -fasynchronous-unwind-tables -mtune=pentium4 -gdwarf-4 -fno-debug-types-section -fvar-tracking-assignments -g2 -MT tsk_unicode.lo -MD -MP -MF .deps/tsk_unicode.Tpo -c -o tsk_unicode.lo tsk_unicode.c libtool: compile: i686-pld-linux-gcc -DHAVE_CONFIG_H -I. -I../../tsk -I../.. -pthread -I/usr/local/include -Wall -Wextra -Wno-unused-parameter -O2 -fwrapv -pipe -Wformat -Werror=format-security -gdwarf-4 -fno-debug-types-section -fvar-tracking-assignments -g2 -Wp,-D_FORTIFY_SOURCE=2 -fstack-protector-strong --param=ssp-buffer-size=4 -Werror=trampolines -fomit-frame-pointer -march=i686 -fasynchronous-unwind-tables -mtune=pentium4 -gdwarf-4 -fno-debug-types-section -fvar-tracking-assignments -g2 -MT tsk_unicode.lo -MD -MP -MF .deps/tsk_unicode.Tpo -c tsk_unicode.c -fPIC -DPIC -o .libs/tsk_unicode.o tsk_unicode.c: In function 'tsk_UTF16toUTF8': tsk_unicode.c:230:16: warning: this statement may fall through [-Wimplicit-fallthrough=] ch >>= 6; ~~~^~~~~ tsk_unicode.c:231:9: note: here case 3: ^~~~ tsk_unicode.c:233:16: warning: this statement may fall through [-Wimplicit-fallthrough=] ch >>= 6; ~~~^~~~~ tsk_unicode.c:234:9: note: here case 2: ^~~~ tsk_unicode.c:236:16: warning: this statement may fall through [-Wimplicit-fallthrough=] ch >>= 6; ~~~^~~~~ tsk_unicode.c:237:9: note: here case 1: ^~~~ tsk_unicode.c: In function 'tsk_UTF16toUTF8_lclorder': tsk_unicode.c:341:16: warning: this statement may fall through [-Wimplicit-fallthrough=] ch >>= 6; ~~~^~~~~ tsk_unicode.c:342:9: note: here case 3: ^~~~ tsk_unicode.c:344:16: warning: this statement may fall through [-Wimplicit-fallthrough=] ch >>= 6; ~~~^~~~~ tsk_unicode.c:345:9: note: here case 2: ^~~~ tsk_unicode.c:347:16: warning: this statement may fall through [-Wimplicit-fallthrough=] ch >>= 6; ~~~^~~~~ tsk_unicode.c:348:9: note: here case 1: ^~~~ tsk_unicode.c: In function 'tsk_UTF16WtoUTF8_lclorder': tsk_unicode.c:441:16: warning: this statement may fall through [-Wimplicit-fallthrough=] ch >>= 6; ~~~^~~~~ tsk_unicode.c:442:9: note: here case 3: ^~~~ tsk_unicode.c:444:16: warning: this statement may fall through [-Wimplicit-fallthrough=] ch >>= 6; ~~~^~~~~ tsk_unicode.c:445:9: note: here case 2: ^~~~ tsk_unicode.c:447:16: warning: this statement may fall through [-Wimplicit-fallthrough=] ch >>= 6; ~~~^~~~~ tsk_unicode.c:448:9: note: here case 1: ^~~~ tsk_unicode.c: In function 'isLegalUTF8': tsk_unicode.c:481:38: warning: this statement may fall through [-Wimplicit-fallthrough=] if ((a = (*--srcptr)) < 0x80 || a > 0xBF) ~~~~~~~~~~~~~~~~~~~~~~~~~^~~~~~~~~~~ tsk_unicode.c:483:5: note: here case 3: ^~~~ tsk_unicode.c:484:38: warning: this statement may fall through [-Wimplicit-fallthrough=] if ((a = (*--srcptr)) < 0x80 || a > 0xBF) ~~~~~~~~~~~~~~~~~~~~~~~~~^~~~~~~~~~~ tsk_unicode.c:486:5: note: here case 2: ^~~~ tsk_unicode.c:490:9: warning: this statement may fall through [-Wimplicit-fallthrough=] switch (*source) { ^~~~~~ tsk_unicode.c:513:5: note: here case 1: ^~~~ tsk_unicode.c: In function 'tsk_UTF8toUTF16': tsk_unicode.c:609:16: warning: this statement may fall through [-Wimplicit-fallthrough=] ch <<= 6; /* remember, illegal UTF-8 */ ~~~^~~~~ tsk_unicode.c:610:9: note: here case 4: ^~~~ tsk_unicode.c:612:16: warning: this statement may fall through [-Wimplicit-fallthrough=] ch <<= 6; /* remember, illegal UTF-8 */ ~~~^~~~~ tsk_unicode.c:613:9: note: here case 3: ^~~~ tsk_unicode.c:615:16: warning: this statement may fall through [-Wimplicit-fallthrough=] ch <<= 6; ~~~^~~~~ tsk_unicode.c:616:9: note: here case 2: ^~~~ tsk_unicode.c:618:16: warning: this statement may fall through [-Wimplicit-fallthrough=] ch <<= 6; ~~~^~~~~ tsk_unicode.c:619:9: note: here case 1: ^~~~ tsk_unicode.c:621:16: warning: this statement may fall through [-Wimplicit-fallthrough=] ch <<= 6; ~~~^~~~~ tsk_unicode.c:622:9: note: here case 0: ^~~~ libtool: compile: i686-pld-linux-gcc -DHAVE_CONFIG_H -I. -I../../tsk -I../.. -pthread -I/usr/local/include -Wall -Wextra -Wno-unused-parameter -O2 -fwrapv -pipe -Wformat -Werror=format-security -gdwarf-4 -fno-debug-types-section -fvar-tracking-assignments -g2 -Wp,-D_FORTIFY_SOURCE=2 -fstack-protector-strong --param=ssp-buffer-size=4 -Werror=trampolines -fomit-frame-pointer -march=i686 -fasynchronous-unwind-tables -mtune=pentium4 -gdwarf-4 -fno-debug-types-section -fvar-tracking-assignments -g2 -MT tsk_unicode.lo -MD -MP -MF .deps/tsk_unicode.Tpo -c tsk_unicode.c -o tsk_unicode.o >/dev/null 2>&1 mv -f .deps/tsk_unicode.Tpo .deps/tsk_unicode.Plo make[3]: Leaving directory '/tmp/B.Bfe1ra/BUILD/sleuthkit-4.6.7/tsk/base' make[3]: Entering directory '/tmp/B.Bfe1ra/BUILD/sleuthkit-4.6.7/tsk/base' /bin/sh ../../libtool --tag=CC --mode=compile i686-pld-linux-gcc -DHAVE_CONFIG_H -I. -I../../tsk -I../.. -pthread -I/usr/local/include -Wall -Wextra -Wno-unused-parameter -O2 -fwrapv -pipe -Wformat -Werror=format-security -gdwarf-4 -fno-debug-types-section -fvar-tracking-assignments -g2 -Wp,-D_FORTIFY_SOURCE=2 -fstack-protector-strong --param=ssp-buffer-size=4 -Werror=trampolines -fomit-frame-pointer -march=i686 -fasynchronous-unwind-tables -mtune=pentium4 -gdwarf-4 -fno-debug-types-section -fvar-tracking-assignments -g2 -MT sha1c.lo -MD -MP -MF .deps/sha1c.Tpo -c -o sha1c.lo sha1c.c libtool: compile: i686-pld-linux-gcc -DHAVE_CONFIG_H -I. -I../../tsk -I../.. -pthread -I/usr/local/include -Wall -Wextra -Wno-unused-parameter -O2 -fwrapv -pipe -Wformat -Werror=format-security -gdwarf-4 -fno-debug-types-section -fvar-tracking-assignments -g2 -Wp,-D_FORTIFY_SOURCE=2 -fstack-protector-strong --param=ssp-buffer-size=4 -Werror=trampolines -fomit-frame-pointer -march=i686 -fasynchronous-unwind-tables -mtune=pentium4 -gdwarf-4 -fno-debug-types-section -fvar-tracking-assignments -g2 -MT sha1c.lo -MD -MP -MF .deps/sha1c.Tpo -c sha1c.c -fPIC -DPIC -o .libs/sha1c.o libtool: compile: i686-pld-linux-gcc -DHAVE_CONFIG_H -I. -I../../tsk -I../.. -pthread -I/usr/local/include -Wall -Wextra -Wno-unused-parameter -O2 -fwrapv -pipe -Wformat -Werror=format-security -gdwarf-4 -fno-debug-types-section -fvar-tracking-assignments -g2 -Wp,-D_FORTIFY_SOURCE=2 -fstack-protector-strong --param=ssp-buffer-size=4 -Werror=trampolines -fomit-frame-pointer -march=i686 -fasynchronous-unwind-tables -mtune=pentium4 -gdwarf-4 -fno-debug-types-section -fvar-tracking-assignments -g2 -MT sha1c.lo -MD -MP -MF .deps/sha1c.Tpo -c sha1c.c -o sha1c.o >/dev/null 2>&1 mv -f .deps/sha1c.Tpo .deps/sha1c.Plo make[3]: Leaving directory '/tmp/B.Bfe1ra/BUILD/sleuthkit-4.6.7/tsk/base' make[3]: Entering directory '/tmp/B.Bfe1ra/BUILD/sleuthkit-4.6.7/tsk/base' /bin/sh ../../libtool --tag=CXX --mode=link i686-pld-linux-g++ -Wall -Wextra -Wno-unused-parameter -O2 -fwrapv -pipe -Wformat -Werror=format-security -gdwarf-4 -fno-debug-types-section -fvar-tracking-assignments -g2 -Wp,-D_FORTIFY_SOURCE=2 -fstack-protector-strong --param=ssp-buffer-size=4 -Werror=trampolines -fomit-frame-pointer -march=i686 -fasynchronous-unwind-tables -mtune=pentium4 -gdwarf-4 -fno-debug-types-section -fvar-tracking-assignments -g2 -Wl,--as-needed -Wl,--no-copy-dt-needed-entries -Wl,-z,relro -Wl,-z,combreloc -pthread -L/usr/local/lib -o libtskbase.la md5c.lo mymalloc.lo sha1c.lo crc.lo tsk_endian.lo tsk_error.lo tsk_list.lo tsk_parse.lo tsk_printf.lo tsk_unicode.lo tsk_version.lo tsk_stack.lo XGetopt.lo tsk_lock.lo tsk_error_win32.lo -lewf -ldl -lz -lafflib -lpq -lsqlite3 -ldl -lstdc++ libtool: link: ar cru .libs/libtskbase.a .libs/md5c.o .libs/mymalloc.o .libs/sha1c.o .libs/crc.o .libs/tsk_endian.o .libs/tsk_error.o .libs/tsk_list.o .libs/tsk_parse.o .libs/tsk_printf.o .libs/tsk_unicode.o .libs/tsk_version.o .libs/tsk_stack.o .libs/XGetopt.o .libs/tsk_lock.o .libs/tsk_error_win32.o libtool: link: ranlib .libs/libtskbase.a libtool: link: ( cd ".libs" && rm -f "libtskbase.la" && ln -s "../libtskbase.la" "libtskbase.la" ) make[3]: Leaving directory '/tmp/B.Bfe1ra/BUILD/sleuthkit-4.6.7/tsk/base' Making all in img make[3]: Entering directory '/tmp/B.Bfe1ra/BUILD/sleuthkit-4.6.7/tsk/img' /bin/sh ../../libtool --tag=CC --mode=compile i686-pld-linux-gcc -DHAVE_CONFIG_H -I. -I../../tsk -I../.. -I./../.. -pthread -I/usr/local/include -Wall -Wextra -Wno-unused-parameter -O2 -fwrapv -pipe -Wformat -Werror=format-security -gdwarf-4 -fno-debug-types-section -fvar-tracking-assignments -g2 -Wp,-D_FORTIFY_SOURCE=2 -fstack-protector-strong --param=ssp-buffer-size=4 -Werror=trampolines -fomit-frame-pointer -march=i686 -fasynchronous-unwind-tables -mtune=pentium4 -gdwarf-4 -fno-debug-types-section -fvar-tracking-assignments -g2 -MT vmdk.lo -MD -MP -MF .deps/vmdk.Tpo -c -o vmdk.lo vmdk.c libtool: compile: i686-pld-linux-gcc -DHAVE_CONFIG_H -I. -I../../tsk -I../.. -I./../.. -pthread -I/usr/local/include -Wall -Wextra -Wno-unused-parameter -O2 -fwrapv -pipe -Wformat -Werror=format-security -gdwarf-4 -fno-debug-types-section -fvar-tracking-assignments -g2 -Wp,-D_FORTIFY_SOURCE=2 -fstack-protector-strong --param=ssp-buffer-size=4 -Werror=trampolines -fomit-frame-pointer -march=i686 -fasynchronous-unwind-tables -mtune=pentium4 -gdwarf-4 -fno-debug-types-section -fvar-tracking-assignments -g2 -MT vmdk.lo -MD -MP -MF .deps/vmdk.Tpo -c vmdk.c -fPIC -DPIC -o .libs/vmdk.o libtool: compile: i686-pld-linux-gcc -DHAVE_CONFIG_H -I. -I../../tsk -I../.. -I./../.. -pthread -I/usr/local/include -Wall -Wextra -Wno-unused-parameter -O2 -fwrapv -pipe -Wformat -Werror=format-security -gdwarf-4 -fno-debug-types-section -fvar-tracking-assignments -g2 -Wp,-D_FORTIFY_SOURCE=2 -fstack-protector-strong --param=ssp-buffer-size=4 -Werror=trampolines -fomit-frame-pointer -march=i686 -fasynchronous-unwind-tables -mtune=pentium4 -gdwarf-4 -fno-debug-types-section -fvar-tracking-assignments -g2 -MT vmdk.lo -MD -MP -MF .deps/vmdk.Tpo -c vmdk.c -o vmdk.o >/dev/null 2>&1 mv -f .deps/vmdk.Tpo .deps/vmdk.Plo make[3]: Leaving directory '/tmp/B.Bfe1ra/BUILD/sleuthkit-4.6.7/tsk/img' make[3]: Entering directory '/tmp/B.Bfe1ra/BUILD/sleuthkit-4.6.7/tsk/img' /bin/sh ../../libtool --tag=CC --mode=compile i686-pld-linux-gcc -DHAVE_CONFIG_H -I. -I../../tsk -I../.. -I./../.. -pthread -I/usr/local/include -Wall -Wextra -Wno-unused-parameter -O2 -fwrapv -pipe -Wformat -Werror=format-security -gdwarf-4 -fno-debug-types-section -fvar-tracking-assignments -g2 -Wp,-D_FORTIFY_SOURCE=2 -fstack-protector-strong --param=ssp-buffer-size=4 -Werror=trampolines -fomit-frame-pointer -march=i686 -fasynchronous-unwind-tables -mtune=pentium4 -gdwarf-4 -fno-debug-types-section -fvar-tracking-assignments -g2 -MT img_types.lo -MD -MP -MF .deps/img_types.Tpo -c -o img_types.lo img_types.c libtool: compile: i686-pld-linux-gcc -DHAVE_CONFIG_H -I. -I../../tsk -I../.. -I./../.. -pthread -I/usr/local/include -Wall -Wextra -Wno-unused-parameter -O2 -fwrapv -pipe -Wformat -Werror=format-security -gdwarf-4 -fno-debug-types-section -fvar-tracking-assignments -g2 -Wp,-D_FORTIFY_SOURCE=2 -fstack-protector-strong --param=ssp-buffer-size=4 -Werror=trampolines -fomit-frame-pointer -march=i686 -fasynchronous-unwind-tables -mtune=pentium4 -gdwarf-4 -fno-debug-types-section -fvar-tracking-assignments -g2 -MT img_types.lo -MD -MP -MF .deps/img_types.Tpo -c img_types.c -fPIC -DPIC -o .libs/img_types.o libtool: compile: i686-pld-linux-gcc -DHAVE_CONFIG_H -I. -I../../tsk -I../.. -I./../.. -pthread -I/usr/local/include -Wall -Wextra -Wno-unused-parameter -O2 -fwrapv -pipe -Wformat -Werror=format-security -gdwarf-4 -fno-debug-types-section -fvar-tracking-assignments -g2 -Wp,-D_FORTIFY_SOURCE=2 -fstack-protector-strong --param=ssp-buffer-size=4 -Werror=trampolines -fomit-frame-pointer -march=i686 -fasynchronous-unwind-tables -mtune=pentium4 -gdwarf-4 -fno-debug-types-section -fvar-tracking-assignments -g2 -MT img_types.lo -MD -MP -MF .deps/img_types.Tpo -c img_types.c -o img_types.o >/dev/null 2>&1 mv -f .deps/img_types.Tpo .deps/img_types.Plo make[3]: Leaving directory '/tmp/B.Bfe1ra/BUILD/sleuthkit-4.6.7/tsk/img' make[3]: Entering directory '/tmp/B.Bfe1ra/BUILD/sleuthkit-4.6.7/tsk/img' /bin/sh ../../libtool --tag=CC --mode=compile i686-pld-linux-gcc -DHAVE_CONFIG_H -I. -I../../tsk -I../.. -I./../.. -pthread -I/usr/local/include -Wall -Wextra -Wno-unused-parameter -O2 -fwrapv -pipe -Wformat -Werror=format-security -gdwarf-4 -fno-debug-types-section -fvar-tracking-assignments -g2 -Wp,-D_FORTIFY_SOURCE=2 -fstack-protector-strong --param=ssp-buffer-size=4 -Werror=trampolines -fomit-frame-pointer -march=i686 -fasynchronous-unwind-tables -mtune=pentium4 -gdwarf-4 -fno-debug-types-section -fvar-tracking-assignments -g2 -MT vhd.lo -MD -MP -MF .deps/vhd.Tpo -c -o vhd.lo vhd.c libtool: compile: i686-pld-linux-gcc -DHAVE_CONFIG_H -I. -I../../tsk -I../.. -I./../.. -pthread -I/usr/local/include -Wall -Wextra -Wno-unused-parameter -O2 -fwrapv -pipe -Wformat -Werror=format-security -gdwarf-4 -fno-debug-types-section -fvar-tracking-assignments -g2 -Wp,-D_FORTIFY_SOURCE=2 -fstack-protector-strong --param=ssp-buffer-size=4 -Werror=trampolines -fomit-frame-pointer -march=i686 -fasynchronous-unwind-tables -mtune=pentium4 -gdwarf-4 -fno-debug-types-section -fvar-tracking-assignments -g2 -MT vhd.lo -MD -MP -MF .deps/vhd.Tpo -c vhd.c -fPIC -DPIC -o .libs/vhd.o libtool: compile: i686-pld-linux-gcc -DHAVE_CONFIG_H -I. -I../../tsk -I../.. -I./../.. -pthread -I/usr/local/include -Wall -Wextra -Wno-unused-parameter -O2 -fwrapv -pipe -Wformat -Werror=format-security -gdwarf-4 -fno-debug-types-section -fvar-tracking-assignments -g2 -Wp,-D_FORTIFY_SOURCE=2 -fstack-protector-strong --param=ssp-buffer-size=4 -Werror=trampolines -fomit-frame-pointer -march=i686 -fasynchronous-unwind-tables -mtune=pentium4 -gdwarf-4 -fno-debug-types-section -fvar-tracking-assignments -g2 -MT vhd.lo -MD -MP -MF .deps/vhd.Tpo -c vhd.c -o vhd.o >/dev/null 2>&1 mv -f .deps/vhd.Tpo .deps/vhd.Plo make[3]: Leaving directory '/tmp/B.Bfe1ra/BUILD/sleuthkit-4.6.7/tsk/img' make[3]: Entering directory '/tmp/B.Bfe1ra/BUILD/sleuthkit-4.6.7/tsk/img' /bin/sh ../../libtool --tag=CC --mode=compile i686-pld-linux-gcc -DHAVE_CONFIG_H -I. -I../../tsk -I../.. -I./../.. -pthread -I/usr/local/include -Wall -Wextra -Wno-unused-parameter -O2 -fwrapv -pipe -Wformat -Werror=format-security -gdwarf-4 -fno-debug-types-section -fvar-tracking-assignments -g2 -Wp,-D_FORTIFY_SOURCE=2 -fstack-protector-strong --param=ssp-buffer-size=4 -Werror=trampolines -fomit-frame-pointer -march=i686 -fasynchronous-unwind-tables -mtune=pentium4 -gdwarf-4 -fno-debug-types-section -fvar-tracking-assignments -g2 -MT img_io.lo -MD -MP -MF .deps/img_io.Tpo -c -o img_io.lo img_io.c libtool: compile: i686-pld-linux-gcc -DHAVE_CONFIG_H -I. -I../../tsk -I../.. -I./../.. -pthread -I/usr/local/include -Wall -Wextra -Wno-unused-parameter -O2 -fwrapv -pipe -Wformat -Werror=format-security -gdwarf-4 -fno-debug-types-section -fvar-tracking-assignments -g2 -Wp,-D_FORTIFY_SOURCE=2 -fstack-protector-strong --param=ssp-buffer-size=4 -Werror=trampolines -fomit-frame-pointer -march=i686 -fasynchronous-unwind-tables -mtune=pentium4 -gdwarf-4 -fno-debug-types-section -fvar-tracking-assignments -g2 -MT img_io.lo -MD -MP -MF .deps/img_io.Tpo -c img_io.c -fPIC -DPIC -o .libs/img_io.o img_io.c: In function 'tsk_img_read': img_io.c:94:27: warning: comparison is always false due to limited range of data type [-Wtype-limits] if ((TSK_OFF_T) a_len < 0) { ^ libtool: compile: i686-pld-linux-gcc -DHAVE_CONFIG_H -I. -I../../tsk -I../.. -I./../.. -pthread -I/usr/local/include -Wall -Wextra -Wno-unused-parameter -O2 -fwrapv -pipe -Wformat -Werror=format-security -gdwarf-4 -fno-debug-types-section -fvar-tracking-assignments -g2 -Wp,-D_FORTIFY_SOURCE=2 -fstack-protector-strong --param=ssp-buffer-size=4 -Werror=trampolines -fomit-frame-pointer -march=i686 -fasynchronous-unwind-tables -mtune=pentium4 -gdwarf-4 -fno-debug-types-section -fvar-tracking-assignments -g2 -MT img_io.lo -MD -MP -MF .deps/img_io.Tpo -c img_io.c -o img_io.o >/dev/null 2>&1 mv -f .deps/img_io.Tpo .deps/img_io.Plo make[3]: Leaving directory '/tmp/B.Bfe1ra/BUILD/sleuthkit-4.6.7/tsk/img' make[3]: Entering directory '/tmp/B.Bfe1ra/BUILD/sleuthkit-4.6.7/tsk/img' /bin/sh ../../libtool --tag=CC --mode=compile i686-pld-linux-gcc -DHAVE_CONFIG_H -I. -I../../tsk -I../.. -I./../.. -pthread -I/usr/local/include -Wall -Wextra -Wno-unused-parameter -O2 -fwrapv -pipe -Wformat -Werror=format-security -gdwarf-4 -fno-debug-types-section -fvar-tracking-assignments -g2 -Wp,-D_FORTIFY_SOURCE=2 -fstack-protector-strong --param=ssp-buffer-size=4 -Werror=trampolines -fomit-frame-pointer -march=i686 -fasynchronous-unwind-tables -mtune=pentium4 -gdwarf-4 -fno-debug-types-section -fvar-tracking-assignments -g2 -MT mult_files.lo -MD -MP -MF .deps/mult_files.Tpo -c -o mult_files.lo mult_files.c libtool: compile: i686-pld-linux-gcc -DHAVE_CONFIG_H -I. -I../../tsk -I../.. -I./../.. -pthread -I/usr/local/include -Wall -Wextra -Wno-unused-parameter -O2 -fwrapv -pipe -Wformat -Werror=format-security -gdwarf-4 -fno-debug-types-section -fvar-tracking-assignments -g2 -Wp,-D_FORTIFY_SOURCE=2 -fstack-protector-strong --param=ssp-buffer-size=4 -Werror=trampolines -fomit-frame-pointer -march=i686 -fasynchronous-unwind-tables -mtune=pentium4 -gdwarf-4 -fno-debug-types-section -fvar-tracking-assignments -g2 -MT mult_files.lo -MD -MP -MF .deps/mult_files.Tpo -c mult_files.c -fPIC -DPIC -o .libs/mult_files.o libtool: compile: i686-pld-linux-gcc -DHAVE_CONFIG_H -I. -I../../tsk -I../.. -I./../.. -pthread -I/usr/local/include -Wall -Wextra -Wno-unused-parameter -O2 -fwrapv -pipe -Wformat -Werror=format-security -gdwarf-4 -fno-debug-types-section -fvar-tracking-assignments -g2 -Wp,-D_FORTIFY_SOURCE=2 -fstack-protector-strong --param=ssp-buffer-size=4 -Werror=trampolines -fomit-frame-pointer -march=i686 -fasynchronous-unwind-tables -mtune=pentium4 -gdwarf-4 -fno-debug-types-section -fvar-tracking-assignments -g2 -MT mult_files.lo -MD -MP -MF .deps/mult_files.Tpo -c mult_files.c -o mult_files.o >/dev/null 2>&1 mv -f .deps/mult_files.Tpo .deps/mult_files.Plo make[3]: Leaving directory '/tmp/B.Bfe1ra/BUILD/sleuthkit-4.6.7/tsk/img' make[3]: Entering directory '/tmp/B.Bfe1ra/BUILD/sleuthkit-4.6.7/tsk/img' /bin/sh ../../libtool --tag=CC --mode=compile i686-pld-linux-gcc -DHAVE_CONFIG_H -I. -I../../tsk -I../.. -I./../.. -pthread -I/usr/local/include -Wall -Wextra -Wno-unused-parameter -O2 -fwrapv -pipe -Wformat -Werror=format-security -gdwarf-4 -fno-debug-types-section -fvar-tracking-assignments -g2 -Wp,-D_FORTIFY_SOURCE=2 -fstack-protector-strong --param=ssp-buffer-size=4 -Werror=trampolines -fomit-frame-pointer -march=i686 -fasynchronous-unwind-tables -mtune=pentium4 -gdwarf-4 -fno-debug-types-section -fvar-tracking-assignments -g2 -MT aff.lo -MD -MP -MF .deps/aff.Tpo -c -o aff.lo aff.c libtool: compile: i686-pld-linux-gcc -DHAVE_CONFIG_H -I. -I../../tsk -I../.. -I./../.. -pthread -I/usr/local/include -Wall -Wextra -Wno-unused-parameter -O2 -fwrapv -pipe -Wformat -Werror=format-security -gdwarf-4 -fno-debug-types-section -fvar-tracking-assignments -g2 -Wp,-D_FORTIFY_SOURCE=2 -fstack-protector-strong --param=ssp-buffer-size=4 -Werror=trampolines -fomit-frame-pointer -march=i686 -fasynchronous-unwind-tables -mtune=pentium4 -gdwarf-4 -fno-debug-types-section -fvar-tracking-assignments -g2 -MT aff.lo -MD -MP -MF .deps/aff.Tpo -c aff.c -fPIC -DPIC -o .libs/aff.o libtool: compile: i686-pld-linux-gcc -DHAVE_CONFIG_H -I. -I../../tsk -I../.. -I./../.. -pthread -I/usr/local/include -Wall -Wextra -Wno-unused-parameter -O2 -fwrapv -pipe -Wformat -Werror=format-security -gdwarf-4 -fno-debug-types-section -fvar-tracking-assignments -g2 -Wp,-D_FORTIFY_SOURCE=2 -fstack-protector-strong --param=ssp-buffer-size=4 -Werror=trampolines -fomit-frame-pointer -march=i686 -fasynchronous-unwind-tables -mtune=pentium4 -gdwarf-4 -fno-debug-types-section -fvar-tracking-assignments -g2 -MT aff.lo -MD -MP -MF .deps/aff.Tpo -c aff.c -o aff.o >/dev/null 2>&1 mv -f .deps/aff.Tpo .deps/aff.Plo make[3]: Leaving directory '/tmp/B.Bfe1ra/BUILD/sleuthkit-4.6.7/tsk/img' make[3]: Entering directory '/tmp/B.Bfe1ra/BUILD/sleuthkit-4.6.7/tsk/img' /bin/sh ../../libtool --tag=CXX --mode=compile i686-pld-linux-g++ -DHAVE_CONFIG_H -I. -I../../tsk -I../.. -I./../.. -pthread -I/usr/local/include -Wall -Wextra -Wno-unused-parameter -O2 -fwrapv -pipe -Wformat -Werror=format-security -gdwarf-4 -fno-debug-types-section -fvar-tracking-assignments -g2 -Wp,-D_FORTIFY_SOURCE=2 -fstack-protector-strong --param=ssp-buffer-size=4 -Werror=trampolines -fomit-frame-pointer -march=i686 -fasynchronous-unwind-tables -mtune=pentium4 -gdwarf-4 -fno-debug-types-section -fvar-tracking-assignments -g2 -MT ewf.lo -MD -MP -MF .deps/ewf.Tpo -c -o ewf.lo ewf.cpp libtool: compile: i686-pld-linux-g++ -DHAVE_CONFIG_H -I. -I../../tsk -I../.. -I./../.. -pthread -I/usr/local/include -Wall -Wextra -Wno-unused-parameter -O2 -fwrapv -pipe -Wformat -Werror=format-security -gdwarf-4 -fno-debug-types-section -fvar-tracking-assignments -g2 -Wp,-D_FORTIFY_SOURCE=2 -fstack-protector-strong --param=ssp-buffer-size=4 -Werror=trampolines -fomit-frame-pointer -march=i686 -fasynchronous-unwind-tables -mtune=pentium4 -gdwarf-4 -fno-debug-types-section -fvar-tracking-assignments -g2 -MT ewf.lo -MD -MP -MF .deps/ewf.Tpo -c ewf.cpp -fPIC -DPIC -o .libs/ewf.o ewf.cpp: In function 'ssize_t ewf_image_read(TSK_IMG_INFO*, TSK_OFF_T, char*, size_t)': ewf.cpp:70:11: error: 'libewf_handle_read_random' was not declared in this scope cnt = libewf_handle_read_random(ewf_info->handle, ^~~~~~~~~~~~~~~~~~~~~~~~~ ewf.cpp:70:11: note: suggested alternative: 'libewf_handle_read_buffer' cnt = libewf_handle_read_random(ewf_info->handle, ^~~~~~~~~~~~~~~~~~~~~~~~~ libewf_handle_read_buffer make[3]: *** [Makefile:444: ewf.lo] Error 1 make[3]: Leaving directory '/tmp/B.Bfe1ra/BUILD/sleuthkit-4.6.7/tsk/img' make[3]: *** Waiting for unfinished jobs.... make[3]: Entering directory '/tmp/B.Bfe1ra/BUILD/sleuthkit-4.6.7/tsk/img' /bin/sh ../../libtool --tag=CXX --mode=compile i686-pld-linux-g++ -DHAVE_CONFIG_H -I. -I../../tsk -I../.. -I./../.. -pthread -I/usr/local/include -Wall -Wextra -Wno-unused-parameter -O2 -fwrapv -pipe -Wformat -Werror=format-security -gdwarf-4 -fno-debug-types-section -fvar-tracking-assignments -g2 -Wp,-D_FORTIFY_SOURCE=2 -fstack-protector-strong --param=ssp-buffer-size=4 -Werror=trampolines -fomit-frame-pointer -march=i686 -fasynchronous-unwind-tables -mtune=pentium4 -gdwarf-4 -fno-debug-types-section -fvar-tracking-assignments -g2 -MT img_writer.lo -MD -MP -MF .deps/img_writer.Tpo -c -o img_writer.lo img_writer.cpp libtool: compile: i686-pld-linux-g++ -DHAVE_CONFIG_H -I. -I../../tsk -I../.. -I./../.. -pthread -I/usr/local/include -Wall -Wextra -Wno-unused-parameter -O2 -fwrapv -pipe -Wformat -Werror=format-security -gdwarf-4 -fno-debug-types-section -fvar-tracking-assignments -g2 -Wp,-D_FORTIFY_SOURCE=2 -fstack-protector-strong --param=ssp-buffer-size=4 -Werror=trampolines -fomit-frame-pointer -march=i686 -fasynchronous-unwind-tables -mtune=pentium4 -gdwarf-4 -fno-debug-types-section -fvar-tracking-assignments -g2 -MT img_writer.lo -MD -MP -MF .deps/img_writer.Tpo -c img_writer.cpp -fPIC -DPIC -o .libs/img_writer.o libtool: compile: i686-pld-linux-g++ -DHAVE_CONFIG_H -I. -I../../tsk -I../.. -I./../.. -pthread -I/usr/local/include -Wall -Wextra -Wno-unused-parameter -O2 -fwrapv -pipe -Wformat -Werror=format-security -gdwarf-4 -fno-debug-types-section -fvar-tracking-assignments -g2 -Wp,-D_FORTIFY_SOURCE=2 -fstack-protector-strong --param=ssp-buffer-size=4 -Werror=trampolines -fomit-frame-pointer -march=i686 -fasynchronous-unwind-tables -mtune=pentium4 -gdwarf-4 -fno-debug-types-section -fvar-tracking-assignments -g2 -MT img_writer.lo -MD -MP -MF .deps/img_writer.Tpo -c img_writer.cpp -o img_writer.o >/dev/null 2>&1 mv -f .deps/img_writer.Tpo .deps/img_writer.Plo make[3]: Leaving directory '/tmp/B.Bfe1ra/BUILD/sleuthkit-4.6.7/tsk/img' make[3]: Entering directory '/tmp/B.Bfe1ra/BUILD/sleuthkit-4.6.7/tsk/img' /bin/sh ../../libtool --tag=CC --mode=compile i686-pld-linux-gcc -DHAVE_CONFIG_H -I. -I../../tsk -I../.. -I./../.. -pthread -I/usr/local/include -Wall -Wextra -Wno-unused-parameter -O2 -fwrapv -pipe -Wformat -Werror=format-security -gdwarf-4 -fno-debug-types-section -fvar-tracking-assignments -g2 -Wp,-D_FORTIFY_SOURCE=2 -fstack-protector-strong --param=ssp-buffer-size=4 -Werror=trampolines -fomit-frame-pointer -march=i686 -fasynchronous-unwind-tables -mtune=pentium4 -gdwarf-4 -fno-debug-types-section -fvar-tracking-assignments -g2 -MT raw.lo -MD -MP -MF .deps/raw.Tpo -c -o raw.lo raw.c libtool: compile: i686-pld-linux-gcc -DHAVE_CONFIG_H -I. -I../../tsk -I../.. -I./../.. -pthread -I/usr/local/include -Wall -Wextra -Wno-unused-parameter -O2 -fwrapv -pipe -Wformat -Werror=format-security -gdwarf-4 -fno-debug-types-section -fvar-tracking-assignments -g2 -Wp,-D_FORTIFY_SOURCE=2 -fstack-protector-strong --param=ssp-buffer-size=4 -Werror=trampolines -fomit-frame-pointer -march=i686 -fasynchronous-unwind-tables -mtune=pentium4 -gdwarf-4 -fno-debug-types-section -fvar-tracking-assignments -g2 -MT raw.lo -MD -MP -MF .deps/raw.Tpo -c raw.c -fPIC -DPIC -o .libs/raw.o libtool: compile: i686-pld-linux-gcc -DHAVE_CONFIG_H -I. -I../../tsk -I../.. -I./../.. -pthread -I/usr/local/include -Wall -Wextra -Wno-unused-parameter -O2 -fwrapv -pipe -Wformat -Werror=format-security -gdwarf-4 -fno-debug-types-section -fvar-tracking-assignments -g2 -Wp,-D_FORTIFY_SOURCE=2 -fstack-protector-strong --param=ssp-buffer-size=4 -Werror=trampolines -fomit-frame-pointer -march=i686 -fasynchronous-unwind-tables -mtune=pentium4 -gdwarf-4 -fno-debug-types-section -fvar-tracking-assignments -g2 -MT raw.lo -MD -MP -MF .deps/raw.Tpo -c raw.c -o raw.o >/dev/null 2>&1 mv -f .deps/raw.Tpo .deps/raw.Plo make[3]: Leaving directory '/tmp/B.Bfe1ra/BUILD/sleuthkit-4.6.7/tsk/img' make[3]: Entering directory '/tmp/B.Bfe1ra/BUILD/sleuthkit-4.6.7/tsk/img' /bin/sh ../../libtool --tag=CXX --mode=compile i686-pld-linux-g++ -DHAVE_CONFIG_H -I. -I../../tsk -I../.. -I./../.. -pthread -I/usr/local/include -Wall -Wextra -Wno-unused-parameter -O2 -fwrapv -pipe -Wformat -Werror=format-security -gdwarf-4 -fno-debug-types-section -fvar-tracking-assignments -g2 -Wp,-D_FORTIFY_SOURCE=2 -fstack-protector-strong --param=ssp-buffer-size=4 -Werror=trampolines -fomit-frame-pointer -march=i686 -fasynchronous-unwind-tables -mtune=pentium4 -gdwarf-4 -fno-debug-types-section -fvar-tracking-assignments -g2 -MT img_open.lo -MD -MP -MF .deps/img_open.Tpo -c -o img_open.lo img_open.cpp libtool: compile: i686-pld-linux-g++ -DHAVE_CONFIG_H -I. -I../../tsk -I../.. -I./../.. -pthread -I/usr/local/include -Wall -Wextra -Wno-unused-parameter -O2 -fwrapv -pipe -Wformat -Werror=format-security -gdwarf-4 -fno-debug-types-section -fvar-tracking-assignments -g2 -Wp,-D_FORTIFY_SOURCE=2 -fstack-protector-strong --param=ssp-buffer-size=4 -Werror=trampolines -fomit-frame-pointer -march=i686 -fasynchronous-unwind-tables -mtune=pentium4 -gdwarf-4 -fno-debug-types-section -fvar-tracking-assignments -g2 -MT img_open.lo -MD -MP -MF .deps/img_open.Tpo -c img_open.cpp -fPIC -DPIC -o .libs/img_open.o libtool: compile: i686-pld-linux-g++ -DHAVE_CONFIG_H -I. -I../../tsk -I../.. -I./../.. -pthread -I/usr/local/include -Wall -Wextra -Wno-unused-parameter -O2 -fwrapv -pipe -Wformat -Werror=format-security -gdwarf-4 -fno-debug-types-section -fvar-tracking-assignments -g2 -Wp,-D_FORTIFY_SOURCE=2 -fstack-protector-strong --param=ssp-buffer-size=4 -Werror=trampolines -fomit-frame-pointer -march=i686 -fasynchronous-unwind-tables -mtune=pentium4 -gdwarf-4 -fno-debug-types-section -fvar-tracking-assignments -g2 -MT img_open.lo -MD -MP -MF .deps/img_open.Tpo -c img_open.cpp -o img_open.o >/dev/null 2>&1 mv -f .deps/img_open.Tpo .deps/img_open.Plo make[3]: Leaving directory '/tmp/B.Bfe1ra/BUILD/sleuthkit-4.6.7/tsk/img' make[2]: *** [Makefile:510: all-recursive] Error 1 make[1]: *** [Makefile:405: all] Error 2 make: *** [Makefile:572: all-recursive] Error 1 error: Bad exit status from /tmp/B.Bfe1ra/BUILD/tmp/rpm-tmp.83437 (%build) RPM build errors: Bad exit status from /tmp/B.Bfe1ra/BUILD/tmp/rpm-tmp.83437 (%build) ended at: Tue Aug 6 10:02:11 2019, done in 0:00:11.784819 error: No files produced. + chmod -R u+rwX /tmp/B.Bfe1ra/BUILD + rm -rf /tmp/B.Bfe1ra/tmp /tmp/B.Bfe1ra/BUILD + rm -rf /tmp/B.Bfe1ra Begin-PLD-Builder-Info Build-Time: user:19.72s sys:3.96s real:31.72s (faults io:1 non-io:1654842) End-PLD-Builder-Info
[Back to list of logs] [View rpm -qa of builder]