FailedOk

th/SRPMS[OK]
th/x32[OK]
th/i686[OK]
th/x86_64[OK]

ac/SRPMS[OK]
ac/i386[OK]
ac/i586[OK]
ac/i686[OK]
ac/alpha[OK]
ac/amd64[OK]
ac/athlon[OK]
ac/ppc[OK]
ac/sparc[OK]
ac/sparc64[OK]

Advanced Search
main()
Powered by PLD Linux
(c) 2002-2020 PLD Team
$Revision: 1.37 $
Powered by foobarbaz.
Your IP: 34.204.176.125

sleuthkit 78ed7f88-7788-4811-8a2e-9cce325c10d7

Status:Failed
Source URL:https://buildlogs.pld-linux.org/pld/th/i686/FAIL/sleuthkit,78ed7f88-7788-4811-8a2e-9cce325c10d7.bz2
text/plain URL:View!
full text:View!
rpm -qa of builder:View!
Date:2020/03/27 23:09:27
Runtime:0:00:12.003259

Toc:

  • error 1
  • ewf.cpp:70:11: error: 'libewf_handle_read_random' was not declared in this scope; did you mean 'libewf_handle_read_buffer'?
  • error 2
  • make[3]: *** [Makefile:444: ewf.lo] Error 1
  • error 3
  • make[2]: *** [Makefile:510: all-recursive] Error 1
  • error 4
  • make[1]: *** [Makefile:405: all] Error 2
  • error 5
  • error: Bad exit status from /tmp/B.ZS2I1a/BUILD/tmp/rpm-tmp.10156 (%build)
  • error 6
  • RPM build errors:
  • error 7
  • error: No files produced.

Content:

      |             ~~~^~~~~
tsk_unicode.c:348:9: note: here
  348 |         case 1:
      |         ^~~~
tsk_unicode.c: In function 'tsk_UTF16WtoUTF8_lclorder':
tsk_unicode.c:441:16: warning: this statement may fall through [-Wimplicit-fallthrough=]
  441 |             ch >>= 6;
      |             ~~~^~~~~
tsk_unicode.c:442:9: note: here
  442 |         case 3:
      |         ^~~~
tsk_unicode.c:444:16: warning: this statement may fall through [-Wimplicit-fallthrough=]
  444 |             ch >>= 6;
      |             ~~~^~~~~
tsk_unicode.c:445:9: note: here
  445 |         case 2:
      |         ^~~~
tsk_unicode.c:447:16: warning: this statement may fall through [-Wimplicit-fallthrough=]
  447 |             ch >>= 6;
      |             ~~~^~~~~
tsk_unicode.c:448:9: note: here
  448 |         case 1:
      |         ^~~~
tsk_unicode.c: In function 'isLegalUTF8':
tsk_unicode.c:481:38: warning: this statement may fall through [-Wimplicit-fallthrough=]
  481 |         if ((a = (*--srcptr)) < 0x80 || a > 0xBF)
      |             ~~~~~~~~~~~~~~~~~~~~~~~~~^~~~~~~~~~~
tsk_unicode.c:483:5: note: here
  483 |     case 3:
      |     ^~~~
tsk_unicode.c:484:38: warning: this statement may fall through [-Wimplicit-fallthrough=]
  484 |         if ((a = (*--srcptr)) < 0x80 || a > 0xBF)
      |             ~~~~~~~~~~~~~~~~~~~~~~~~~^~~~~~~~~~~
tsk_unicode.c:486:5: note: here
  486 |     case 2:
      |     ^~~~
tsk_unicode.c:490:9: warning: this statement may fall through [-Wimplicit-fallthrough=]
  490 |         switch (*source) {
      |         ^~~~~~
tsk_unicode.c:513:5: note: here
  513 |     case 1:
      |     ^~~~
tsk_unicode.c: In function 'tsk_UTF8toUTF16':
tsk_unicode.c:609:16: warning: this statement may fall through [-Wimplicit-fallthrough=]
  609 |             ch <<= 6;           /* remember, illegal UTF-8 */
      |             ~~~^~~~~
tsk_unicode.c:610:9: note: here
  610 |         case 4:
      |         ^~~~
tsk_unicode.c:612:16: warning: this statement may fall through [-Wimplicit-fallthrough=]
  612 |             ch <<= 6;           /* remember, illegal UTF-8 */
      |             ~~~^~~~~
tsk_unicode.c:613:9: note: here
  613 |         case 3:
      |         ^~~~
tsk_unicode.c:615:16: warning: this statement may fall through [-Wimplicit-fallthrough=]
  615 |             ch <<= 6;
      |             ~~~^~~~~
tsk_unicode.c:616:9: note: here
  616 |         case 2:
      |         ^~~~
tsk_unicode.c:618:16: warning: this statement may fall through [-Wimplicit-fallthrough=]
  618 |             ch <<= 6;
      |             ~~~^~~~~
tsk_unicode.c:619:9: note: here
  619 |         case 1:
      |         ^~~~
tsk_unicode.c:621:16: warning: this statement may fall through [-Wimplicit-fallthrough=]
  621 |             ch <<= 6;
      |             ~~~^~~~~
tsk_unicode.c:622:9: note: here
  622 |         case 0:
      |         ^~~~
libtool: compile:  i686-pld-linux-gcc -DHAVE_CONFIG_H -I. -I../../tsk -I../.. -pthread -I/usr/local/include -Wall -Wextra -Wno-unused-parameter -O2 -fwrapv -pipe -Wformat -Werror=format-security -gdwarf-4 -fno-debug-types-section -fvar-tracking-assignments -g2 -Wp,-D_FORTIFY_SOURCE=2 -fstack-protector-strong --param=ssp-buffer-size=4 -Werror=trampolines -fomit-frame-pointer -march=i686 -fasynchronous-unwind-tables -mtune=pentium4 -gdwarf-4 -fno-debug-types-section -fvar-tracking-assignments -g2 -MT tsk_unicode.lo -MD -MP -MF .deps/tsk_unicode.Tpo -c tsk_unicode.c -o tsk_unicode.o >/dev/null 2>&1
mv -f .deps/tsk_unicode.Tpo .deps/tsk_unicode.Plo
make[3]: Leaving directory '/tmp/B.ZS2I1a/BUILD/sleuthkit-4.6.7/tsk/base'
make[3]: Entering directory '/tmp/B.ZS2I1a/BUILD/sleuthkit-4.6.7/tsk/base'
/bin/sh ../../libtool  --tag=CC   --mode=compile i686-pld-linux-gcc -DHAVE_CONFIG_H -I. -I../../tsk  -I../.. -pthread -I/usr/local/include -Wall -Wextra -Wno-unused-parameter -O2 -fwrapv -pipe -Wformat -Werror=format-security -gdwarf-4 -fno-debug-types-section -fvar-tracking-assignments -g2 -Wp,-D_FORTIFY_SOURCE=2 -fstack-protector-strong --param=ssp-buffer-size=4 -Werror=trampolines -fomit-frame-pointer -march=i686 -fasynchronous-unwind-tables -mtune=pentium4 -gdwarf-4 -fno-debug-types-section -fvar-tracking-assignments -g2  -MT sha1c.lo -MD -MP -MF .deps/sha1c.Tpo -c -o sha1c.lo sha1c.c
libtool: compile:  i686-pld-linux-gcc -DHAVE_CONFIG_H -I. -I../../tsk -I../.. -pthread -I/usr/local/include -Wall -Wextra -Wno-unused-parameter -O2 -fwrapv -pipe -Wformat -Werror=format-security -gdwarf-4 -fno-debug-types-section -fvar-tracking-assignments -g2 -Wp,-D_FORTIFY_SOURCE=2 -fstack-protector-strong --param=ssp-buffer-size=4 -Werror=trampolines -fomit-frame-pointer -march=i686 -fasynchronous-unwind-tables -mtune=pentium4 -gdwarf-4 -fno-debug-types-section -fvar-tracking-assignments -g2 -MT sha1c.lo -MD -MP -MF .deps/sha1c.Tpo -c sha1c.c  -fPIC -DPIC -o .libs/sha1c.o
libtool: compile:  i686-pld-linux-gcc -DHAVE_CONFIG_H -I. -I../../tsk -I../.. -pthread -I/usr/local/include -Wall -Wextra -Wno-unused-parameter -O2 -fwrapv -pipe -Wformat -Werror=format-security -gdwarf-4 -fno-debug-types-section -fvar-tracking-assignments -g2 -Wp,-D_FORTIFY_SOURCE=2 -fstack-protector-strong --param=ssp-buffer-size=4 -Werror=trampolines -fomit-frame-pointer -march=i686 -fasynchronous-unwind-tables -mtune=pentium4 -gdwarf-4 -fno-debug-types-section -fvar-tracking-assignments -g2 -MT sha1c.lo -MD -MP -MF .deps/sha1c.Tpo -c sha1c.c -o sha1c.o >/dev/null 2>&1
mv -f .deps/sha1c.Tpo .deps/sha1c.Plo
make[3]: Leaving directory '/tmp/B.ZS2I1a/BUILD/sleuthkit-4.6.7/tsk/base'
make[3]: Entering directory '/tmp/B.ZS2I1a/BUILD/sleuthkit-4.6.7/tsk/base'
/bin/sh ../../libtool  --tag=CXX   --mode=link i686-pld-linux-g++ -Wall -Wextra -Wno-unused-parameter -O2 -fwrapv -pipe -Wformat -Werror=format-security -gdwarf-4 -fno-debug-types-section -fvar-tracking-assignments -g2 -Wp,-D_FORTIFY_SOURCE=2 -fstack-protector-strong --param=ssp-buffer-size=4 -Werror=trampolines -fomit-frame-pointer -march=i686 -fasynchronous-unwind-tables -mtune=pentium4 -gdwarf-4 -fno-debug-types-section -fvar-tracking-assignments -g2   -Wl,--as-needed -Wl,--no-copy-dt-needed-entries -Wl,-z,relro -Wl,-z,combreloc  -pthread -L/usr/local/lib -o libtskbase.la  md5c.lo mymalloc.lo sha1c.lo crc.lo tsk_endian.lo tsk_error.lo tsk_list.lo tsk_parse.lo tsk_printf.lo tsk_unicode.lo tsk_version.lo tsk_stack.lo XGetopt.lo tsk_lock.lo tsk_error_win32.lo  -lewf -ldl -lz -lafflib -lpq -lsqlite3 -ldl -lstdc++ 
libtool: link: ar cru .libs/libtskbase.a .libs/md5c.o .libs/mymalloc.o .libs/sha1c.o .libs/crc.o .libs/tsk_endian.o .libs/tsk_error.o .libs/tsk_list.o .libs/tsk_parse.o .libs/tsk_printf.o .libs/tsk_unicode.o .libs/tsk_version.o .libs/tsk_stack.o .libs/XGetopt.o .libs/tsk_lock.o .libs/tsk_error_win32.o 
libtool: link: ranlib .libs/libtskbase.a
libtool: link: ( cd ".libs" && rm -f "libtskbase.la" && ln -s "../libtskbase.la" "libtskbase.la" )
make[3]: Leaving directory '/tmp/B.ZS2I1a/BUILD/sleuthkit-4.6.7/tsk/base'
Making all in img
make[3]: Entering directory '/tmp/B.ZS2I1a/BUILD/sleuthkit-4.6.7/tsk/img'
/bin/sh ../../libtool  --tag=CC   --mode=compile i686-pld-linux-gcc -DHAVE_CONFIG_H -I. -I../../tsk  -I../.. -I./../.. -pthread -I/usr/local/include -Wall -Wextra -Wno-unused-parameter -O2 -fwrapv -pipe -Wformat -Werror=format-security -gdwarf-4 -fno-debug-types-section -fvar-tracking-assignments -g2 -Wp,-D_FORTIFY_SOURCE=2 -fstack-protector-strong --param=ssp-buffer-size=4 -Werror=trampolines -fomit-frame-pointer -march=i686 -fasynchronous-unwind-tables -mtune=pentium4 -gdwarf-4 -fno-debug-types-section -fvar-tracking-assignments -g2  -MT vhd.lo -MD -MP -MF .deps/vhd.Tpo -c -o vhd.lo vhd.c
libtool: compile:  i686-pld-linux-gcc -DHAVE_CONFIG_H -I. -I../../tsk -I../.. -I./../.. -pthread -I/usr/local/include -Wall -Wextra -Wno-unused-parameter -O2 -fwrapv -pipe -Wformat -Werror=format-security -gdwarf-4 -fno-debug-types-section -fvar-tracking-assignments -g2 -Wp,-D_FORTIFY_SOURCE=2 -fstack-protector-strong --param=ssp-buffer-size=4 -Werror=trampolines -fomit-frame-pointer -march=i686 -fasynchronous-unwind-tables -mtune=pentium4 -gdwarf-4 -fno-debug-types-section -fvar-tracking-assignments -g2 -MT vhd.lo -MD -MP -MF .deps/vhd.Tpo -c vhd.c  -fPIC -DPIC -o .libs/vhd.o
libtool: compile:  i686-pld-linux-gcc -DHAVE_CONFIG_H -I. -I../../tsk -I../.. -I./../.. -pthread -I/usr/local/include -Wall -Wextra -Wno-unused-parameter -O2 -fwrapv -pipe -Wformat -Werror=format-security -gdwarf-4 -fno-debug-types-section -fvar-tracking-assignments -g2 -Wp,-D_FORTIFY_SOURCE=2 -fstack-protector-strong --param=ssp-buffer-size=4 -Werror=trampolines -fomit-frame-pointer -march=i686 -fasynchronous-unwind-tables -mtune=pentium4 -gdwarf-4 -fno-debug-types-section -fvar-tracking-assignments -g2 -MT vhd.lo -MD -MP -MF .deps/vhd.Tpo -c vhd.c -o vhd.o >/dev/null 2>&1
mv -f .deps/vhd.Tpo .deps/vhd.Plo
make[3]: Leaving directory '/tmp/B.ZS2I1a/BUILD/sleuthkit-4.6.7/tsk/img'
make[3]: Entering directory '/tmp/B.ZS2I1a/BUILD/sleuthkit-4.6.7/tsk/img'
/bin/sh ../../libtool  --tag=CXX   --mode=compile i686-pld-linux-g++ -DHAVE_CONFIG_H -I. -I../../tsk  -I../.. -I./../.. -pthread -I/usr/local/include -Wall -Wextra -Wno-unused-parameter -O2 -fwrapv -pipe -Wformat -Werror=format-security -gdwarf-4 -fno-debug-types-section -fvar-tracking-assignments -g2 -Wp,-D_FORTIFY_SOURCE=2 -fstack-protector-strong --param=ssp-buffer-size=4 -Werror=trampolines -fomit-frame-pointer -march=i686 -fasynchronous-unwind-tables -mtune=pentium4 -gdwarf-4 -fno-debug-types-section -fvar-tracking-assignments -g2  -MT ewf.lo -MD -MP -MF .deps/ewf.Tpo -c -o ewf.lo ewf.cpp
libtool: compile:  i686-pld-linux-g++ -DHAVE_CONFIG_H -I. -I../../tsk -I../.. -I./../.. -pthread -I/usr/local/include -Wall -Wextra -Wno-unused-parameter -O2 -fwrapv -pipe -Wformat -Werror=format-security -gdwarf-4 -fno-debug-types-section -fvar-tracking-assignments -g2 -Wp,-D_FORTIFY_SOURCE=2 -fstack-protector-strong --param=ssp-buffer-size=4 -Werror=trampolines -fomit-frame-pointer -march=i686 -fasynchronous-unwind-tables -mtune=pentium4 -gdwarf-4 -fno-debug-types-section -fvar-tracking-assignments -g2 -MT ewf.lo -MD -MP -MF .deps/ewf.Tpo -c ewf.cpp  -fPIC -DPIC -o .libs/ewf.o
ewf.cpp: In function 'ssize_t ewf_image_read(TSK_IMG_INFO*, TSK_OFF_T, char*, size_t)':
ewf.cpp:70:11: error: 'libewf_handle_read_random' was not declared in this scope; did you mean 'libewf_handle_read_buffer'?
   70 |     cnt = libewf_handle_read_random(ewf_info->handle,
      |           ^~~~~~~~~~~~~~~~~~~~~~~~~
      |           libewf_handle_read_buffer
make[3]: *** [Makefile:444: ewf.lo] Error 1
make[3]: Leaving directory '/tmp/B.ZS2I1a/BUILD/sleuthkit-4.6.7/tsk/img'
make[3]: *** Waiting for unfinished jobs....
make[3]: Entering directory '/tmp/B.ZS2I1a/BUILD/sleuthkit-4.6.7/tsk/img'
/bin/sh ../../libtool  --tag=CC   --mode=compile i686-pld-linux-gcc -DHAVE_CONFIG_H -I. -I../../tsk  -I../.. -I./../.. -pthread -I/usr/local/include -Wall -Wextra -Wno-unused-parameter -O2 -fwrapv -pipe -Wformat -Werror=format-security -gdwarf-4 -fno-debug-types-section -fvar-tracking-assignments -g2 -Wp,-D_FORTIFY_SOURCE=2 -fstack-protector-strong --param=ssp-buffer-size=4 -Werror=trampolines -fomit-frame-pointer -march=i686 -fasynchronous-unwind-tables -mtune=pentium4 -gdwarf-4 -fno-debug-types-section -fvar-tracking-assignments -g2  -MT img_types.lo -MD -MP -MF .deps/img_types.Tpo -c -o img_types.lo img_types.c
libtool: compile:  i686-pld-linux-gcc -DHAVE_CONFIG_H -I. -I../../tsk -I../.. -I./../.. -pthread -I/usr/local/include -Wall -Wextra -Wno-unused-parameter -O2 -fwrapv -pipe -Wformat -Werror=format-security -gdwarf-4 -fno-debug-types-section -fvar-tracking-assignments -g2 -Wp,-D_FORTIFY_SOURCE=2 -fstack-protector-strong --param=ssp-buffer-size=4 -Werror=trampolines -fomit-frame-pointer -march=i686 -fasynchronous-unwind-tables -mtune=pentium4 -gdwarf-4 -fno-debug-types-section -fvar-tracking-assignments -g2 -MT img_types.lo -MD -MP -MF .deps/img_types.Tpo -c img_types.c  -fPIC -DPIC -o .libs/img_types.o
libtool: compile:  i686-pld-linux-gcc -DHAVE_CONFIG_H -I. -I../../tsk -I../.. -I./../.. -pthread -I/usr/local/include -Wall -Wextra -Wno-unused-parameter -O2 -fwrapv -pipe -Wformat -Werror=format-security -gdwarf-4 -fno-debug-types-section -fvar-tracking-assignments -g2 -Wp,-D_FORTIFY_SOURCE=2 -fstack-protector-strong --param=ssp-buffer-size=4 -Werror=trampolines -fomit-frame-pointer -march=i686 -fasynchronous-unwind-tables -mtune=pentium4 -gdwarf-4 -fno-debug-types-section -fvar-tracking-assignments -g2 -MT img_types.lo -MD -MP -MF .deps/img_types.Tpo -c img_types.c -o img_types.o >/dev/null 2>&1
mv -f .deps/img_types.Tpo .deps/img_types.Plo
make[3]: Leaving directory '/tmp/B.ZS2I1a/BUILD/sleuthkit-4.6.7/tsk/img'
make[3]: Entering directory '/tmp/B.ZS2I1a/BUILD/sleuthkit-4.6.7/tsk/img'
/bin/sh ../../libtool  --tag=CC   --mode=compile i686-pld-linux-gcc -DHAVE_CONFIG_H -I. -I../../tsk  -I../.. -I./../.. -pthread -I/usr/local/include -Wall -Wextra -Wno-unused-parameter -O2 -fwrapv -pipe -Wformat -Werror=format-security -gdwarf-4 -fno-debug-types-section -fvar-tracking-assignments -g2 -Wp,-D_FORTIFY_SOURCE=2 -fstack-protector-strong --param=ssp-buffer-size=4 -Werror=trampolines -fomit-frame-pointer -march=i686 -fasynchronous-unwind-tables -mtune=pentium4 -gdwarf-4 -fno-debug-types-section -fvar-tracking-assignments -g2  -MT vmdk.lo -MD -MP -MF .deps/vmdk.Tpo -c -o vmdk.lo vmdk.c
libtool: compile:  i686-pld-linux-gcc -DHAVE_CONFIG_H -I. -I../../tsk -I../.. -I./../.. -pthread -I/usr/local/include -Wall -Wextra -Wno-unused-parameter -O2 -fwrapv -pipe -Wformat -Werror=format-security -gdwarf-4 -fno-debug-types-section -fvar-tracking-assignments -g2 -Wp,-D_FORTIFY_SOURCE=2 -fstack-protector-strong --param=ssp-buffer-size=4 -Werror=trampolines -fomit-frame-pointer -march=i686 -fasynchronous-unwind-tables -mtune=pentium4 -gdwarf-4 -fno-debug-types-section -fvar-tracking-assignments -g2 -MT vmdk.lo -MD -MP -MF .deps/vmdk.Tpo -c vmdk.c  -fPIC -DPIC -o .libs/vmdk.o
libtool: compile:  i686-pld-linux-gcc -DHAVE_CONFIG_H -I. -I../../tsk -I../.. -I./../.. -pthread -I/usr/local/include -Wall -Wextra -Wno-unused-parameter -O2 -fwrapv -pipe -Wformat -Werror=format-security -gdwarf-4 -fno-debug-types-section -fvar-tracking-assignments -g2 -Wp,-D_FORTIFY_SOURCE=2 -fstack-protector-strong --param=ssp-buffer-size=4 -Werror=trampolines -fomit-frame-pointer -march=i686 -fasynchronous-unwind-tables -mtune=pentium4 -gdwarf-4 -fno-debug-types-section -fvar-tracking-assignments -g2 -MT vmdk.lo -MD -MP -MF .deps/vmdk.Tpo -c vmdk.c -o vmdk.o >/dev/null 2>&1
mv -f .deps/vmdk.Tpo .deps/vmdk.Plo
make[3]: Leaving directory '/tmp/B.ZS2I1a/BUILD/sleuthkit-4.6.7/tsk/img'
make[3]: Entering directory '/tmp/B.ZS2I1a/BUILD/sleuthkit-4.6.7/tsk/img'
/bin/sh ../../libtool  --tag=CC   --mode=compile i686-pld-linux-gcc -DHAVE_CONFIG_H -I. -I../../tsk  -I../.. -I./../.. -pthread -I/usr/local/include -Wall -Wextra -Wno-unused-parameter -O2 -fwrapv -pipe -Wformat -Werror=format-security -gdwarf-4 -fno-debug-types-section -fvar-tracking-assignments -g2 -Wp,-D_FORTIFY_SOURCE=2 -fstack-protector-strong --param=ssp-buffer-size=4 -Werror=trampolines -fomit-frame-pointer -march=i686 -fasynchronous-unwind-tables -mtune=pentium4 -gdwarf-4 -fno-debug-types-section -fvar-tracking-assignments -g2  -MT mult_files.lo -MD -MP -MF .deps/mult_files.Tpo -c -o mult_files.lo mult_files.c
libtool: compile:  i686-pld-linux-gcc -DHAVE_CONFIG_H -I. -I../../tsk -I../.. -I./../.. -pthread -I/usr/local/include -Wall -Wextra -Wno-unused-parameter -O2 -fwrapv -pipe -Wformat -Werror=format-security -gdwarf-4 -fno-debug-types-section -fvar-tracking-assignments -g2 -Wp,-D_FORTIFY_SOURCE=2 -fstack-protector-strong --param=ssp-buffer-size=4 -Werror=trampolines -fomit-frame-pointer -march=i686 -fasynchronous-unwind-tables -mtune=pentium4 -gdwarf-4 -fno-debug-types-section -fvar-tracking-assignments -g2 -MT mult_files.lo -MD -MP -MF .deps/mult_files.Tpo -c mult_files.c  -fPIC -DPIC -o .libs/mult_files.o
libtool: compile:  i686-pld-linux-gcc -DHAVE_CONFIG_H -I. -I../../tsk -I../.. -I./../.. -pthread -I/usr/local/include -Wall -Wextra -Wno-unused-parameter -O2 -fwrapv -pipe -Wformat -Werror=format-security -gdwarf-4 -fno-debug-types-section -fvar-tracking-assignments -g2 -Wp,-D_FORTIFY_SOURCE=2 -fstack-protector-strong --param=ssp-buffer-size=4 -Werror=trampolines -fomit-frame-pointer -march=i686 -fasynchronous-unwind-tables -mtune=pentium4 -gdwarf-4 -fno-debug-types-section -fvar-tracking-assignments -g2 -MT mult_files.lo -MD -MP -MF .deps/mult_files.Tpo -c mult_files.c -o mult_files.o >/dev/null 2>&1
mv -f .deps/mult_files.Tpo .deps/mult_files.Plo
make[3]: Leaving directory '/tmp/B.ZS2I1a/BUILD/sleuthkit-4.6.7/tsk/img'
make[3]: Entering directory '/tmp/B.ZS2I1a/BUILD/sleuthkit-4.6.7/tsk/img'
/bin/sh ../../libtool  --tag=CC   --mode=compile i686-pld-linux-gcc -DHAVE_CONFIG_H -I. -I../../tsk  -I../.. -I./../.. -pthread -I/usr/local/include -Wall -Wextra -Wno-unused-parameter -O2 -fwrapv -pipe -Wformat -Werror=format-security -gdwarf-4 -fno-debug-types-section -fvar-tracking-assignments -g2 -Wp,-D_FORTIFY_SOURCE=2 -fstack-protector-strong --param=ssp-buffer-size=4 -Werror=trampolines -fomit-frame-pointer -march=i686 -fasynchronous-unwind-tables -mtune=pentium4 -gdwarf-4 -fno-debug-types-section -fvar-tracking-assignments -g2  -MT img_io.lo -MD -MP -MF .deps/img_io.Tpo -c -o img_io.lo img_io.c
libtool: compile:  i686-pld-linux-gcc -DHAVE_CONFIG_H -I. -I../../tsk -I../.. -I./../.. -pthread -I/usr/local/include -Wall -Wextra -Wno-unused-parameter -O2 -fwrapv -pipe -Wformat -Werror=format-security -gdwarf-4 -fno-debug-types-section -fvar-tracking-assignments -g2 -Wp,-D_FORTIFY_SOURCE=2 -fstack-protector-strong --param=ssp-buffer-size=4 -Werror=trampolines -fomit-frame-pointer -march=i686 -fasynchronous-unwind-tables -mtune=pentium4 -gdwarf-4 -fno-debug-types-section -fvar-tracking-assignments -g2 -MT img_io.lo -MD -MP -MF .deps/img_io.Tpo -c img_io.c  -fPIC -DPIC -o .libs/img_io.o
img_io.c: In function 'tsk_img_read':
img_io.c:94:27: warning: comparison is always false due to limited range of data type [-Wtype-limits]
   94 |     if ((TSK_OFF_T) a_len < 0) {
      |                           ^
libtool: compile:  i686-pld-linux-gcc -DHAVE_CONFIG_H -I. -I../../tsk -I../.. -I./../.. -pthread -I/usr/local/include -Wall -Wextra -Wno-unused-parameter -O2 -fwrapv -pipe -Wformat -Werror=format-security -gdwarf-4 -fno-debug-types-section -fvar-tracking-assignments -g2 -Wp,-D_FORTIFY_SOURCE=2 -fstack-protector-strong --param=ssp-buffer-size=4 -Werror=trampolines -fomit-frame-pointer -march=i686 -fasynchronous-unwind-tables -mtune=pentium4 -gdwarf-4 -fno-debug-types-section -fvar-tracking-assignments -g2 -MT img_io.lo -MD -MP -MF .deps/img_io.Tpo -c img_io.c -o img_io.o >/dev/null 2>&1
mv -f .deps/img_io.Tpo .deps/img_io.Plo
make[3]: Leaving directory '/tmp/B.ZS2I1a/BUILD/sleuthkit-4.6.7/tsk/img'
make[3]: Entering directory '/tmp/B.ZS2I1a/BUILD/sleuthkit-4.6.7/tsk/img'
/bin/sh ../../libtool  --tag=CC   --mode=compile i686-pld-linux-gcc -DHAVE_CONFIG_H -I. -I../../tsk  -I../.. -I./../.. -pthread -I/usr/local/include -Wall -Wextra -Wno-unused-parameter -O2 -fwrapv -pipe -Wformat -Werror=format-security -gdwarf-4 -fno-debug-types-section -fvar-tracking-assignments -g2 -Wp,-D_FORTIFY_SOURCE=2 -fstack-protector-strong --param=ssp-buffer-size=4 -Werror=trampolines -fomit-frame-pointer -march=i686 -fasynchronous-unwind-tables -mtune=pentium4 -gdwarf-4 -fno-debug-types-section -fvar-tracking-assignments -g2  -MT aff.lo -MD -MP -MF .deps/aff.Tpo -c -o aff.lo aff.c
libtool: compile:  i686-pld-linux-gcc -DHAVE_CONFIG_H -I. -I../../tsk -I../.. -I./../.. -pthread -I/usr/local/include -Wall -Wextra -Wno-unused-parameter -O2 -fwrapv -pipe -Wformat -Werror=format-security -gdwarf-4 -fno-debug-types-section -fvar-tracking-assignments -g2 -Wp,-D_FORTIFY_SOURCE=2 -fstack-protector-strong --param=ssp-buffer-size=4 -Werror=trampolines -fomit-frame-pointer -march=i686 -fasynchronous-unwind-tables -mtune=pentium4 -gdwarf-4 -fno-debug-types-section -fvar-tracking-assignments -g2 -MT aff.lo -MD -MP -MF .deps/aff.Tpo -c aff.c  -fPIC -DPIC -o .libs/aff.o
In file included from /usr/include/string.h:495,
                 from ../../tsk/base/tsk_base_i.h:29,
                 from tsk_img_i.h:18,
                 from aff.c:13:
In function 'strncpy',
    inlined from 'aff_open' at aff.c:278:5:
/usr/include/bits/string_fortified.h:106:10: warning: '__builtin_strncpy' specified bound depends on the length of the source argument [-Wstringop-overflow=]
  106 |   return __builtin___strncpy_chk (__dest, __src, __len, __bos (__dest));
      |          ^~~~~~~~~~~~~~~~~~~~~~~~~~~~~~~~~~~~~~~~~~~~~~~~~~~~~~~~~~~~~~
aff.c: In function 'aff_open':
aff.c:278:31: note: length computed here
  278 |     strncpy(image, images[0], strlen(images[0]) + 1);
      |                               ^~~~~~~~~~~~~~~~~
libtool: compile:  i686-pld-linux-gcc -DHAVE_CONFIG_H -I. -I../../tsk -I../.. -I./../.. -pthread -I/usr/local/include -Wall -Wextra -Wno-unused-parameter -O2 -fwrapv -pipe -Wformat -Werror=format-security -gdwarf-4 -fno-debug-types-section -fvar-tracking-assignments -g2 -Wp,-D_FORTIFY_SOURCE=2 -fstack-protector-strong --param=ssp-buffer-size=4 -Werror=trampolines -fomit-frame-pointer -march=i686 -fasynchronous-unwind-tables -mtune=pentium4 -gdwarf-4 -fno-debug-types-section -fvar-tracking-assignments -g2 -MT aff.lo -MD -MP -MF .deps/aff.Tpo -c aff.c -o aff.o >/dev/null 2>&1
mv -f .deps/aff.Tpo .deps/aff.Plo
make[3]: Leaving directory '/tmp/B.ZS2I1a/BUILD/sleuthkit-4.6.7/tsk/img'
make[3]: Entering directory '/tmp/B.ZS2I1a/BUILD/sleuthkit-4.6.7/tsk/img'
/bin/sh ../../libtool  --tag=CC   --mode=compile i686-pld-linux-gcc -DHAVE_CONFIG_H -I. -I../../tsk  -I../.. -I./../.. -pthread -I/usr/local/include -Wall -Wextra -Wno-unused-parameter -O2 -fwrapv -pipe -Wformat -Werror=format-security -gdwarf-4 -fno-debug-types-section -fvar-tracking-assignments -g2 -Wp,-D_FORTIFY_SOURCE=2 -fstack-protector-strong --param=ssp-buffer-size=4 -Werror=trampolines -fomit-frame-pointer -march=i686 -fasynchronous-unwind-tables -mtune=pentium4 -gdwarf-4 -fno-debug-types-section -fvar-tracking-assignments -g2  -MT raw.lo -MD -MP -MF .deps/raw.Tpo -c -o raw.lo raw.c
libtool: compile:  i686-pld-linux-gcc -DHAVE_CONFIG_H -I. -I../../tsk -I../.. -I./../.. -pthread -I/usr/local/include -Wall -Wextra -Wno-unused-parameter -O2 -fwrapv -pipe -Wformat -Werror=format-security -gdwarf-4 -fno-debug-types-section -fvar-tracking-assignments -g2 -Wp,-D_FORTIFY_SOURCE=2 -fstack-protector-strong --param=ssp-buffer-size=4 -Werror=trampolines -fomit-frame-pointer -march=i686 -fasynchronous-unwind-tables -mtune=pentium4 -gdwarf-4 -fno-debug-types-section -fvar-tracking-assignments -g2 -MT raw.lo -MD -MP -MF .deps/raw.Tpo -c raw.c  -fPIC -DPIC -o .libs/raw.o
libtool: compile:  i686-pld-linux-gcc -DHAVE_CONFIG_H -I. -I../../tsk -I../.. -I./../.. -pthread -I/usr/local/include -Wall -Wextra -Wno-unused-parameter -O2 -fwrapv -pipe -Wformat -Werror=format-security -gdwarf-4 -fno-debug-types-section -fvar-tracking-assignments -g2 -Wp,-D_FORTIFY_SOURCE=2 -fstack-protector-strong --param=ssp-buffer-size=4 -Werror=trampolines -fomit-frame-pointer -march=i686 -fasynchronous-unwind-tables -mtune=pentium4 -gdwarf-4 -fno-debug-types-section -fvar-tracking-assignments -g2 -MT raw.lo -MD -MP -MF .deps/raw.Tpo -c raw.c -o raw.o >/dev/null 2>&1
mv -f .deps/raw.Tpo .deps/raw.Plo
make[3]: Leaving directory '/tmp/B.ZS2I1a/BUILD/sleuthkit-4.6.7/tsk/img'
make[3]: Entering directory '/tmp/B.ZS2I1a/BUILD/sleuthkit-4.6.7/tsk/img'
/bin/sh ../../libtool  --tag=CXX   --mode=compile i686-pld-linux-g++ -DHAVE_CONFIG_H -I. -I../../tsk  -I../.. -I./../.. -pthread -I/usr/local/include -Wall -Wextra -Wno-unused-parameter -O2 -fwrapv -pipe -Wformat -Werror=format-security -gdwarf-4 -fno-debug-types-section -fvar-tracking-assignments -g2 -Wp,-D_FORTIFY_SOURCE=2 -fstack-protector-strong --param=ssp-buffer-size=4 -Werror=trampolines -fomit-frame-pointer -march=i686 -fasynchronous-unwind-tables -mtune=pentium4 -gdwarf-4 -fno-debug-types-section -fvar-tracking-assignments -g2  -MT img_open.lo -MD -MP -MF .deps/img_open.Tpo -c -o img_open.lo img_open.cpp
libtool: compile:  i686-pld-linux-g++ -DHAVE_CONFIG_H -I. -I../../tsk -I../.. -I./../.. -pthread -I/usr/local/include -Wall -Wextra -Wno-unused-parameter -O2 -fwrapv -pipe -Wformat -Werror=format-security -gdwarf-4 -fno-debug-types-section -fvar-tracking-assignments -g2 -Wp,-D_FORTIFY_SOURCE=2 -fstack-protector-strong --param=ssp-buffer-size=4 -Werror=trampolines -fomit-frame-pointer -march=i686 -fasynchronous-unwind-tables -mtune=pentium4 -gdwarf-4 -fno-debug-types-section -fvar-tracking-assignments -g2 -MT img_open.lo -MD -MP -MF .deps/img_open.Tpo -c img_open.cpp  -fPIC -DPIC -o .libs/img_open.o
libtool: compile:  i686-pld-linux-g++ -DHAVE_CONFIG_H -I. -I../../tsk -I../.. -I./../.. -pthread -I/usr/local/include -Wall -Wextra -Wno-unused-parameter -O2 -fwrapv -pipe -Wformat -Werror=format-security -gdwarf-4 -fno-debug-types-section -fvar-tracking-assignments -g2 -Wp,-D_FORTIFY_SOURCE=2 -fstack-protector-strong --param=ssp-buffer-size=4 -Werror=trampolines -fomit-frame-pointer -march=i686 -fasynchronous-unwind-tables -mtune=pentium4 -gdwarf-4 -fno-debug-types-section -fvar-tracking-assignments -g2 -MT img_open.lo -MD -MP -MF .deps/img_open.Tpo -c img_open.cpp -o img_open.o >/dev/null 2>&1
mv -f .deps/img_open.Tpo .deps/img_open.Plo
make[3]: Leaving directory '/tmp/B.ZS2I1a/BUILD/sleuthkit-4.6.7/tsk/img'
make[2]: *** [Makefile:510: all-recursive] Error 1
make[1]: *** [Makefile:405: all] Error 2
make: *** [Makefile:572: all-recursive] Error 1
error: Bad exit status from /tmp/B.ZS2I1a/BUILD/tmp/rpm-tmp.10156 (%build)


RPM build errors:
    Bad exit status from /tmp/B.ZS2I1a/BUILD/tmp/rpm-tmp.10156 (%build)
ended at: Fri Mar 27 23:09:27 2020, done in 0:00:12.003259
error: No files produced.
+ chmod -R u+rwX /tmp/B.ZS2I1a/BUILD
+ rm -rf /tmp/B.ZS2I1a/tmp /tmp/B.ZS2I1a/BUILD
+ rm -rf /tmp/B.ZS2I1a
Begin-PLD-Builder-Info
Build-Time: user:12.48s sys:2.87s real:16.63s (faults io:0 non-io:1367467)

End-PLD-Builder-Info
[Back to list of logs] [View rpm -qa of builder]