FailedOk

th/SRPMS[OK]
th/x32[OK]
th/i686[OK]
th/x86_64[OK]

ac/SRPMS[OK]
ac/i386[OK]
ac/i586[OK]
ac/i686[OK]
ac/alpha[OK]
ac/amd64[OK]
ac/athlon[OK]
ac/ppc[OK]
ac/sparc[OK]
ac/sparc64[OK]

Advanced Search
main()
Powered by PLD Linux
(c) 2002-2021 PLD Team
$Revision: 1.37 $
Powered by overclock.
Your IP: 3.80.3.192

spdylay 800ae27d-9948-4c0a-b612-b4f3e58da9b0

Status:Failed
Source URL:https://buildlogs.pld-linux.org/pld/th/i686/FAIL/spdylay,800ae27d-9948-4c0a-b612-b4f3e58da9b0.bz2
text/plain URL:View!
full text:View!
rpm -qa of builder:View!
Date:2021/09/25 23:16:43
Runtime:0:00:25.009987

Toc:

Content:

i686-pld-linux-g++ -DHAVE_CONFIG_H -I. -I..  -Wall -I./../lib/includes -I./../lib/includes -I/usr/include/libxml2  -DHAVE_CONFIG_H -DSPDYLAY_TESTS_DIR=\"../tests\"   -O2 -fwrapv -pipe -Wformat -Werror=format-security -gdwarf-4 -fno-debug-types-section -fvar-tracking-assignments -g2 -Wp,-D_FORTIFY_SOURCE=2 -fstack-protector-strong --param=ssp-buffer-size=4 -Werror=trampolines -fomit-frame-pointer -march=i686 -fasynchronous-unwind-tables -mtune=pentium4 -gdwarf-4 -fno-debug-types-section -fvar-tracking-assignments -g2  -MT shrpx_unittest-shrpx_log.o -MD -MP -MF .deps/shrpx_unittest-shrpx_log.Tpo -c -o shrpx_unittest-shrpx_log.o `test -f 'shrpx_log.cc' || echo './'`shrpx_log.cc
mv -f .deps/shrpx_unittest-shrpx_log.Tpo .deps/shrpx_unittest-shrpx_log.Po
make[2]: Leaving directory '/tmp/B.98o5tpj3/BUILD/spdylay-1.4.0/src'
make[2]: Entering directory '/tmp/B.98o5tpj3/BUILD/spdylay-1.4.0/src'
i686-pld-linux-g++ -DHAVE_CONFIG_H -I. -I..  -Wall -I./../lib/includes -I./../lib/includes -I/usr/include/libxml2  -DHAVE_CONFIG_H -DSPDYLAY_TESTS_DIR=\"../tests\"   -O2 -fwrapv -pipe -Wformat -Werror=format-security -gdwarf-4 -fno-debug-types-section -fvar-tracking-assignments -g2 -Wp,-D_FORTIFY_SOURCE=2 -fstack-protector-strong --param=ssp-buffer-size=4 -Werror=trampolines -fomit-frame-pointer -march=i686 -fasynchronous-unwind-tables -mtune=pentium4 -gdwarf-4 -fno-debug-types-section -fvar-tracking-assignments -g2  -MT shrpx_unittest-shrpx_io_control.o -MD -MP -MF .deps/shrpx_unittest-shrpx_io_control.Tpo -c -o shrpx_unittest-shrpx_io_control.o `test -f 'shrpx_io_control.cc' || echo './'`shrpx_io_control.cc
mv -f .deps/shrpx_unittest-shrpx_io_control.Tpo .deps/shrpx_unittest-shrpx_io_control.Po
make[2]: Leaving directory '/tmp/B.98o5tpj3/BUILD/spdylay-1.4.0/src'
make[2]: Entering directory '/tmp/B.98o5tpj3/BUILD/spdylay-1.4.0/src'
i686-pld-linux-g++ -DHAVE_CONFIG_H -I. -I..  -Wall -I./../lib/includes -I./../lib/includes -I/usr/include/libxml2  -DHAVE_CONFIG_H -DSPDYLAY_TESTS_DIR=\"../tests\"   -O2 -fwrapv -pipe -Wformat -Werror=format-security -gdwarf-4 -fno-debug-types-section -fvar-tracking-assignments -g2 -Wp,-D_FORTIFY_SOURCE=2 -fstack-protector-strong --param=ssp-buffer-size=4 -Werror=trampolines -fomit-frame-pointer -march=i686 -fasynchronous-unwind-tables -mtune=pentium4 -gdwarf-4 -fno-debug-types-section -fvar-tracking-assignments -g2  -MT shrpx_unittest-shrpx_spdy_downstream_connection.o -MD -MP -MF .deps/shrpx_unittest-shrpx_spdy_downstream_connection.Tpo -c -o shrpx_unittest-shrpx_spdy_downstream_connection.o `test -f 'shrpx_spdy_downstream_connection.cc' || echo './'`shrpx_spdy_downstream_connection.cc
mv -f .deps/shrpx_unittest-shrpx_spdy_downstream_connection.Tpo .deps/shrpx_unittest-shrpx_spdy_downstream_connection.Po
make[2]: Leaving directory '/tmp/B.98o5tpj3/BUILD/spdylay-1.4.0/src'
make[2]: Entering directory '/tmp/B.98o5tpj3/BUILD/spdylay-1.4.0/src'
i686-pld-linux-g++ -DHAVE_CONFIG_H -I. -I..  -Wall -I./../lib/includes -I./../lib/includes -I/usr/include/libxml2  -DHAVE_CONFIG_H -DSPDYLAY_TESTS_DIR=\"../tests\"   -O2 -fwrapv -pipe -Wformat -Werror=format-security -gdwarf-4 -fno-debug-types-section -fvar-tracking-assignments -g2 -Wp,-D_FORTIFY_SOURCE=2 -fstack-protector-strong --param=ssp-buffer-size=4 -Werror=trampolines -fomit-frame-pointer -march=i686 -fasynchronous-unwind-tables -mtune=pentium4 -gdwarf-4 -fno-debug-types-section -fvar-tracking-assignments -g2  -MT shrpx_unittest-shrpx_http_downstream_connection.o -MD -MP -MF .deps/shrpx_unittest-shrpx_http_downstream_connection.Tpo -c -o shrpx_unittest-shrpx_http_downstream_connection.o `test -f 'shrpx_http_downstream_connection.cc' || echo './'`shrpx_http_downstream_connection.cc
mv -f .deps/shrpx_unittest-shrpx_http_downstream_connection.Tpo .deps/shrpx_unittest-shrpx_http_downstream_connection.Po
make[2]: Leaving directory '/tmp/B.98o5tpj3/BUILD/spdylay-1.4.0/src'
make[2]: Entering directory '/tmp/B.98o5tpj3/BUILD/spdylay-1.4.0/src'
i686-pld-linux-g++ -DHAVE_CONFIG_H -I. -I..  -Wall -I./../lib/includes -I./../lib/includes -I/usr/include/libxml2  -DHAVE_CONFIG_H -DSPDYLAY_TESTS_DIR=\"../tests\"   -O2 -fwrapv -pipe -Wformat -Werror=format-security -gdwarf-4 -fno-debug-types-section -fvar-tracking-assignments -g2 -Wp,-D_FORTIFY_SOURCE=2 -fstack-protector-strong --param=ssp-buffer-size=4 -Werror=trampolines -fomit-frame-pointer -march=i686 -fasynchronous-unwind-tables -mtune=pentium4 -gdwarf-4 -fno-debug-types-section -fvar-tracking-assignments -g2  -MT shrpx_unittest-shrpx_thread_event_receiver.o -MD -MP -MF .deps/shrpx_unittest-shrpx_thread_event_receiver.Tpo -c -o shrpx_unittest-shrpx_thread_event_receiver.o `test -f 'shrpx_thread_event_receiver.cc' || echo './'`shrpx_thread_event_receiver.cc
mv -f .deps/shrpx_unittest-shrpx_thread_event_receiver.Tpo .deps/shrpx_unittest-shrpx_thread_event_receiver.Po
make[2]: Leaving directory '/tmp/B.98o5tpj3/BUILD/spdylay-1.4.0/src'
make[2]: Entering directory '/tmp/B.98o5tpj3/BUILD/spdylay-1.4.0/src'
i686-pld-linux-g++ -DHAVE_CONFIG_H -I. -I..  -Wall -I./../lib/includes -I./../lib/includes -I/usr/include/libxml2  -DHAVE_CONFIG_H -DSPDYLAY_TESTS_DIR=\"../tests\"   -O2 -fwrapv -pipe -Wformat -Werror=format-security -gdwarf-4 -fno-debug-types-section -fvar-tracking-assignments -g2 -Wp,-D_FORTIFY_SOURCE=2 -fstack-protector-strong --param=ssp-buffer-size=4 -Werror=trampolines -fomit-frame-pointer -march=i686 -fasynchronous-unwind-tables -mtune=pentium4 -gdwarf-4 -fno-debug-types-section -fvar-tracking-assignments -g2  -MT shrpx_unittest-shrpx_worker.o -MD -MP -MF .deps/shrpx_unittest-shrpx_worker.Tpo -c -o shrpx_unittest-shrpx_worker.o `test -f 'shrpx_worker.cc' || echo './'`shrpx_worker.cc
mv -f .deps/shrpx_unittest-shrpx_worker.Tpo .deps/shrpx_unittest-shrpx_worker.Po
make[2]: Leaving directory '/tmp/B.98o5tpj3/BUILD/spdylay-1.4.0/src'
make[2]: Entering directory '/tmp/B.98o5tpj3/BUILD/spdylay-1.4.0/src'
i686-pld-linux-g++ -DHAVE_CONFIG_H -I. -I..  -Wall -I./../lib/includes -I./../lib/includes -I/usr/include/libxml2  -DHAVE_CONFIG_H -DSPDYLAY_TESTS_DIR=\"../tests\"   -O2 -fwrapv -pipe -Wformat -Werror=format-security -gdwarf-4 -fno-debug-types-section -fvar-tracking-assignments -g2 -Wp,-D_FORTIFY_SOURCE=2 -fstack-protector-strong --param=ssp-buffer-size=4 -Werror=trampolines -fomit-frame-pointer -march=i686 -fasynchronous-unwind-tables -mtune=pentium4 -gdwarf-4 -fno-debug-types-section -fvar-tracking-assignments -g2  -MT shrpx_unittest-shrpx_accesslog.o -MD -MP -MF .deps/shrpx_unittest-shrpx_accesslog.Tpo -c -o shrpx_unittest-shrpx_accesslog.o `test -f 'shrpx_accesslog.cc' || echo './'`shrpx_accesslog.cc
mv -f .deps/shrpx_unittest-shrpx_accesslog.Tpo .deps/shrpx_unittest-shrpx_accesslog.Po
make[2]: Leaving directory '/tmp/B.98o5tpj3/BUILD/spdylay-1.4.0/src'
make[2]: Entering directory '/tmp/B.98o5tpj3/BUILD/spdylay-1.4.0/src'
i686-pld-linux-g++ -DHAVE_CONFIG_H -I. -I..  -Wall -I./../lib/includes -I./../lib/includes -I/usr/include/libxml2  -DHAVE_CONFIG_H -DSPDYLAY_TESTS_DIR=\"../tests\"   -O2 -fwrapv -pipe -Wformat -Werror=format-security -gdwarf-4 -fno-debug-types-section -fvar-tracking-assignments -g2 -Wp,-D_FORTIFY_SOURCE=2 -fstack-protector-strong --param=ssp-buffer-size=4 -Werror=trampolines -fomit-frame-pointer -march=i686 -fasynchronous-unwind-tables -mtune=pentium4 -gdwarf-4 -fno-debug-types-section -fvar-tracking-assignments -g2  -MT shrpx_unittest-shrpx_http.o -MD -MP -MF .deps/shrpx_unittest-shrpx_http.Tpo -c -o shrpx_unittest-shrpx_http.o `test -f 'shrpx_http.cc' || echo './'`shrpx_http.cc
mv -f .deps/shrpx_unittest-shrpx_http.Tpo .deps/shrpx_unittest-shrpx_http.Po
make[2]: Leaving directory '/tmp/B.98o5tpj3/BUILD/spdylay-1.4.0/src'
make[2]: Entering directory '/tmp/B.98o5tpj3/BUILD/spdylay-1.4.0/src'
i686-pld-linux-gcc -DHAVE_CONFIG_H -I. -I..  -Wall -I./../lib/includes -I./../lib/includes -I/usr/include/libxml2  -DHAVE_CONFIG_H -DSPDYLAY_TESTS_DIR=\"../tests\"  -Wall -O2 -fwrapv -pipe -Wformat -Werror=format-security -gdwarf-4 -fno-debug-types-section -fvar-tracking-assignments -g2 -Wp,-D_FORTIFY_SOURCE=2 -fstack-protector-strong --param=ssp-buffer-size=4 -Werror=trampolines -fomit-frame-pointer -march=i686 -fasynchronous-unwind-tables -mtune=pentium4 -gdwarf-4 -fno-debug-types-section -fvar-tracking-assignments -g2   -MT http-parser/shrpx_unittest-http_parser.o -MD -MP -MF http-parser/.deps/shrpx_unittest-http_parser.Tpo -c -o http-parser/shrpx_unittest-http_parser.o `test -f 'http-parser/http_parser.c' || echo './'`http-parser/http_parser.c
mv -f http-parser/.deps/shrpx_unittest-http_parser.Tpo http-parser/.deps/shrpx_unittest-http_parser.Po
make[2]: Leaving directory '/tmp/B.98o5tpj3/BUILD/spdylay-1.4.0/src'
make[2]: Entering directory '/tmp/B.98o5tpj3/BUILD/spdylay-1.4.0/src'
i686-pld-linux-g++ -DHAVE_CONFIG_H -I. -I..  -Wall -I./../lib/includes -I./../lib/includes -I/usr/include/libxml2  -DHAVE_CONFIG_H -DSPDYLAY_TESTS_DIR=\"../tests\"   -O2 -fwrapv -pipe -Wformat -Werror=format-security -gdwarf-4 -fno-debug-types-section -fvar-tracking-assignments -g2 -Wp,-D_FORTIFY_SOURCE=2 -fstack-protector-strong --param=ssp-buffer-size=4 -Werror=trampolines -fomit-frame-pointer -march=i686 -fasynchronous-unwind-tables -mtune=pentium4 -gdwarf-4 -fno-debug-types-section -fvar-tracking-assignments -g2  -MT shrpx_unittest-shrpx_spdy_session.o -MD -MP -MF .deps/shrpx_unittest-shrpx_spdy_session.Tpo -c -o shrpx_unittest-shrpx_spdy_session.o `test -f 'shrpx_spdy_session.cc' || echo './'`shrpx_spdy_session.cc
mv -f .deps/shrpx_unittest-shrpx_spdy_session.Tpo .deps/shrpx_unittest-shrpx_spdy_session.Po
make[2]: Leaving directory '/tmp/B.98o5tpj3/BUILD/spdylay-1.4.0/src'
make[2]: Entering directory '/tmp/B.98o5tpj3/BUILD/spdylay-1.4.0/src'
i686-pld-linux-g++ -DHAVE_CONFIG_H -I. -I..  -Wall -I./../lib/includes -I./../lib/includes -I/usr/include/libxml2  -DHAVE_CONFIG_H -DSPDYLAY_TESTS_DIR=\"../tests\"   -O2 -fwrapv -pipe -Wformat -Werror=format-security -gdwarf-4 -fno-debug-types-section -fvar-tracking-assignments -g2 -Wp,-D_FORTIFY_SOURCE=2 -fstack-protector-strong --param=ssp-buffer-size=4 -Werror=trampolines -fomit-frame-pointer -march=i686 -fasynchronous-unwind-tables -mtune=pentium4 -gdwarf-4 -fno-debug-types-section -fvar-tracking-assignments -g2  -MT shrpx_unittest-shrpx_ssl.o -MD -MP -MF .deps/shrpx_unittest-shrpx_ssl.Tpo -c -o shrpx_unittest-shrpx_ssl.o `test -f 'shrpx_ssl.cc' || echo './'`shrpx_ssl.cc
shrpx_ssl.cc: In function 'SSL_CTX* shrpx::ssl::create_ssl_context(const char*, const char*)':
shrpx_ssl.cc:224:42: warning: 'EC_KEY* EC_KEY_new_by_curve_name(int)' is deprecated: Since OpenSSL 3.0 [-Wdeprecated-declarations]
  224 |   EC_KEY *ecdh = EC_KEY_new_by_curve_name(NID_X9_62_prime256v1);
      |                  ~~~~~~~~~~~~~~~~~~~~~~~~^~~~~~~~~~~~~~~~~~~~~~
In file included from /usr/include/openssl/x509.h:33,
                 from /usr/include/openssl/ssl.h:31,
                 from shrpx_ssl.h:32,
                 from shrpx_ssl.cc:25:
/usr/include/openssl/ec.h:996:31: note: declared here
  996 | OSSL_DEPRECATEDIN_3_0 EC_KEY *EC_KEY_new_by_curve_name(int nid);
      |                               ^~~~~~~~~~~~~~~~~~~~~~~~
shrpx_ssl.cc:231:14: warning: 'void EC_KEY_free(EC_KEY*)' is deprecated: Since OpenSSL 3.0 [-Wdeprecated-declarations]
  231 |   EC_KEY_free(ecdh);
      |   ~~~~~~~~~~~^~~~~~
In file included from /usr/include/openssl/x509.h:33,
                 from /usr/include/openssl/ssl.h:31,
                 from shrpx_ssl.h:32,
                 from shrpx_ssl.cc:25:
/usr/include/openssl/ec.h:1001:28: note: declared here
 1001 | OSSL_DEPRECATEDIN_3_0 void EC_KEY_free(EC_KEY *key);
      |                            ^~~~~~~~~~~
shrpx_ssl.cc:241:35: warning: 'DH* PEM_read_bio_DHparams(BIO*, DH**, int (*)(char*, int, int, void*), void*)' is deprecated: Since OpenSSL 3.0 [-Wdeprecated-declarations]
  241 |     DH *dh = PEM_read_bio_DHparams(bio, NULL, NULL, NULL);
      |              ~~~~~~~~~~~~~~~~~~~~~^~~~~~~~~~~~~~~~~~~~~~~
In file included from /usr/include/openssl/ssl.h:36,
                 from shrpx_ssl.h:32,
                 from shrpx_ssl.cc:25:
/usr/include/openssl/pem.h:469:1: note: declared here
  469 | DECLARE_PEM_rw_attr(OSSL_DEPRECATEDIN_3_0, DHparams, DH)
      | ^~~~~~~~~~~~~~~~~~~
shrpx_ssl.cc:248:12: warning: 'void DH_free(DH*)' is deprecated: Since OpenSSL 3.0 [-Wdeprecated-declarations]
  248 |     DH_free(dh);
      |     ~~~~~~~^~~~
In file included from /usr/include/openssl/dsa.h:51,
                 from /usr/include/openssl/x509.h:37,
                 from /usr/include/openssl/ssl.h:31,
                 from shrpx_ssl.h:32,
                 from shrpx_ssl.cc:25:
/usr/include/openssl/dh.h:200:28: note: declared here
  200 | OSSL_DEPRECATEDIN_3_0 void DH_free(DH *dh);
      |                            ^~~~~~~
mv -f .deps/shrpx_unittest-shrpx_ssl.Tpo .deps/shrpx_unittest-shrpx_ssl.Po
make[2]: Leaving directory '/tmp/B.98o5tpj3/BUILD/spdylay-1.4.0/src'
make[2]: Entering directory '/tmp/B.98o5tpj3/BUILD/spdylay-1.4.0/src'
/bin/sh ../libtool  --tag=CXX   --mode=link i686-pld-linux-g++  -O2 -fwrapv -pipe -Wformat -Werror=format-security -gdwarf-4 -fno-debug-types-section -fvar-tracking-assignments -g2 -Wp,-D_FORTIFY_SOURCE=2 -fstack-protector-strong --param=ssp-buffer-size=4 -Werror=trampolines -fomit-frame-pointer -march=i686 -fasynchronous-unwind-tables -mtune=pentium4 -gdwarf-4 -fno-debug-types-section -fvar-tracking-assignments -g2  -static -lssl -lcrypto -levent_openssl -levent -pthread -lcunit   -Wl,--as-needed -Wl,--no-copy-dt-needed-entries -Wl,-z,relro -Wl,-z,combreloc  -o shrpx-unittest shrpx_unittest-shrpx-unittest.o shrpx_unittest-shrpx_ssl_test.o shrpx_unittest-util.o shrpx_unittest-timegm.o shrpx_unittest-shrpx_config.o shrpx_unittest-shrpx_listen_handler.o shrpx_unittest-shrpx_client_handler.o shrpx_unittest-shrpx_spdy_upstream.o shrpx_unittest-shrpx_https_upstream.o shrpx_unittest-shrpx_downstream_queue.o shrpx_unittest-shrpx_downstream.o shrpx_unittest-shrpx_downstream_connection.o shrpx_unittest-shrpx_http_downstream_connection.o shrpx_unittest-shrpx_spdy_downstream_connection.o shrpx_unittest-shrpx_spdy_session.o shrpx_unittest-shrpx_log.o shrpx_unittest-shrpx_http.o shrpx_unittest-shrpx_io_control.o shrpx_unittest-shrpx_ssl.o shrpx_unittest-shrpx_thread_event_receiver.o shrpx_unittest-shrpx_worker.o shrpx_unittest-shrpx_accesslog.o http-parser/shrpx_unittest-http_parser.o ../lib/libspdylay.la -lz 
libtool: link: i686-pld-linux-g++ -O2 -fwrapv -pipe -Wformat -Werror=format-security -gdwarf-4 -fno-debug-types-section -fvar-tracking-assignments -g2 -Wp,-D_FORTIFY_SOURCE=2 -fstack-protector-strong --param=ssp-buffer-size=4 -Werror=trampolines -fomit-frame-pointer -march=i686 -fasynchronous-unwind-tables -mtune=pentium4 -gdwarf-4 -fno-debug-types-section -fvar-tracking-assignments -g2 -pthread -Wl,--as-needed -Wl,--no-copy-dt-needed-entries -Wl,-z -Wl,relro -Wl,-z -Wl,combreloc -o shrpx-unittest shrpx_unittest-shrpx-unittest.o shrpx_unittest-shrpx_ssl_test.o shrpx_unittest-util.o shrpx_unittest-timegm.o shrpx_unittest-shrpx_config.o shrpx_unittest-shrpx_listen_handler.o shrpx_unittest-shrpx_client_handler.o shrpx_unittest-shrpx_spdy_upstream.o shrpx_unittest-shrpx_https_upstream.o shrpx_unittest-shrpx_downstream_queue.o shrpx_unittest-shrpx_downstream.o shrpx_unittest-shrpx_downstream_connection.o shrpx_unittest-shrpx_http_downstream_connection.o shrpx_unittest-shrpx_spdy_downstream_connection.o shrpx_unittest-shrpx_spdy_session.o shrpx_unittest-shrpx_log.o shrpx_unittest-shrpx_http.o shrpx_unittest-shrpx_io_control.o shrpx_unittest-shrpx_ssl.o shrpx_unittest-shrpx_thread_event_receiver.o shrpx_unittest-shrpx_worker.o shrpx_unittest-shrpx_accesslog.o http-parser/shrpx_unittest-http_parser.o  -lssl -lcrypto -levent_openssl -levent -lcunit ../lib/.libs/libspdylay.a -lz -pthread
make[2]: Leaving directory '/tmp/B.98o5tpj3/BUILD/spdylay-1.4.0/src'
/usr/bin/make  check-TESTS
make[3]: Entering directory '/tmp/B.98o5tpj3/BUILD/spdylay-1.4.0/src'
PASS: shrpx-unittest
make[3]: Leaving directory '/tmp/B.98o5tpj3/BUILD/spdylay-1.4.0/src'
make[3]: Entering directory '/tmp/B.98o5tpj3/BUILD/spdylay-1.4.0/src'
============================================================================
Testsuite summary for spdylay 1.4.0
============================================================================
# TOTAL: 1
# PASS:  1
# SKIP:  0
# XFAIL: 0
# FAIL:  0
# XPASS: 0
# ERROR: 0
============================================================================
make[3]: Leaving directory '/tmp/B.98o5tpj3/BUILD/spdylay-1.4.0/src'
Making check in tests
Making check in testdata
make[2]: Nothing to be done for 'check'.
/usr/bin/make  main failmalloc
make[3]: Entering directory '/tmp/B.98o5tpj3/BUILD/spdylay-1.4.0/tests'
depbase=`echo spdylay_queue_test.o | sed 's|[^/]*$|.deps/&|;s|\.o$||'`;\
i686-pld-linux-gcc -DHAVE_CONFIG_H -I. -I..    -Wall -I../lib -I../lib/includes -I../lib/includes -DHAVE_CONFIG_H -O2 -fwrapv -pipe -Wformat -Werror=format-security -gdwarf-4 -fno-debug-types-section -fvar-tracking-assignments -g2 -Wp,-D_FORTIFY_SOURCE=2 -fstack-protector-strong --param=ssp-buffer-size=4 -Werror=trampolines -fomit-frame-pointer -march=i686 -fasynchronous-unwind-tables -mtune=pentium4 -gdwarf-4 -fno-debug-types-section -fvar-tracking-assignments -g2   -MT spdylay_queue_test.o -MD -MP -MF $depbase.Tpo -c -o spdylay_queue_test.o spdylay_queue_test.c &&\
mv -f $depbase.Tpo $depbase.Po
make[3]: Leaving directory '/tmp/B.98o5tpj3/BUILD/spdylay-1.4.0/tests'
make[3]: Entering directory '/tmp/B.98o5tpj3/BUILD/spdylay-1.4.0/tests'
depbase=`echo spdylay_zlib_test.o | sed 's|[^/]*$|.deps/&|;s|\.o$||'`;\
i686-pld-linux-gcc -DHAVE_CONFIG_H -I. -I..    -Wall -I../lib -I../lib/includes -I../lib/includes -DHAVE_CONFIG_H -O2 -fwrapv -pipe -Wformat -Werror=format-security -gdwarf-4 -fno-debug-types-section -fvar-tracking-assignments -g2 -Wp,-D_FORTIFY_SOURCE=2 -fstack-protector-strong --param=ssp-buffer-size=4 -Werror=trampolines -fomit-frame-pointer -march=i686 -fasynchronous-unwind-tables -mtune=pentium4 -gdwarf-4 -fno-debug-types-section -fvar-tracking-assignments -g2   -MT spdylay_zlib_test.o -MD -MP -MF $depbase.Tpo -c -o spdylay_zlib_test.o spdylay_zlib_test.c &&\
mv -f $depbase.Tpo $depbase.Po
make[3]: Leaving directory '/tmp/B.98o5tpj3/BUILD/spdylay-1.4.0/tests'
make[3]: Entering directory '/tmp/B.98o5tpj3/BUILD/spdylay-1.4.0/tests'
depbase=`echo spdylay_stream_test.o | sed 's|[^/]*$|.deps/&|;s|\.o$||'`;\
i686-pld-linux-gcc -DHAVE_CONFIG_H -I. -I..    -Wall -I../lib -I../lib/includes -I../lib/includes -DHAVE_CONFIG_H -O2 -fwrapv -pipe -Wformat -Werror=format-security -gdwarf-4 -fno-debug-types-section -fvar-tracking-assignments -g2 -Wp,-D_FORTIFY_SOURCE=2 -fstack-protector-strong --param=ssp-buffer-size=4 -Werror=trampolines -fomit-frame-pointer -march=i686 -fasynchronous-unwind-tables -mtune=pentium4 -gdwarf-4 -fno-debug-types-section -fvar-tracking-assignments -g2   -MT spdylay_stream_test.o -MD -MP -MF $depbase.Tpo -c -o spdylay_stream_test.o spdylay_stream_test.c &&\
mv -f $depbase.Tpo $depbase.Po
make[3]: Leaving directory '/tmp/B.98o5tpj3/BUILD/spdylay-1.4.0/tests'
make[3]: Entering directory '/tmp/B.98o5tpj3/BUILD/spdylay-1.4.0/tests'
depbase=`echo spdylay_pq_test.o | sed 's|[^/]*$|.deps/&|;s|\.o$||'`;\
i686-pld-linux-gcc -DHAVE_CONFIG_H -I. -I..    -Wall -I../lib -I../lib/includes -I../lib/includes -DHAVE_CONFIG_H -O2 -fwrapv -pipe -Wformat -Werror=format-security -gdwarf-4 -fno-debug-types-section -fvar-tracking-assignments -g2 -Wp,-D_FORTIFY_SOURCE=2 -fstack-protector-strong --param=ssp-buffer-size=4 -Werror=trampolines -fomit-frame-pointer -march=i686 -fasynchronous-unwind-tables -mtune=pentium4 -gdwarf-4 -fno-debug-types-section -fvar-tracking-assignments -g2   -MT spdylay_pq_test.o -MD -MP -MF $depbase.Tpo -c -o spdylay_pq_test.o spdylay_pq_test.c &&\
mv -f $depbase.Tpo $depbase.Po
make[3]: Leaving directory '/tmp/B.98o5tpj3/BUILD/spdylay-1.4.0/tests'
make[3]: Entering directory '/tmp/B.98o5tpj3/BUILD/spdylay-1.4.0/tests'
depbase=`echo main.o | sed 's|[^/]*$|.deps/&|;s|\.o$||'`;\
i686-pld-linux-gcc -DHAVE_CONFIG_H -I. -I..    -Wall -I../lib -I../lib/includes -I../lib/includes -DHAVE_CONFIG_H -O2 -fwrapv -pipe -Wformat -Werror=format-security -gdwarf-4 -fno-debug-types-section -fvar-tracking-assignments -g2 -Wp,-D_FORTIFY_SOURCE=2 -fstack-protector-strong --param=ssp-buffer-size=4 -Werror=trampolines -fomit-frame-pointer -march=i686 -fasynchronous-unwind-tables -mtune=pentium4 -gdwarf-4 -fno-debug-types-section -fvar-tracking-assignments -g2   -MT main.o -MD -MP -MF $depbase.Tpo -c -o main.o main.c &&\
mv -f $depbase.Tpo $depbase.Po
make[3]: Leaving directory '/tmp/B.98o5tpj3/BUILD/spdylay-1.4.0/tests'
make[3]: Entering directory '/tmp/B.98o5tpj3/BUILD/spdylay-1.4.0/tests'
depbase=`echo spdylay_map_test.o | sed 's|[^/]*$|.deps/&|;s|\.o$||'`;\
i686-pld-linux-gcc -DHAVE_CONFIG_H -I. -I..    -Wall -I../lib -I../lib/includes -I../lib/includes -DHAVE_CONFIG_H -O2 -fwrapv -pipe -Wformat -Werror=format-security -gdwarf-4 -fno-debug-types-section -fvar-tracking-assignments -g2 -Wp,-D_FORTIFY_SOURCE=2 -fstack-protector-strong --param=ssp-buffer-size=4 -Werror=trampolines -fomit-frame-pointer -march=i686 -fasynchronous-unwind-tables -mtune=pentium4 -gdwarf-4 -fno-debug-types-section -fvar-tracking-assignments -g2   -MT spdylay_map_test.o -MD -MP -MF $depbase.Tpo -c -o spdylay_map_test.o spdylay_map_test.c &&\
mv -f $depbase.Tpo $depbase.Po
make[3]: Leaving directory '/tmp/B.98o5tpj3/BUILD/spdylay-1.4.0/tests'
make[3]: Entering directory '/tmp/B.98o5tpj3/BUILD/spdylay-1.4.0/tests'
depbase=`echo spdylay_buffer_test.o | sed 's|[^/]*$|.deps/&|;s|\.o$||'`;\
i686-pld-linux-gcc -DHAVE_CONFIG_H -I. -I..    -Wall -I../lib -I../lib/includes -I../lib/includes -DHAVE_CONFIG_H -O2 -fwrapv -pipe -Wformat -Werror=format-security -gdwarf-4 -fno-debug-types-section -fvar-tracking-assignments -g2 -Wp,-D_FORTIFY_SOURCE=2 -fstack-protector-strong --param=ssp-buffer-size=4 -Werror=trampolines -fomit-frame-pointer -march=i686 -fasynchronous-unwind-tables -mtune=pentium4 -gdwarf-4 -fno-debug-types-section -fvar-tracking-assignments -g2   -MT spdylay_buffer_test.o -MD -MP -MF $depbase.Tpo -c -o spdylay_buffer_test.o spdylay_buffer_test.c &&\
mv -f $depbase.Tpo $depbase.Po
make[3]: Leaving directory '/tmp/B.98o5tpj3/BUILD/spdylay-1.4.0/tests'
make[3]: Entering directory '/tmp/B.98o5tpj3/BUILD/spdylay-1.4.0/tests'
depbase=`echo failmalloc.o | sed 's|[^/]*$|.deps/&|;s|\.o$||'`;\
i686-pld-linux-gcc -DHAVE_CONFIG_H -I. -I..    -Wall -I../lib -I../lib/includes -I../lib/includes -DHAVE_CONFIG_H -O2 -fwrapv -pipe -Wformat -Werror=format-security -gdwarf-4 -fno-debug-types-section -fvar-tracking-assignments -g2 -Wp,-D_FORTIFY_SOURCE=2 -fstack-protector-strong --param=ssp-buffer-size=4 -Werror=trampolines -fomit-frame-pointer -march=i686 -fasynchronous-unwind-tables -mtune=pentium4 -gdwarf-4 -fno-debug-types-section -fvar-tracking-assignments -g2   -MT failmalloc.o -MD -MP -MF $depbase.Tpo -c -o failmalloc.o failmalloc.c &&\
mv -f $depbase.Tpo $depbase.Po
make[3]: Leaving directory '/tmp/B.98o5tpj3/BUILD/spdylay-1.4.0/tests'
make[3]: Entering directory '/tmp/B.98o5tpj3/BUILD/spdylay-1.4.0/tests'
depbase=`echo spdylay_test_helper.o | sed 's|[^/]*$|.deps/&|;s|\.o$||'`;\
i686-pld-linux-gcc -DHAVE_CONFIG_H -I. -I..    -Wall -I../lib -I../lib/includes -I../lib/includes -DHAVE_CONFIG_H -O2 -fwrapv -pipe -Wformat -Werror=format-security -gdwarf-4 -fno-debug-types-section -fvar-tracking-assignments -g2 -Wp,-D_FORTIFY_SOURCE=2 -fstack-protector-strong --param=ssp-buffer-size=4 -Werror=trampolines -fomit-frame-pointer -march=i686 -fasynchronous-unwind-tables -mtune=pentium4 -gdwarf-4 -fno-debug-types-section -fvar-tracking-assignments -g2   -MT spdylay_test_helper.o -MD -MP -MF $depbase.Tpo -c -o spdylay_test_helper.o spdylay_test_helper.c &&\
mv -f $depbase.Tpo $depbase.Po
make[3]: Leaving directory '/tmp/B.98o5tpj3/BUILD/spdylay-1.4.0/tests'
make[3]: Entering directory '/tmp/B.98o5tpj3/BUILD/spdylay-1.4.0/tests'
depbase=`echo malloc_wrapper.o | sed 's|[^/]*$|.deps/&|;s|\.o$||'`;\
i686-pld-linux-gcc -DHAVE_CONFIG_H -I. -I..    -Wall -I../lib -I../lib/includes -I../lib/includes -DHAVE_CONFIG_H -O2 -fwrapv -pipe -Wformat -Werror=format-security -gdwarf-4 -fno-debug-types-section -fvar-tracking-assignments -g2 -Wp,-D_FORTIFY_SOURCE=2 -fstack-protector-strong --param=ssp-buffer-size=4 -Werror=trampolines -fomit-frame-pointer -march=i686 -fasynchronous-unwind-tables -mtune=pentium4 -gdwarf-4 -fno-debug-types-section -fvar-tracking-assignments -g2   -MT malloc_wrapper.o -MD -MP -MF $depbase.Tpo -c -o malloc_wrapper.o malloc_wrapper.c &&\
mv -f $depbase.Tpo $depbase.Po
make[3]: Leaving directory '/tmp/B.98o5tpj3/BUILD/spdylay-1.4.0/tests'
make[3]: Entering directory '/tmp/B.98o5tpj3/BUILD/spdylay-1.4.0/tests'
depbase=`echo spdylay_gzip_test.o | sed 's|[^/]*$|.deps/&|;s|\.o$||'`;\
i686-pld-linux-gcc -DHAVE_CONFIG_H -I. -I..    -Wall -I../lib -I../lib/includes -I../lib/includes -DHAVE_CONFIG_H -O2 -fwrapv -pipe -Wformat -Werror=format-security -gdwarf-4 -fno-debug-types-section -fvar-tracking-assignments -g2 -Wp,-D_FORTIFY_SOURCE=2 -fstack-protector-strong --param=ssp-buffer-size=4 -Werror=trampolines -fomit-frame-pointer -march=i686 -fasynchronous-unwind-tables -mtune=pentium4 -gdwarf-4 -fno-debug-types-section -fvar-tracking-assignments -g2   -MT spdylay_gzip_test.o -MD -MP -MF $depbase.Tpo -c -o spdylay_gzip_test.o spdylay_gzip_test.c &&\
mv -f $depbase.Tpo $depbase.Po
make[3]: Leaving directory '/tmp/B.98o5tpj3/BUILD/spdylay-1.4.0/tests'
make[3]: Entering directory '/tmp/B.98o5tpj3/BUILD/spdylay-1.4.0/tests'
depbase=`echo spdylay_npn_test.o | sed 's|[^/]*$|.deps/&|;s|\.o$||'`;\
i686-pld-linux-gcc -DHAVE_CONFIG_H -I. -I..    -Wall -I../lib -I../lib/includes -I../lib/includes -DHAVE_CONFIG_H -O2 -fwrapv -pipe -Wformat -Werror=format-security -gdwarf-4 -fno-debug-types-section -fvar-tracking-assignments -g2 -Wp,-D_FORTIFY_SOURCE=2 -fstack-protector-strong --param=ssp-buffer-size=4 -Werror=trampolines -fomit-frame-pointer -march=i686 -fasynchronous-unwind-tables -mtune=pentium4 -gdwarf-4 -fno-debug-types-section -fvar-tracking-assignments -g2   -MT spdylay_npn_test.o -MD -MP -MF $depbase.Tpo -c -o spdylay_npn_test.o spdylay_npn_test.c &&\
mv -f $depbase.Tpo $depbase.Po
make[3]: Leaving directory '/tmp/B.98o5tpj3/BUILD/spdylay-1.4.0/tests'
make[3]: Entering directory '/tmp/B.98o5tpj3/BUILD/spdylay-1.4.0/tests'
depbase=`echo failmalloc_test.o | sed 's|[^/]*$|.deps/&|;s|\.o$||'`;\
i686-pld-linux-gcc -DHAVE_CONFIG_H -I. -I..    -Wall -I../lib -I../lib/includes -I../lib/includes -DHAVE_CONFIG_H -O2 -fwrapv -pipe -Wformat -Werror=format-security -gdwarf-4 -fno-debug-types-section -fvar-tracking-assignments -g2 -Wp,-D_FORTIFY_SOURCE=2 -fstack-protector-strong --param=ssp-buffer-size=4 -Werror=trampolines -fomit-frame-pointer -march=i686 -fasynchronous-unwind-tables -mtune=pentium4 -gdwarf-4 -fno-debug-types-section -fvar-tracking-assignments -g2   -MT failmalloc_test.o -MD -MP -MF $depbase.Tpo -c -o failmalloc_test.o failmalloc_test.c &&\
mv -f $depbase.Tpo $depbase.Po
make[3]: Leaving directory '/tmp/B.98o5tpj3/BUILD/spdylay-1.4.0/tests'
make[3]: Entering directory '/tmp/B.98o5tpj3/BUILD/spdylay-1.4.0/tests'
depbase=`echo spdylay_frame_test.o | sed 's|[^/]*$|.deps/&|;s|\.o$||'`;\
i686-pld-linux-gcc -DHAVE_CONFIG_H -I. -I..    -Wall -I../lib -I../lib/includes -I../lib/includes -DHAVE_CONFIG_H -O2 -fwrapv -pipe -Wformat -Werror=format-security -gdwarf-4 -fno-debug-types-section -fvar-tracking-assignments -g2 -Wp,-D_FORTIFY_SOURCE=2 -fstack-protector-strong --param=ssp-buffer-size=4 -Werror=trampolines -fomit-frame-pointer -march=i686 -fasynchronous-unwind-tables -mtune=pentium4 -gdwarf-4 -fno-debug-types-section -fvar-tracking-assignments -g2   -MT spdylay_frame_test.o -MD -MP -MF $depbase.Tpo -c -o spdylay_frame_test.o spdylay_frame_test.c &&\
mv -f $depbase.Tpo $depbase.Po
make[3]: Leaving directory '/tmp/B.98o5tpj3/BUILD/spdylay-1.4.0/tests'
make[3]: Entering directory '/tmp/B.98o5tpj3/BUILD/spdylay-1.4.0/tests'
/bin/sh ../libtool  --tag=CC   --mode=link i686-pld-linux-gcc -Wall -I../lib -I../lib/includes -I../lib/includes -DHAVE_CONFIG_H -O2 -fwrapv -pipe -Wformat -Werror=format-security -gdwarf-4 -fno-debug-types-section -fvar-tracking-assignments -g2 -Wp,-D_FORTIFY_SOURCE=2 -fstack-protector-strong --param=ssp-buffer-size=4 -Werror=trampolines -fomit-frame-pointer -march=i686 -fasynchronous-unwind-tables -mtune=pentium4 -gdwarf-4 -fno-debug-types-section -fvar-tracking-assignments -g2   -static -lcunit   -Wl,--as-needed -Wl,--no-copy-dt-needed-entries -Wl,-z,relro -Wl,-z,combreloc  -o failmalloc failmalloc.o failmalloc_test.o malloc_wrapper.o spdylay_test_helper.o ../lib/libspdylay.la -lz 
libtool: link: i686-pld-linux-gcc -Wall -I../lib -I../lib/includes -I../lib/includes -DHAVE_CONFIG_H -O2 -fwrapv -pipe -Wformat -Werror=format-security -gdwarf-4 -fno-debug-types-section -fvar-tracking-assignments -g2 -Wp,-D_FORTIFY_SOURCE=2 -fstack-protector-strong --param=ssp-buffer-size=4 -Werror=trampolines -fomit-frame-pointer -march=i686 -fasynchronous-unwind-tables -mtune=pentium4 -gdwarf-4 -fno-debug-types-section -fvar-tracking-assignments -g2 -Wl,--as-needed -Wl,--no-copy-dt-needed-entries -Wl,-z -Wl,relro -Wl,-z -Wl,combreloc -o failmalloc failmalloc.o failmalloc_test.o malloc_wrapper.o spdylay_test_helper.o  -lcunit ../lib/.libs/libspdylay.a -lz
make[3]: Leaving directory '/tmp/B.98o5tpj3/BUILD/spdylay-1.4.0/tests'
make[3]: Entering directory '/tmp/B.98o5tpj3/BUILD/spdylay-1.4.0/tests'
depbase=`echo spdylay_session_test.o | sed 's|[^/]*$|.deps/&|;s|\.o$||'`;\
i686-pld-linux-gcc -DHAVE_CONFIG_H -I. -I..    -Wall -I../lib -I../lib/includes -I../lib/includes -DHAVE_CONFIG_H -O2 -fwrapv -pipe -Wformat -Werror=format-security -gdwarf-4 -fno-debug-types-section -fvar-tracking-assignments -g2 -Wp,-D_FORTIFY_SOURCE=2 -fstack-protector-strong --param=ssp-buffer-size=4 -Werror=trampolines -fomit-frame-pointer -march=i686 -fasynchronous-unwind-tables -mtune=pentium4 -gdwarf-4 -fno-debug-types-section -fvar-tracking-assignments -g2   -MT spdylay_session_test.o -MD -MP -MF $depbase.Tpo -c -o spdylay_session_test.o spdylay_session_test.c &&\
mv -f $depbase.Tpo $depbase.Po
make[3]: Leaving directory '/tmp/B.98o5tpj3/BUILD/spdylay-1.4.0/tests'
make[3]: Entering directory '/tmp/B.98o5tpj3/BUILD/spdylay-1.4.0/tests'
/bin/sh ../libtool  --tag=CC   --mode=link i686-pld-linux-gcc -Wall -I../lib -I../lib/includes -I../lib/includes -DHAVE_CONFIG_H -O2 -fwrapv -pipe -Wformat -Werror=format-security -gdwarf-4 -fno-debug-types-section -fvar-tracking-assignments -g2 -Wp,-D_FORTIFY_SOURCE=2 -fstack-protector-strong --param=ssp-buffer-size=4 -Werror=trampolines -fomit-frame-pointer -march=i686 -fasynchronous-unwind-tables -mtune=pentium4 -gdwarf-4 -fno-debug-types-section -fvar-tracking-assignments -g2   -static -lcunit   -Wl,--as-needed -Wl,--no-copy-dt-needed-entries -Wl,-z,relro -Wl,-z,combreloc  -o main  main.o spdylay_pq_test.o spdylay_map_test.o spdylay_queue_test.o spdylay_buffer_test.o spdylay_zlib_test.o spdylay_session_test.o spdylay_frame_test.o spdylay_stream_test.o spdylay_npn_test.o spdylay_gzip_test.o spdylay_test_helper.o ../lib/libspdylay.la -lz 
libtool: link: i686-pld-linux-gcc -Wall -I../lib -I../lib/includes -I../lib/includes -DHAVE_CONFIG_H -O2 -fwrapv -pipe -Wformat -Werror=format-security -gdwarf-4 -fno-debug-types-section -fvar-tracking-assignments -g2 -Wp,-D_FORTIFY_SOURCE=2 -fstack-protector-strong --param=ssp-buffer-size=4 -Werror=trampolines -fomit-frame-pointer -march=i686 -fasynchronous-unwind-tables -mtune=pentium4 -gdwarf-4 -fno-debug-types-section -fvar-tracking-assignments -g2 -Wl,--as-needed -Wl,--no-copy-dt-needed-entries -Wl,-z -Wl,relro -Wl,-z -Wl,combreloc -o main main.o spdylay_pq_test.o spdylay_map_test.o spdylay_queue_test.o spdylay_buffer_test.o spdylay_zlib_test.o spdylay_session_test.o spdylay_frame_test.o spdylay_stream_test.o spdylay_npn_test.o spdylay_gzip_test.o spdylay_test_helper.o  -lcunit ../lib/.libs/libspdylay.a -lz
make[3]: Leaving directory '/tmp/B.98o5tpj3/BUILD/spdylay-1.4.0/tests'
/usr/bin/make  check-TESTS
make[4]: Entering directory '/tmp/B.98o5tpj3/BUILD/spdylay-1.4.0/tests'
PASS: failmalloc
make[4]: Leaving directory '/tmp/B.98o5tpj3/BUILD/spdylay-1.4.0/tests'
make[4]: Entering directory '/tmp/B.98o5tpj3/BUILD/spdylay-1.4.0/tests'
PASS: main
make[4]: Leaving directory '/tmp/B.98o5tpj3/BUILD/spdylay-1.4.0/tests'
make[4]: Entering directory '/tmp/B.98o5tpj3/BUILD/spdylay-1.4.0/tests'
FAIL: end_to_end.py
make[4]: Leaving directory '/tmp/B.98o5tpj3/BUILD/spdylay-1.4.0/tests'
make[4]: Entering directory '/tmp/B.98o5tpj3/BUILD/spdylay-1.4.0/tests'
============================================================================
Testsuite summary for spdylay 1.4.0
============================================================================
# TOTAL: 3
# PASS:  2
# SKIP:  0
# XFAIL: 0
# FAIL:  1
# XPASS: 0
# ERROR: 0
============================================================================
See tests/test-suite.log
Please report to t-tujikawa@users.sourceforge.net
============================================================================
make[4]: *** [Makefile:874: test-suite.log] Error 1
make[4]: Leaving directory '/tmp/B.98o5tpj3/BUILD/spdylay-1.4.0/tests'
make[3]: *** [Makefile:982: check-TESTS] Error 2
make[2]: *** [Makefile:1092: check-am] Error 2
make[1]: *** [Makefile:766: check-recursive] Error 1
make: *** [Makefile:505: check-recursive] Error 1
error: Bad exit status from /tmp/B.98o5tpj3/BUILD/tmp/rpm-tmp.ZPxt88 (%build)


RPM build errors:
    Could not canonicalize hostname: nereid
    Bad exit status from /tmp/B.98o5tpj3/BUILD/tmp/rpm-tmp.ZPxt88 (%build)
ended at: Sat Sep 25 23:16:42 2021, done in 0:00:25.009987
error: No files produced.
+ chmod -R u+rwX /tmp/B.98o5tpj3/BUILD
+ rm -rf /tmp/B.98o5tpj3/tmp /tmp/B.98o5tpj3/BUILD
+ rm -rf /tmp/B.98o5tpj3
Begin-PLD-Builder-Info
Build-Time: user:78.20s sys:9.07s real:26.87s (faults io:10 non-io:2055345)

End-PLD-Builder-Info
[Back to list of logs] [View rpm -qa of builder]