FailedOk

th/SRPMS[OK]
th/x32[OK]
th/i686[OK]
th/x86_64[OK]

ac/SRPMS[OK]
ac/i386[OK]
ac/i586[OK]
ac/i686[OK]
ac/alpha[OK]
ac/amd64[OK]
ac/athlon[OK]
ac/ppc[OK]
ac/sparc[OK]
ac/sparc64[OK]

Advanced Search
main()
Powered by PLD Linux
(c) 2002-2017 PLD Team
$Revision: 1.37 $
Powered by The Bad Thing.
Your IP: 54.221.93.187

sphinx-pdg be445acd-f94b-432c-b869-c35e5457ac25

Status:Failed
Source URL:ftp://buildlogs.pld-linux.org/th/i686/FAIL/sphinx-pdg,be445acd-f94b-432c-b869-c35e5457ac25.bz2
text/plain URL:View!
full text:View!
rpm -qa of builder:View!
Date:2017/11/28 10:07:55
Runtime:0:02:18.728393

Toc:

  • error 1
  • /tmp/B.ctoCc1/BUILD/Sphinx-1.5.5/tests/build/linkcheck/links.txt:5: ERROR: Unknown target name: "http://www.sphinx-doc.org/en/1.4.8/tutorial.html#install-sphinx".
  • error 2
  • /tmp/B.ctoCc1/BUILD/Sphinx-1.5.5/tests/build/linkcheck/links.txt:5: ERROR: Unknown target name: "http://www.sphinx-doc.org/en/1.4.8/tutorial.html#install-sphinx".
  • error 3
  • error: Bad exit status from /tmp/B.ctoCc1/BUILD/tmp/rpm-tmp.69687 (%build)
  • error 4
  • RPM build errors:
  • error 5
  • error: No files produced.

Content:

tests/test_directive_only.py .
tests/test_docutilsconf.py .......
tests/test_domain_cpp.py .............
tests/test_domain_js.py ...
tests/test_domain_py.py ....
tests/test_domain_rst.py .
tests/test_domain_std.py ..
tests/test_environment.py .....
tests/test_environment_indexentries.py ......
tests/test_environment_toctree.py .........
tests/test_ext_autodoc.py .
tests/test_ext_autosectionlabel.py .
tests/test_ext_autosummary.py ...
tests/test_ext_coverage.py .
tests/test_ext_doctest.py .
tests/test_ext_githubpages.py .
tests/test_ext_graphviz.py ...
tests/test_ext_ifconfig.py .
tests/test_ext_inheritance_diagram.py ...
tests/test_ext_intersphinx.py ..............
tests/test_ext_math.py ..s...
tests/test_ext_napoleon.py ................
tests/test_ext_napoleon_docstring.py ......................
tests/test_ext_napoleon_iterators.py ................
tests/test_ext_todo.py ..
tests/test_ext_viewcode.py ..
tests/test_highlighting.py ......
tests/test_intl.py ...........................................
tests/test_markup.py ................
tests/test_metadata.py .
tests/test_quickstart.py .........
tests/test_search.py ........
tests/test_searchadapters.py ss
tests/test_setup_command.py .....
tests/test_templating.py ..
tests/test_theming.py ...
tests/test_toctree.py ..
tests/test_util.py ...
tests/test_util_fileutil.py ..
tests/test_util_inspect.py ....
tests/test_util_jsdump.py .
tests/test_util_logging.py .
tests/test_util_matching.py ..
tests/test_util_nodes.py ........
tests/test_util_rst.py .
tests/test_versioning.py ..........
tests/test_websupport.py ...........
tests/test_writer_latex.py .

=================================== FAILURES ===================================
________________________________ test_defaults _________________________________

app = <SphinxTestApp buildername='linkcheck'>
status = <StringIO.StringIO instance at 0xf2d4668c>
warning = <StringIO.StringIO instance at 0xf2d467cc>

    @pytest.mark.sphinx('linkcheck', testroot='linkcheck', freshenv=True)
    def test_defaults(app, status, warning):
        app.builder.build_all()
    
        assert (app.outdir / 'output.txt').exists()
        content = (app.outdir / 'output.txt').text()
    
        print(content)
        # looking for #top should fail
>       assert "Anchor 'top' not found" in content
E       assert "Anchor 'top' not found" in "links.txt:9: [broken] http://example.com/#!bar: HTTPConnectionPool(host='example.com', port=80): Max retries exceeded...tion object at 0xf4359aac>: Failed to establish a new connection: [Errno -3] Temporary failure in name resolution',))\n"

tests/test_build_linkcheck.py:25: AssertionError
----------------------------- Captured stdout call -----------------------------
links.txt:9: [broken] http://example.com/#!bar: HTTPConnectionPool(host='example.com', port=80): Max retries exceeded with url: / (Caused by NewConnectionError('<urllib3.connection.HTTPConnection object at 0xf4bb450c>: Failed to establish a new connection: [Errno -3] Temporary failure in name resolution',))
links.txt:3: [broken] https://www.w3.org/TR/2006/REC-xml-names-20060816/#defaulting: HTTPSConnectionPool(host='www.w3.org', port=443): Max retries exceeded with url: /TR/2006/REC-xml-names-20060816/ (Caused by NewConnectionError('<urllib3.connection.VerifiedHTTPSConnection object at 0xf4bb4cec>: Failed to establish a new connection: [Errno -3] Temporary failure in name resolution',))
links.txt:10: [broken] http://example.com#!bar: HTTPConnectionPool(host='example.com', port=80): Max retries exceeded with url: / (Caused by NewConnectionError('<urllib3.connection.HTTPConnection object at 0xf4a19dac>: Failed to establish a new connection: [Errno -3] Temporary failure in name resolution',))
links.txt:11: [broken] http://example.com/#top: HTTPConnectionPool(host='example.com', port=80): Max retries exceeded with url: / (Caused by NewConnectionError('<urllib3.connection.HTTPConnection object at 0xf4359aac>: Failed to establish a new connection: [Errno -3] Temporary failure in name resolution',))

--------------------------- Captured stdout teardown ---------------------------
# testroot: linkcheck
# builder: linkcheck
# srcdir: /tmp/B.ctoCc1/BUILD/Sphinx-1.5.5/tests/build/linkcheck
# outdir: /tmp/B.ctoCc1/BUILD/Sphinx-1.5.5/tests/build/linkcheck/_build/linkcheck
# status: 
Running Sphinx v1.5.5
building [linkcheck]: all source files
updating environment: 1 added, 0 changed, 0 removed
reading sources... [100%] links                                                
looking for now-outdated files... none found
pickling environment... done
checking consistency... done
preparing documents... done
writing output... [100%] links                                                 
(line    9) broken    http://example.com/#!bar - HTTPConnectionPool(host='example.com', port=80): Max retries exceeded with url: / (Caused by NewConnectionError('<urllib3.connection.HTTPConnection object at 0xf4bb450c>: Failed to establish a new connection: [Errno -3] Temporary failure in name resolution',))
(line    3) broken    https://www.w3.org/TR/2006/REC-xml-names-20060816/#defaulting - HTTPSConnectionPool(host='www.w3.org', port=443): Max retries exceeded with url: /TR/2006/REC-xml-names-20060816/ (Caused by NewConnectionError('<urllib3.connection.VerifiedHTTPSConnection object at 0xf4bb4cec>: Failed to establish a new connection: [Errno -3] Temporary failure in name resolution',))
(line   10) broken    http://example.com#!bar - HTTPConnectionPool(host='example.com', port=80): Max retries exceeded with url: / (Caused by NewConnectionError('<urllib3.connection.HTTPConnection object at 0xf4a19dac>: Failed to establish a new connection: [Errno -3] Temporary failure in name resolution',))
(line   11) broken    http://example.com/#top - HTTPConnectionPool(host='example.com', port=80): Max retries exceeded with url: / (Caused by NewConnectionError('<urllib3.connection.HTTPConnection object at 0xf4359aac>: Failed to establish a new connection: [Errno -3] Temporary failure in name resolution',))


# warning: 
/tmp/B.ctoCc1/BUILD/Sphinx-1.5.5/tests/build/linkcheck/links.txt:9: WARNING: Duplicate explicit target name: "example bar invalid".
/tmp/B.ctoCc1/BUILD/Sphinx-1.5.5/tests/build/linkcheck/links.txt:9: WARNING: Duplicate explicit target name: "example bar invalid".
/tmp/B.ctoCc1/BUILD/Sphinx-1.5.5/tests/build/linkcheck/links.txt:5: ERROR: Unknown target name: "http://www.sphinx-doc.org/en/1.4.8/tutorial.html#install-sphinx".

_____________________________ test_anchors_ignored _____________________________

app = <SphinxTestApp buildername='linkcheck'>
status = <StringIO.StringIO instance at 0xf4a19b6c>
warning = <StringIO.StringIO instance at 0xf4a194ec>

    @pytest.mark.sphinx(
        'linkcheck', testroot='linkcheck', freshenv=True,
        confoverrides={'linkcheck_anchors_ignore': ["^!", "^top$"]})
    def test_anchors_ignored(app, status, warning):
        app.builder.build_all()
    
        assert (app.outdir / 'output.txt').exists()
        content = (app.outdir / 'output.txt').text()
    
        # expect all ok when excluding #top
>       assert not content
E       assert not "links.txt:10: [broken] http://example.com#!bar: HTTPConnectionPool(host='example.com', port=80): Max retries exceeded...tion object at 0xf45e920c>: Failed to establish a new connection: [Errno -3] Temporary failure in name resolution',))\n"

tests/test_build_linkcheck.py:39: AssertionError
--------------------------- Captured stdout teardown ---------------------------
# testroot: linkcheck
# builder: linkcheck
# srcdir: /tmp/B.ctoCc1/BUILD/Sphinx-1.5.5/tests/build/linkcheck
# outdir: /tmp/B.ctoCc1/BUILD/Sphinx-1.5.5/tests/build/linkcheck/_build/linkcheck
# status: 
Running Sphinx v1.5.5
building [linkcheck]: all source files
updating environment: 1 added, 0 changed, 0 removed
reading sources... [100%] links                                                
looking for now-outdated files... none found
pickling environment... done
checking consistency... done
preparing documents... done
writing output... [100%] links                                                 
(line   10) broken    http://example.com#!bar - HTTPConnectionPool(host='example.com', port=80): Max retries exceeded with url: / (Caused by NewConnectionError('<urllib3.connection.HTTPConnection object at 0xf483166c>: Failed to establish a new connection: [Errno -3] Temporary failure in name resolution',))
(line    3) broken    https://www.w3.org/TR/2006/REC-xml-names-20060816/#defaulting - HTTPSConnectionPool(host='www.w3.org', port=443): Max retries exceeded with url: /TR/2006/REC-xml-names-20060816/ (Caused by NewConnectionError('<urllib3.connection.VerifiedHTTPSConnection object at 0xf4b6a94c>: Failed to establish a new connection: [Errno -3] Temporary failure in name resolution',))
(line    9) broken    http://example.com/#!bar - HTTPConnectionPool(host='example.com', port=80): Max retries exceeded with url: / (Caused by NewConnectionError('<urllib3.connection.HTTPConnection object at 0xf4cae9cc>: Failed to establish a new connection: [Errno -3] Temporary failure in name resolution',))
(line   11) broken    http://example.com/#top - HTTPConnectionPool(host='example.com', port=80): Max retries exceeded with url: / (Caused by NewConnectionError('<urllib3.connection.HTTPConnection object at 0xf45e920c>: Failed to establish a new connection: [Errno -3] Temporary failure in name resolution',))


# warning: 
/tmp/B.ctoCc1/BUILD/Sphinx-1.5.5/tests/build/linkcheck/links.txt:9: WARNING: Duplicate explicit target name: "example bar invalid".
/tmp/B.ctoCc1/BUILD/Sphinx-1.5.5/tests/build/linkcheck/links.txt:9: WARNING: Duplicate explicit target name: "example bar invalid".
/tmp/B.ctoCc1/BUILD/Sphinx-1.5.5/tests/build/linkcheck/links.txt:5: ERROR: Unknown target name: "http://www.sphinx-doc.org/en/1.4.8/tutorial.html#install-sphinx".

============== 2 failed, 850 passed, 4 skipped in 135.29 seconds ===============
error: Bad exit status from /tmp/B.ctoCc1/BUILD/tmp/rpm-tmp.69687 (%build)


RPM build errors:
    Bad exit status from /tmp/B.ctoCc1/BUILD/tmp/rpm-tmp.69687 (%build)
ended at: Tue Nov 28 10:07:55 2017, done in 0:02:18.728393
error: No files produced.
+ chmod -R u+rwX /tmp/B.ctoCc1/BUILD
+ rm -rf /tmp/B.ctoCc1/tmp /tmp/B.ctoCc1/BUILD
+ rm -rf /tmp/B.ctoCc1
Begin-PLD-Builder-Info
Build-Time: user:115.24s sys:2.86s real:145.99s (faults io:0 non-io:361597)

End-PLD-Builder-Info
[Back to list of logs] [View rpm -qa of builder]