FailedOk

th/SRPMS[OK]
th/x32[OK]
th/i686[OK]
th/x86_64[OK]

ac/SRPMS[OK]
ac/i386[OK]
ac/i586[OK]
ac/i686[OK]
ac/alpha[OK]
ac/amd64[OK]
ac/athlon[OK]
ac/ppc[OK]
ac/sparc[OK]
ac/sparc64[OK]

Advanced Search
main()
Powered by PLD Linux
(c) 2002-2019 PLD Team
$Revision: 1.37 $
Powered by Star Treck.
Your IP: 54.210.61.41

systemd d184de28-df1f-4c6c-9a3d-92bdf985c841

Status:Failed
Source URL:ftp://buildlogs.pld-linux.org/th/i686/FAIL/systemd,d184de28-df1f-4c6c-9a3d-92bdf985c841.bz2
text/plain URL:View!
full text:View!
rpm -qa of builder:View!
Date:2019/02/08 22:34:42
Runtime:0:00:40.692073

Toc:

  • error 1
  • /usr/bin/ld: /usr/lib/libgnutls.so: undefined reference to `_idn2_punycode_decode@IDN2_0.0.0'
  • error 2
  • collect2: error: ld returned 1 exit status
  • error 3
  • error: Bad exit status from /tmp/B.JN6jpr/BUILD/tmp/rpm-tmp.44280 (%build)
  • error 4
  • RPM build errors:
  • error 5
  • error: No files produced.

Content:

[534/1582] /usr/bin/meson --internal exe /tmp/B.JN6jpr/BUILD/systemd-239/build/meson-private/meson_exe_generate-sym-test.py_85bf5dfc10a0d1beb9792b65dffd4cc10d4ea4ff.dat
[535/1582] /usr/bin/meson --internal exe /tmp/B.JN6jpr/BUILD/systemd-239/build/meson-private/meson_exe_awk_0e7cebf2e7408aa6ec815d3293f861dbb2bbeaff.dat
[536/1582] i686-pld-linux-gcc -Inss_systemd@sha -I. -I.. -Isrc/basic -I../src/basic -Isrc/shared -I../src/shared -Isrc/systemd -I../src/systemd -Isrc/journal -I../src/journal -Isrc/journal-remote -I../src/journal-remote -Isrc/nspawn -I../src/nspawn -Isrc/resolve -I../src/resolve -Isrc/timesync -I../src/timesync -I../src/time-wait-sync -Isrc/login -I../src/login -Isrc/udev -I../src/udev -Isrc/libudev -I../src/libudev -Isrc/core -I../src/core -I../src/libsystemd/sd-bus -I../src/libsystemd/sd-device -I../src/libsystemd/sd-hwdb -I../src/libsystemd/sd-id128 -I../src/libsystemd/sd-netlink -I../src/libsystemd/sd-network -Isrc/libsystemd-network -I../src/libsystemd-network -I../ -fdiagnostics-color=always -pipe -D_FILE_OFFSET_BITS=64 -std=gnu99 -Wextra -Werror=undef -Wlogical-op -Wmissing-include-dirs -Wold-style-definition -Wpointer-arith -Winit-self -Wfloat-equal -Wsuggest-attribute=noreturn -Werror=missing-prototypes -Werror=implicit-function-declaration -Werror=missing-declarations -Werror=return-type -Werror=incompatible-pointer-types -Werror=format=2 -Wstrict-prototypes -Wredundant-decls -Wmissing-noreturn -Wimplicit-fallthrough=5 -Wshadow -Wendif-labels -Wstrict-aliasing=2 -Wwrite-strings -Werror=overflow -Werror=shift-count-overflow -Werror=shift-overflow=2 -Wdate-time -Wnested-externs -ffast-math -fno-common -fdiagnostics-show-option -fno-strict-aliasing -fvisibility=hidden -fstack-protector -fstack-protector-strong --param=ssp-buffer-size=4 -fPIE -ffunction-sections -fdata-sections -Wno-unused-parameter -Wno-missing-field-initializers -Wno-unused-result -Wno-format-signedness -Wno-error=nonnull -Werror=shadow -include config.h -O2 -fwrapv -Wformat -Werror=format-security -gdwarf-4 -fno-debug-types-section -fvar-tracking-assignments -g2 -Wp,-D_FORTIFY_SOURCE=2 -fstack-protector-strong --param=ssp-buffer-size=4 -fomit-frame-pointer -march=i686 -fasynchronous-unwind-tables -mtune=pentium4 -gdwarf-4 -fno-debug-types-section -fvar-tracking-assignments -g2 -fPIC -pthread  -MD -MQ 'nss_systemd@sha/src_nss-systemd_nss-systemd.c.o' -MF 'nss_systemd@sha/src_nss-systemd_nss-systemd.c.o.d' -o 'nss_systemd@sha/src_nss-systemd_nss-systemd.c.o' -c ../src/nss-systemd/nss-systemd.c
[537/1582] /usr/bin/meson --internal exe /tmp/B.JN6jpr/BUILD/systemd-239/build/meson-private/meson_exe_generate-sym-test.py_0c4fdbdde922513cc8aea7caf528d656783b6a58.dat
[538/1582] i686-pld-linux-gcc  -o libnss_myhostname.so.2 'nss_myhostname@sha/src_nss-myhostname_nss-myhostname.c.o' -Wl,--no-undefined -Wl,--as-needed -shared -fPIC -Wl,--start-group -Wl,-soname,libnss_myhostname.so.2 -Wl,-z,relro -Wl,-z,now -pie -Wl,--gc-sections -O2 -fwrapv -pipe -Wformat -Werror=format-security -gdwarf-4 -fno-debug-types-section -fvar-tracking-assignments -g2 -Wp,-D_FORTIFY_SOURCE=2 -fstack-protector-strong --param=ssp-buffer-size=4 -fomit-frame-pointer -march=i686 -fasynchronous-unwind-tables -mtune=pentium4 -gdwarf-4 -fno-debug-types-section -fvar-tracking-assignments -g2 -Wl,--as-needed -Wl,--no-copy-dt-needed-entries -Wl,-z,relro -Wl,-z,combreloc src/libsystemd/libsystemd_static.a src/basic/libbasic.a -Wl,-z,nodelete -shared -Wl,--version-script=/tmp/B.JN6jpr/BUILD/systemd-239/src/nss-myhostname/nss-myhostname.sym -Wl,--undefined -lrt -lrt /usr/lib/libcap.so /usr/lib/libblkid.so /usr/lib/libmount.so /usr/lib/libselinux.so -Wl,--end-group -pthread '-Wl,-rpath,$ORIGIN/src/libsystemd:$ORIGIN/src/basic' -Wl,-rpath-link,/tmp/B.JN6jpr/BUILD/systemd-239/build/src/libsystemd:/tmp/B.JN6jpr/BUILD/systemd-239/build/src/basic  
[539/1582] i686-pld-linux-gcc -Inss_mymachines@sha -I. -I.. -Isrc/basic -I../src/basic -Isrc/shared -I../src/shared -Isrc/systemd -I../src/systemd -Isrc/journal -I../src/journal -Isrc/journal-remote -I../src/journal-remote -Isrc/nspawn -I../src/nspawn -Isrc/resolve -I../src/resolve -Isrc/timesync -I../src/timesync -I../src/time-wait-sync -Isrc/login -I../src/login -Isrc/udev -I../src/udev -Isrc/libudev -I../src/libudev -Isrc/core -I../src/core -I../src/libsystemd/sd-bus -I../src/libsystemd/sd-device -I../src/libsystemd/sd-hwdb -I../src/libsystemd/sd-id128 -I../src/libsystemd/sd-netlink -I../src/libsystemd/sd-network -Isrc/libsystemd-network -I../src/libsystemd-network -I../ -fdiagnostics-color=always -pipe -D_FILE_OFFSET_BITS=64 -std=gnu99 -Wextra -Werror=undef -Wlogical-op -Wmissing-include-dirs -Wold-style-definition -Wpointer-arith -Winit-self -Wfloat-equal -Wsuggest-attribute=noreturn -Werror=missing-prototypes -Werror=implicit-function-declaration -Werror=missing-declarations -Werror=return-type -Werror=incompatible-pointer-types -Werror=format=2 -Wstrict-prototypes -Wredundant-decls -Wmissing-noreturn -Wimplicit-fallthrough=5 -Wshadow -Wendif-labels -Wstrict-aliasing=2 -Wwrite-strings -Werror=overflow -Werror=shift-count-overflow -Werror=shift-overflow=2 -Wdate-time -Wnested-externs -ffast-math -fno-common -fdiagnostics-show-option -fno-strict-aliasing -fvisibility=hidden -fstack-protector -fstack-protector-strong --param=ssp-buffer-size=4 -fPIE -ffunction-sections -fdata-sections -Wno-unused-parameter -Wno-missing-field-initializers -Wno-unused-result -Wno-format-signedness -Wno-error=nonnull -Werror=shadow -include config.h -O2 -fwrapv -Wformat -Werror=format-security -gdwarf-4 -fno-debug-types-section -fvar-tracking-assignments -g2 -Wp,-D_FORTIFY_SOURCE=2 -fstack-protector-strong --param=ssp-buffer-size=4 -fomit-frame-pointer -march=i686 -fasynchronous-unwind-tables -mtune=pentium4 -gdwarf-4 -fno-debug-types-section -fvar-tracking-assignments -g2 -fPIC -pthread  -MD -MQ 'nss_mymachines@sha/src_nss-mymachines_nss-mymachines.c.o' -MF 'nss_mymachines@sha/src_nss-mymachines_nss-mymachines.c.o.d' -o 'nss_mymachines@sha/src_nss-mymachines_nss-mymachines.c.o' -c ../src/nss-mymachines/nss-mymachines.c
[540/1582] /usr/bin/meson --internal exe /tmp/B.JN6jpr/BUILD/systemd-239/build/meson-private/meson_exe_awk_a2f679d40ec1141fb431981db43e4f6e2809b5d0.dat
[541/1582] /tmp/B.JN6jpr/BUILD/systemd-239/test/sys-script.py /tmp/B.JN6jpr/BUILD/systemd-239/build/test
[542/1582] /usr/bin/meson --internal exe /tmp/B.JN6jpr/BUILD/systemd-239/build/meson-private/meson_exe_generate-dns_type-gperf.py_2de0d4cb76e7a586561344da0fca058cf0015db7.dat
[543/1582] i686-pld-linux-gcc  -o libnss_systemd.so.2 'nss_systemd@sha/src_nss-systemd_nss-systemd.c.o' -Wl,--no-undefined -Wl,--as-needed -shared -fPIC -Wl,--start-group -Wl,-soname,libnss_systemd.so.2 -Wl,-z,relro -Wl,-z,now -pie -Wl,--gc-sections -O2 -fwrapv -pipe -Wformat -Werror=format-security -gdwarf-4 -fno-debug-types-section -fvar-tracking-assignments -g2 -Wp,-D_FORTIFY_SOURCE=2 -fstack-protector-strong --param=ssp-buffer-size=4 -fomit-frame-pointer -march=i686 -fasynchronous-unwind-tables -mtune=pentium4 -gdwarf-4 -fno-debug-types-section -fvar-tracking-assignments -g2 -Wl,--as-needed -Wl,--no-copy-dt-needed-entries -Wl,-z,relro -Wl,-z,combreloc src/libsystemd/libsystemd_static.a src/basic/libbasic.a -Wl,-z,nodelete -shared -Wl,--version-script=/tmp/B.JN6jpr/BUILD/systemd-239/src/nss-systemd/nss-systemd.sym -Wl,--undefined -lrt -lrt /usr/lib/libcap.so /usr/lib/libblkid.so /usr/lib/libmount.so /usr/lib/libselinux.so -Wl,--end-group -pthread '-Wl,-rpath,$ORIGIN/src/libsystemd:$ORIGIN/src/basic' -Wl,-rpath-link,/tmp/B.JN6jpr/BUILD/systemd-239/build/src/libsystemd:/tmp/B.JN6jpr/BUILD/systemd-239/build/src/basic  
[544/1582] i686-pld-linux-gcc -Isystemd-journald@exe -I. -I.. -Isrc/basic -I../src/basic -Isrc/shared -I../src/shared -Isrc/systemd -I../src/systemd -Isrc/journal -I../src/journal -Isrc/journal-remote -I../src/journal-remote -Isrc/nspawn -I../src/nspawn -Isrc/resolve -I../src/resolve -Isrc/timesync -I../src/timesync -I../src/time-wait-sync -Isrc/login -I../src/login -Isrc/udev -I../src/udev -Isrc/libudev -I../src/libudev -Isrc/core -I../src/core -I../src/libsystemd/sd-bus -I../src/libsystemd/sd-device -I../src/libsystemd/sd-hwdb -I../src/libsystemd/sd-id128 -I../src/libsystemd/sd-netlink -I../src/libsystemd/sd-network -Isrc/libsystemd-network -I../src/libsystemd-network -I../ -fdiagnostics-color=always -pipe -D_FILE_OFFSET_BITS=64 -std=gnu99 -Wextra -Werror=undef -Wlogical-op -Wmissing-include-dirs -Wold-style-definition -Wpointer-arith -Winit-self -Wfloat-equal -Wsuggest-attribute=noreturn -Werror=missing-prototypes -Werror=implicit-function-declaration -Werror=missing-declarations -Werror=return-type -Werror=incompatible-pointer-types -Werror=format=2 -Wstrict-prototypes -Wredundant-decls -Wmissing-noreturn -Wimplicit-fallthrough=5 -Wshadow -Wendif-labels -Wstrict-aliasing=2 -Wwrite-strings -Werror=overflow -Werror=shift-count-overflow -Werror=shift-overflow=2 -Wdate-time -Wnested-externs -ffast-math -fno-common -fdiagnostics-show-option -fno-strict-aliasing -fvisibility=hidden -fstack-protector -fstack-protector-strong --param=ssp-buffer-size=4 -fPIE -ffunction-sections -fdata-sections -Wno-unused-parameter -Wno-missing-field-initializers -Wno-unused-result -Wno-format-signedness -Wno-error=nonnull -Werror=shadow -include config.h -O2 -fwrapv -Wformat -Werror=format-security -gdwarf-4 -fno-debug-types-section -fvar-tracking-assignments -g2 -Wp,-D_FORTIFY_SOURCE=2 -fstack-protector-strong --param=ssp-buffer-size=4 -fomit-frame-pointer -march=i686 -fasynchronous-unwind-tables -mtune=pentium4 -gdwarf-4 -fno-debug-types-section -fvar-tracking-assignments -g2 -pthread  -MD -MQ 'systemd-journald@exe/src_journal_journald.c.o' -MF 'systemd-journald@exe/src_journal_journald.c.o.d' -o 'systemd-journald@exe/src_journal_journald.c.o' -c ../src/journal/journald.c
[545/1582] i686-pld-linux-gcc -Isystemd-analyze@exe -I. -I.. -Isrc/basic -I../src/basic -Isrc/shared -I../src/shared -Isrc/systemd -I../src/systemd -Isrc/journal -I../src/journal -Isrc/journal-remote -I../src/journal-remote -Isrc/nspawn -I../src/nspawn -Isrc/resolve -I../src/resolve -Isrc/timesync -I../src/timesync -I../src/time-wait-sync -Isrc/login -I../src/login -Isrc/udev -I../src/udev -Isrc/libudev -I../src/libudev -Isrc/core -I../src/core -I../src/libsystemd/sd-bus -I../src/libsystemd/sd-device -I../src/libsystemd/sd-hwdb -I../src/libsystemd/sd-id128 -I../src/libsystemd/sd-netlink -I../src/libsystemd/sd-network -Isrc/libsystemd-network -I../src/libsystemd-network -I../ -I/usr/include/libmount -I/usr/include/blkid -I/usr/include/uuid -fdiagnostics-color=always -pipe -D_FILE_OFFSET_BITS=64 -std=gnu99 -Wextra -Werror=undef -Wlogical-op -Wmissing-include-dirs -Wold-style-definition -Wpointer-arith -Winit-self -Wfloat-equal -Wsuggest-attribute=noreturn -Werror=missing-prototypes -Werror=implicit-function-declaration -Werror=missing-declarations -Werror=return-type -Werror=incompatible-pointer-types -Werror=format=2 -Wstrict-prototypes -Wredundant-decls -Wmissing-noreturn -Wimplicit-fallthrough=5 -Wshadow -Wendif-labels -Wstrict-aliasing=2 -Wwrite-strings -Werror=overflow -Werror=shift-count-overflow -Werror=shift-overflow=2 -Wdate-time -Wnested-externs -ffast-math -fno-common -fdiagnostics-show-option -fno-strict-aliasing -fvisibility=hidden -fstack-protector -fstack-protector-strong --param=ssp-buffer-size=4 -fPIE -ffunction-sections -fdata-sections -Wno-unused-parameter -Wno-missing-field-initializers -Wno-unused-result -Wno-format-signedness -Wno-error=nonnull -Werror=shadow -include config.h -O2 -fwrapv -Wformat -Werror=format-security -gdwarf-4 -fno-debug-types-section -fvar-tracking-assignments -g2 -Wp,-D_FORTIFY_SOURCE=2 -fstack-protector-strong --param=ssp-buffer-size=4 -fomit-frame-pointer -march=i686 -fasynchronous-unwind-tables -mtune=pentium4 -gdwarf-4 -fno-debug-types-section -fvar-tracking-assignments -g2 -pthread  -MD -MQ 'systemd-analyze@exe/src_analyze_analyze-verify.c.o' -MF 'systemd-analyze@exe/src_analyze_analyze-verify.c.o.d' -o 'systemd-analyze@exe/src_analyze_analyze-verify.c.o' -c ../src/analyze/analyze-verify.c
[546/1582] i686-pld-linux-gcc -Inss_resolve@sha -I. -I.. -Isrc/basic -I../src/basic -Isrc/shared -I../src/shared -Isrc/systemd -I../src/systemd -Isrc/journal -I../src/journal -Isrc/journal-remote -I../src/journal-remote -Isrc/nspawn -I../src/nspawn -Isrc/resolve -I../src/resolve -Isrc/timesync -I../src/timesync -I../src/time-wait-sync -Isrc/login -I../src/login -Isrc/udev -I../src/udev -Isrc/libudev -I../src/libudev -Isrc/core -I../src/core -I../src/libsystemd/sd-bus -I../src/libsystemd/sd-device -I../src/libsystemd/sd-hwdb -I../src/libsystemd/sd-id128 -I../src/libsystemd/sd-netlink -I../src/libsystemd/sd-network -Isrc/libsystemd-network -I../src/libsystemd-network -I../ -fdiagnostics-color=always -pipe -D_FILE_OFFSET_BITS=64 -std=gnu99 -Wextra -Werror=undef -Wlogical-op -Wmissing-include-dirs -Wold-style-definition -Wpointer-arith -Winit-self -Wfloat-equal -Wsuggest-attribute=noreturn -Werror=missing-prototypes -Werror=implicit-function-declaration -Werror=missing-declarations -Werror=return-type -Werror=incompatible-pointer-types -Werror=format=2 -Wstrict-prototypes -Wredundant-decls -Wmissing-noreturn -Wimplicit-fallthrough=5 -Wshadow -Wendif-labels -Wstrict-aliasing=2 -Wwrite-strings -Werror=overflow -Werror=shift-count-overflow -Werror=shift-overflow=2 -Wdate-time -Wnested-externs -ffast-math -fno-common -fdiagnostics-show-option -fno-strict-aliasing -fvisibility=hidden -fstack-protector -fstack-protector-strong --param=ssp-buffer-size=4 -fPIE -ffunction-sections -fdata-sections -Wno-unused-parameter -Wno-missing-field-initializers -Wno-unused-result -Wno-format-signedness -Wno-error=nonnull -Werror=shadow -include config.h -O2 -fwrapv -Wformat -Werror=format-security -gdwarf-4 -fno-debug-types-section -fvar-tracking-assignments -g2 -Wp,-D_FORTIFY_SOURCE=2 -fstack-protector-strong --param=ssp-buffer-size=4 -fomit-frame-pointer -march=i686 -fasynchronous-unwind-tables -mtune=pentium4 -gdwarf-4 -fno-debug-types-section -fvar-tracking-assignments -g2 -fPIC -pthread  -MD -MQ 'nss_resolve@sha/src_nss-resolve_nss-resolve.c.o' -MF 'nss_resolve@sha/src_nss-resolve_nss-resolve.c.o.d' -o 'nss_resolve@sha/src_nss-resolve_nss-resolve.c.o' -c ../src/nss-resolve/nss-resolve.c
[547/1582] i686-pld-linux-gcc -Ijournalctl@exe -I. -I.. -Isrc/basic -I../src/basic -Isrc/shared -I../src/shared -Isrc/systemd -I../src/systemd -Isrc/journal -I../src/journal -Isrc/journal-remote -I../src/journal-remote -Isrc/nspawn -I../src/nspawn -Isrc/resolve -I../src/resolve -Isrc/timesync -I../src/timesync -I../src/time-wait-sync -Isrc/login -I../src/login -Isrc/udev -I../src/udev -Isrc/libudev -I../src/libudev -Isrc/core -I../src/core -I../src/libsystemd/sd-bus -I../src/libsystemd/sd-device -I../src/libsystemd/sd-hwdb -I../src/libsystemd/sd-id128 -I../src/libsystemd/sd-netlink -I../src/libsystemd/sd-network -Isrc/libsystemd-network -I../src/libsystemd-network -I../ -fdiagnostics-color=always -pipe -D_FILE_OFFSET_BITS=64 -std=gnu99 -Wextra -Werror=undef -Wlogical-op -Wmissing-include-dirs -Wold-style-definition -Wpointer-arith -Winit-self -Wfloat-equal -Wsuggest-attribute=noreturn -Werror=missing-prototypes -Werror=implicit-function-declaration -Werror=missing-declarations -Werror=return-type -Werror=incompatible-pointer-types -Werror=format=2 -Wstrict-prototypes -Wredundant-decls -Wmissing-noreturn -Wimplicit-fallthrough=5 -Wshadow -Wendif-labels -Wstrict-aliasing=2 -Wwrite-strings -Werror=overflow -Werror=shift-count-overflow -Werror=shift-overflow=2 -Wdate-time -Wnested-externs -ffast-math -fno-common -fdiagnostics-show-option -fno-strict-aliasing -fvisibility=hidden -fstack-protector -fstack-protector-strong --param=ssp-buffer-size=4 -fPIE -ffunction-sections -fdata-sections -Wno-unused-parameter -Wno-missing-field-initializers -Wno-unused-result -Wno-format-signedness -Wno-error=nonnull -Werror=shadow -include config.h -O2 -fwrapv -Wformat -Werror=format-security -gdwarf-4 -fno-debug-types-section -fvar-tracking-assignments -g2 -Wp,-D_FORTIFY_SOURCE=2 -fstack-protector-strong --param=ssp-buffer-size=4 -fomit-frame-pointer -march=i686 -fasynchronous-unwind-tables -mtune=pentium4 -gdwarf-4 -fno-debug-types-section -fvar-tracking-assignments -g2 -pthread  -MD -MQ 'journalctl@exe/src_journal_journal-qrcode.c.o' -MF 'journalctl@exe/src_journal_journal-qrcode.c.o.d' -o 'journalctl@exe/src_journal_journal-qrcode.c.o' -c ../src/journal/journal-qrcode.c
[548/1582] i686-pld-linux-gcc  -o systemd-journald 'systemd-journald@exe/src_journal_journald.c.o' -Wl,--no-undefined -Wl,--as-needed -Wl,-z,relro -Wl,-z,now -pie -Wl,--gc-sections -O2 -fwrapv -pipe -Wformat -Werror=format-security -gdwarf-4 -fno-debug-types-section -fvar-tracking-assignments -g2 -Wp,-D_FORTIFY_SOURCE=2 -fstack-protector-strong --param=ssp-buffer-size=4 -fomit-frame-pointer -march=i686 -fasynchronous-unwind-tables -mtune=pentium4 -gdwarf-4 -fno-debug-types-section -fvar-tracking-assignments -g2 -Wl,--as-needed -Wl,--no-copy-dt-needed-entries -Wl,-z,relro -Wl,-z,combreloc -Wl,--start-group libjournal-core.a src/shared/libsystemd-shared-239.so /usr/lib/liblzma.so /usr/lib/liblz4.so /usr/lib/libselinux.so -Wl,--end-group -pthread '-Wl,-rpath,$ORIGIN/:$ORIGIN/src/shared' -Wl,-rpath-link,/tmp/B.JN6jpr/BUILD/systemd-239/build/:/tmp/B.JN6jpr/BUILD/systemd-239/build/src/shared  
[549/1582] i686-pld-linux-gcc  -o libnss_mymachines.so.2 'nss_mymachines@sha/src_nss-mymachines_nss-mymachines.c.o' -Wl,--no-undefined -Wl,--as-needed -shared -fPIC -Wl,--start-group -Wl,-soname,libnss_mymachines.so.2 -Wl,-z,relro -Wl,-z,now -pie -Wl,--gc-sections -O2 -fwrapv -pipe -Wformat -Werror=format-security -gdwarf-4 -fno-debug-types-section -fvar-tracking-assignments -g2 -Wp,-D_FORTIFY_SOURCE=2 -fstack-protector-strong --param=ssp-buffer-size=4 -fomit-frame-pointer -march=i686 -fasynchronous-unwind-tables -mtune=pentium4 -gdwarf-4 -fno-debug-types-section -fvar-tracking-assignments -g2 -Wl,--as-needed -Wl,--no-copy-dt-needed-entries -Wl,-z,relro -Wl,-z,combreloc src/libsystemd/libsystemd_static.a src/basic/libbasic.a -Wl,-z,nodelete -shared -Wl,--version-script=/tmp/B.JN6jpr/BUILD/systemd-239/src/nss-mymachines/nss-mymachines.sym -Wl,--undefined -lrt -lrt /usr/lib/libcap.so /usr/lib/libblkid.so /usr/lib/libmount.so /usr/lib/libselinux.so -Wl,--end-group -pthread '-Wl,-rpath,$ORIGIN/src/libsystemd:$ORIGIN/src/basic' -Wl,-rpath-link,/tmp/B.JN6jpr/BUILD/systemd-239/build/src/libsystemd:/tmp/B.JN6jpr/BUILD/systemd-239/build/src/basic  
[550/1582] i686-pld-linux-gcc -Isystemd-cat@exe -I. -I.. -Isrc/basic -I../src/basic -Isrc/shared -I../src/shared -Isrc/systemd -I../src/systemd -Isrc/journal -I../src/journal -Isrc/journal-remote -I../src/journal-remote -Isrc/nspawn -I../src/nspawn -Isrc/resolve -I../src/resolve -Isrc/timesync -I../src/timesync -I../src/time-wait-sync -Isrc/login -I../src/login -Isrc/udev -I../src/udev -Isrc/libudev -I../src/libudev -Isrc/core -I../src/core -I../src/libsystemd/sd-bus -I../src/libsystemd/sd-device -I../src/libsystemd/sd-hwdb -I../src/libsystemd/sd-id128 -I../src/libsystemd/sd-netlink -I../src/libsystemd/sd-network -Isrc/libsystemd-network -I../src/libsystemd-network -I../ -fdiagnostics-color=always -pipe -D_FILE_OFFSET_BITS=64 -std=gnu99 -Wextra -Werror=undef -Wlogical-op -Wmissing-include-dirs -Wold-style-definition -Wpointer-arith -Winit-self -Wfloat-equal -Wsuggest-attribute=noreturn -Werror=missing-prototypes -Werror=implicit-function-declaration -Werror=missing-declarations -Werror=return-type -Werror=incompatible-pointer-types -Werror=format=2 -Wstrict-prototypes -Wredundant-decls -Wmissing-noreturn -Wimplicit-fallthrough=5 -Wshadow -Wendif-labels -Wstrict-aliasing=2 -Wwrite-strings -Werror=overflow -Werror=shift-count-overflow -Werror=shift-overflow=2 -Wdate-time -Wnested-externs -ffast-math -fno-common -fdiagnostics-show-option -fno-strict-aliasing -fvisibility=hidden -fstack-protector -fstack-protector-strong --param=ssp-buffer-size=4 -fPIE -ffunction-sections -fdata-sections -Wno-unused-parameter -Wno-missing-field-initializers -Wno-unused-result -Wno-format-signedness -Wno-error=nonnull -Werror=shadow -include config.h -O2 -fwrapv -Wformat -Werror=format-security -gdwarf-4 -fno-debug-types-section -fvar-tracking-assignments -g2 -Wp,-D_FORTIFY_SOURCE=2 -fstack-protector-strong --param=ssp-buffer-size=4 -fomit-frame-pointer -march=i686 -fasynchronous-unwind-tables -mtune=pentium4 -gdwarf-4 -fno-debug-types-section -fvar-tracking-assignments -g2 -pthread  -MD -MQ 'systemd-cat@exe/src_journal_cat.c.o' -MF 'systemd-cat@exe/src_journal_cat.c.o.d' -o 'systemd-cat@exe/src_journal_cat.c.o' -c ../src/journal/cat.c
[551/1582] i686-pld-linux-gcc  -o systemd-cat 'systemd-cat@exe/src_journal_cat.c.o' -Wl,--no-undefined -Wl,--as-needed -Wl,-z,relro -Wl,-z,now -pie -Wl,--gc-sections -O2 -fwrapv -pipe -Wformat -Werror=format-security -gdwarf-4 -fno-debug-types-section -fvar-tracking-assignments -g2 -Wp,-D_FORTIFY_SOURCE=2 -fstack-protector-strong --param=ssp-buffer-size=4 -fomit-frame-pointer -march=i686 -fasynchronous-unwind-tables -mtune=pentium4 -gdwarf-4 -fno-debug-types-section -fvar-tracking-assignments -g2 -Wl,--as-needed -Wl,--no-copy-dt-needed-entries -Wl,-z,relro -Wl,-z,combreloc -Wl,--start-group libjournal-core.a src/shared/libsystemd-shared-239.so -Wl,--end-group -pthread '-Wl,-rpath,$ORIGIN/:$ORIGIN/src/shared' -Wl,-rpath-link,/tmp/B.JN6jpr/BUILD/systemd-239/build/:/tmp/B.JN6jpr/BUILD/systemd-239/build/src/shared  
[552/1582] i686-pld-linux-gcc  -o libnss_resolve.so.2 'nss_resolve@sha/src_nss-resolve_nss-resolve.c.o' -Wl,--no-undefined -Wl,--as-needed -shared -fPIC -Wl,--start-group -Wl,-soname,libnss_resolve.so.2 -Wl,-z,relro -Wl,-z,now -pie -Wl,--gc-sections -O2 -fwrapv -pipe -Wformat -Werror=format-security -gdwarf-4 -fno-debug-types-section -fvar-tracking-assignments -g2 -Wp,-D_FORTIFY_SOURCE=2 -fstack-protector-strong --param=ssp-buffer-size=4 -fomit-frame-pointer -march=i686 -fasynchronous-unwind-tables -mtune=pentium4 -gdwarf-4 -fno-debug-types-section -fvar-tracking-assignments -g2 -Wl,--as-needed -Wl,--no-copy-dt-needed-entries -Wl,-z,relro -Wl,-z,combreloc src/libsystemd/libsystemd_static.a src/basic/libbasic.a -Wl,-z,nodelete -shared -Wl,--version-script=/tmp/B.JN6jpr/BUILD/systemd-239/src/nss-resolve/nss-resolve.sym -Wl,--undefined -lrt -lrt /usr/lib/libcap.so /usr/lib/libblkid.so /usr/lib/libmount.so /usr/lib/libselinux.so -Wl,--end-group -pthread '-Wl,-rpath,$ORIGIN/src/libsystemd:$ORIGIN/src/basic' -Wl,-rpath-link,/tmp/B.JN6jpr/BUILD/systemd-239/build/src/libsystemd:/tmp/B.JN6jpr/BUILD/systemd-239/build/src/basic  
[553/1582] i686-pld-linux-gcc -Isystemd-fstab-generator@exe -I. -I.. -Isrc/basic -I../src/basic -Isrc/shared -I../src/shared -Isrc/systemd -I../src/systemd -Isrc/journal -I../src/journal -Isrc/journal-remote -I../src/journal-remote -Isrc/nspawn -I../src/nspawn -Isrc/resolve -I../src/resolve -Isrc/timesync -I../src/timesync -I../src/time-wait-sync -Isrc/login -I../src/login -Isrc/udev -I../src/udev -Isrc/libudev -I../src/libudev -Isrc/core -I../src/core -I../src/libsystemd/sd-bus -I../src/libsystemd/sd-device -I../src/libsystemd/sd-hwdb -I../src/libsystemd/sd-id128 -I../src/libsystemd/sd-netlink -I../src/libsystemd/sd-network -Isrc/libsystemd-network -I../src/libsystemd-network -I../ -fdiagnostics-color=always -pipe -D_FILE_OFFSET_BITS=64 -std=gnu99 -Wextra -Werror=undef -Wlogical-op -Wmissing-include-dirs -Wold-style-definition -Wpointer-arith -Winit-self -Wfloat-equal -Wsuggest-attribute=noreturn -Werror=missing-prototypes -Werror=implicit-function-declaration -Werror=missing-declarations -Werror=return-type -Werror=incompatible-pointer-types -Werror=format=2 -Wstrict-prototypes -Wredundant-decls -Wmissing-noreturn -Wimplicit-fallthrough=5 -Wshadow -Wendif-labels -Wstrict-aliasing=2 -Wwrite-strings -Werror=overflow -Werror=shift-count-overflow -Werror=shift-overflow=2 -Wdate-time -Wnested-externs -ffast-math -fno-common -fdiagnostics-show-option -fno-strict-aliasing -fvisibility=hidden -fstack-protector -fstack-protector-strong --param=ssp-buffer-size=4 -fPIE -ffunction-sections -fdata-sections -Wno-unused-parameter -Wno-missing-field-initializers -Wno-unused-result -Wno-format-signedness -Wno-error=nonnull -Werror=shadow -include config.h -O2 -fwrapv -Wformat -Werror=format-security -gdwarf-4 -fno-debug-types-section -fvar-tracking-assignments -g2 -Wp,-D_FORTIFY_SOURCE=2 -fstack-protector-strong --param=ssp-buffer-size=4 -fomit-frame-pointer -march=i686 -fasynchronous-unwind-tables -mtune=pentium4 -gdwarf-4 -fno-debug-types-section -fvar-tracking-assignments -g2  -MD -MQ 'systemd-fstab-generator@exe/src_core_mount-setup.c.o' -MF 'systemd-fstab-generator@exe/src_core_mount-setup.c.o.d' -o 'systemd-fstab-generator@exe/src_core_mount-setup.c.o' -c ../src/core/mount-setup.c
[554/1582] /usr/bin/meson --internal exe /tmp/B.JN6jpr/BUILD/systemd-239/build/meson-private/meson_exe_gperf_10436f46cd1d0fab5f7003dbbbeeed6267424526.dat
[555/1582] i686-pld-linux-gcc -Isystemd-debug-generator@exe -I. -I.. -Isrc/basic -I../src/basic -Isrc/shared -I../src/shared -Isrc/systemd -I../src/systemd -Isrc/journal -I../src/journal -Isrc/journal-remote -I../src/journal-remote -Isrc/nspawn -I../src/nspawn -Isrc/resolve -I../src/resolve -Isrc/timesync -I../src/timesync -I../src/time-wait-sync -Isrc/login -I../src/login -Isrc/udev -I../src/udev -Isrc/libudev -I../src/libudev -Isrc/core -I../src/core -I../src/libsystemd/sd-bus -I../src/libsystemd/sd-device -I../src/libsystemd/sd-hwdb -I../src/libsystemd/sd-id128 -I../src/libsystemd/sd-netlink -I../src/libsystemd/sd-network -Isrc/libsystemd-network -I../src/libsystemd-network -I../ -fdiagnostics-color=always -pipe -D_FILE_OFFSET_BITS=64 -std=gnu99 -Wextra -Werror=undef -Wlogical-op -Wmissing-include-dirs -Wold-style-definition -Wpointer-arith -Winit-self -Wfloat-equal -Wsuggest-attribute=noreturn -Werror=missing-prototypes -Werror=implicit-function-declaration -Werror=missing-declarations -Werror=return-type -Werror=incompatible-pointer-types -Werror=format=2 -Wstrict-prototypes -Wredundant-decls -Wmissing-noreturn -Wimplicit-fallthrough=5 -Wshadow -Wendif-labels -Wstrict-aliasing=2 -Wwrite-strings -Werror=overflow -Werror=shift-count-overflow -Werror=shift-overflow=2 -Wdate-time -Wnested-externs -ffast-math -fno-common -fdiagnostics-show-option -fno-strict-aliasing -fvisibility=hidden -fstack-protector -fstack-protector-strong --param=ssp-buffer-size=4 -fPIE -ffunction-sections -fdata-sections -Wno-unused-parameter -Wno-missing-field-initializers -Wno-unused-result -Wno-format-signedness -Wno-error=nonnull -Werror=shadow -include config.h -O2 -fwrapv -Wformat -Werror=format-security -gdwarf-4 -fno-debug-types-section -fvar-tracking-assignments -g2 -Wp,-D_FORTIFY_SOURCE=2 -fstack-protector-strong --param=ssp-buffer-size=4 -fomit-frame-pointer -march=i686 -fasynchronous-unwind-tables -mtune=pentium4 -gdwarf-4 -fno-debug-types-section -fvar-tracking-assignments -g2  -MD -MQ 'systemd-debug-generator@exe/src_debug-generator_debug-generator.c.o' -MF 'systemd-debug-generator@exe/src_debug-generator_debug-generator.c.o.d' -o 'systemd-debug-generator@exe/src_debug-generator_debug-generator.c.o' -c ../src/debug-generator/debug-generator.c
[556/1582] i686-pld-linux-gcc -Isystemd-dissect@exe -I. -I.. -Isrc/basic -I../src/basic -Isrc/shared -I../src/shared -Isrc/systemd -I../src/systemd -Isrc/journal -I../src/journal -Isrc/journal-remote -I../src/journal-remote -Isrc/nspawn -I../src/nspawn -Isrc/resolve -I../src/resolve -Isrc/timesync -I../src/timesync -I../src/time-wait-sync -Isrc/login -I../src/login -Isrc/udev -I../src/udev -Isrc/libudev -I../src/libudev -Isrc/core -I../src/core -I../src/libsystemd/sd-bus -I../src/libsystemd/sd-device -I../src/libsystemd/sd-hwdb -I../src/libsystemd/sd-id128 -I../src/libsystemd/sd-netlink -I../src/libsystemd/sd-network -Isrc/libsystemd-network -I../src/libsystemd-network -I../ -fdiagnostics-color=always -pipe -D_FILE_OFFSET_BITS=64 -std=gnu99 -Wextra -Werror=undef -Wlogical-op -Wmissing-include-dirs -Wold-style-definition -Wpointer-arith -Winit-self -Wfloat-equal -Wsuggest-attribute=noreturn -Werror=missing-prototypes -Werror=implicit-function-declaration -Werror=missing-declarations -Werror=return-type -Werror=incompatible-pointer-types -Werror=format=2 -Wstrict-prototypes -Wredundant-decls -Wmissing-noreturn -Wimplicit-fallthrough=5 -Wshadow -Wendif-labels -Wstrict-aliasing=2 -Wwrite-strings -Werror=overflow -Werror=shift-count-overflow -Werror=shift-overflow=2 -Wdate-time -Wnested-externs -ffast-math -fno-common -fdiagnostics-show-option -fno-strict-aliasing -fvisibility=hidden -fstack-protector -fstack-protector-strong --param=ssp-buffer-size=4 -fPIE -ffunction-sections -fdata-sections -Wno-unused-parameter -Wno-missing-field-initializers -Wno-unused-result -Wno-format-signedness -Wno-error=nonnull -Werror=shadow -include config.h -O2 -fwrapv -Wformat -Werror=format-security -gdwarf-4 -fno-debug-types-section -fvar-tracking-assignments -g2 -Wp,-D_FORTIFY_SOURCE=2 -fstack-protector-strong --param=ssp-buffer-size=4 -fomit-frame-pointer -march=i686 -fasynchronous-unwind-tables -mtune=pentium4 -gdwarf-4 -fno-debug-types-section -fvar-tracking-assignments -g2  -MD -MQ 'systemd-dissect@exe/src_dissect_dissect.c.o' -MF 'systemd-dissect@exe/src_dissect_dissect.c.o.d' -o 'systemd-dissect@exe/src_dissect_dissect.c.o' -c ../src/dissect/dissect.c
[557/1582] i686-pld-linux-gcc -Isystemd-fstab-generator@exe -I. -I.. -Isrc/basic -I../src/basic -Isrc/shared -I../src/shared -Isrc/systemd -I../src/systemd -Isrc/journal -I../src/journal -Isrc/journal-remote -I../src/journal-remote -Isrc/nspawn -I../src/nspawn -Isrc/resolve -I../src/resolve -Isrc/timesync -I../src/timesync -I../src/time-wait-sync -Isrc/login -I../src/login -Isrc/udev -I../src/udev -Isrc/libudev -I../src/libudev -Isrc/core -I../src/core -I../src/libsystemd/sd-bus -I../src/libsystemd/sd-device -I../src/libsystemd/sd-hwdb -I../src/libsystemd/sd-id128 -I../src/libsystemd/sd-netlink -I../src/libsystemd/sd-network -Isrc/libsystemd-network -I../src/libsystemd-network -I../ -fdiagnostics-color=always -pipe -D_FILE_OFFSET_BITS=64 -std=gnu99 -Wextra -Werror=undef -Wlogical-op -Wmissing-include-dirs -Wold-style-definition -Wpointer-arith -Winit-self -Wfloat-equal -Wsuggest-attribute=noreturn -Werror=missing-prototypes -Werror=implicit-function-declaration -Werror=missing-declarations -Werror=return-type -Werror=incompatible-pointer-types -Werror=format=2 -Wstrict-prototypes -Wredundant-decls -Wmissing-noreturn -Wimplicit-fallthrough=5 -Wshadow -Wendif-labels -Wstrict-aliasing=2 -Wwrite-strings -Werror=overflow -Werror=shift-count-overflow -Werror=shift-overflow=2 -Wdate-time -Wnested-externs -ffast-math -fno-common -fdiagnostics-show-option -fno-strict-aliasing -fvisibility=hidden -fstack-protector -fstack-protector-strong --param=ssp-buffer-size=4 -fPIE -ffunction-sections -fdata-sections -Wno-unused-parameter -Wno-missing-field-initializers -Wno-unused-result -Wno-format-signedness -Wno-error=nonnull -Werror=shadow -include config.h -O2 -fwrapv -Wformat -Werror=format-security -gdwarf-4 -fno-debug-types-section -fvar-tracking-assignments -g2 -Wp,-D_FORTIFY_SOURCE=2 -fstack-protector-strong --param=ssp-buffer-size=4 -fomit-frame-pointer -march=i686 -fasynchronous-unwind-tables -mtune=pentium4 -gdwarf-4 -fno-debug-types-section -fvar-tracking-assignments -g2  -MD -MQ 'systemd-fstab-generator@exe/src_fstab-generator_fstab-generator.c.o' -MF 'systemd-fstab-generator@exe/src_fstab-generator_fstab-generator.c.o.d' -o 'systemd-fstab-generator@exe/src_fstab-generator_fstab-generator.c.o' -c ../src/fstab-generator/fstab-generator.c
[558/1582] i686-pld-linux-gcc -Isystemd-getty-generator@exe -I. -I.. -Isrc/basic -I../src/basic -Isrc/shared -I../src/shared -Isrc/systemd -I../src/systemd -Isrc/journal -I../src/journal -Isrc/journal-remote -I../src/journal-remote -Isrc/nspawn -I../src/nspawn -Isrc/resolve -I../src/resolve -Isrc/timesync -I../src/timesync -I../src/time-wait-sync -Isrc/login -I../src/login -Isrc/udev -I../src/udev -Isrc/libudev -I../src/libudev -Isrc/core -I../src/core -I../src/libsystemd/sd-bus -I../src/libsystemd/sd-device -I../src/libsystemd/sd-hwdb -I../src/libsystemd/sd-id128 -I../src/libsystemd/sd-netlink -I../src/libsystemd/sd-network -Isrc/libsystemd-network -I../src/libsystemd-network -I../ -fdiagnostics-color=always -pipe -D_FILE_OFFSET_BITS=64 -std=gnu99 -Wextra -Werror=undef -Wlogical-op -Wmissing-include-dirs -Wold-style-definition -Wpointer-arith -Winit-self -Wfloat-equal -Wsuggest-attribute=noreturn -Werror=missing-prototypes -Werror=implicit-function-declaration -Werror=missing-declarations -Werror=return-type -Werror=incompatible-pointer-types -Werror=format=2 -Wstrict-prototypes -Wredundant-decls -Wmissing-noreturn -Wimplicit-fallthrough=5 -Wshadow -Wendif-labels -Wstrict-aliasing=2 -Wwrite-strings -Werror=overflow -Werror=shift-count-overflow -Werror=shift-overflow=2 -Wdate-time -Wnested-externs -ffast-math -fno-common -fdiagnostics-show-option -fno-strict-aliasing -fvisibility=hidden -fstack-protector -fstack-protector-strong --param=ssp-buffer-size=4 -fPIE -ffunction-sections -fdata-sections -Wno-unused-parameter -Wno-missing-field-initializers -Wno-unused-result -Wno-format-signedness -Wno-error=nonnull -Werror=shadow -include config.h -O2 -fwrapv -Wformat -Werror=format-security -gdwarf-4 -fno-debug-types-section -fvar-tracking-assignments -g2 -Wp,-D_FORTIFY_SOURCE=2 -fstack-protector-strong --param=ssp-buffer-size=4 -fomit-frame-pointer -march=i686 -fasynchronous-unwind-tables -mtune=pentium4 -gdwarf-4 -fno-debug-types-section -fvar-tracking-assignments -g2  -MD -MQ 'systemd-getty-generator@exe/src_getty-generator_getty-generator.c.o' -MF 'systemd-getty-generator@exe/src_getty-generator_getty-generator.c.o.d' -o 'systemd-getty-generator@exe/src_getty-generator_getty-generator.c.o' -c ../src/getty-generator/getty-generator.c
[559/1582] i686-pld-linux-gcc -Isystemd-gpt-auto-generator@exe -I. -I.. -Isrc/basic -I../src/basic -Isrc/shared -I../src/shared -Isrc/systemd -I../src/systemd -Isrc/journal -I../src/journal -Isrc/journal-remote -I../src/journal-remote -Isrc/nspawn -I../src/nspawn -Isrc/resolve -I../src/resolve -Isrc/timesync -I../src/timesync -I../src/time-wait-sync -Isrc/login -I../src/login -Isrc/udev -I../src/udev -Isrc/libudev -I../src/libudev -Isrc/core -I../src/core -I../src/libsystemd/sd-bus -I../src/libsystemd/sd-device -I../src/libsystemd/sd-hwdb -I../src/libsystemd/sd-id128 -I../src/libsystemd/sd-netlink -I../src/libsystemd/sd-network -Isrc/libsystemd-network -I../src/libsystemd-network -I../ -I/usr/include/blkid -I/usr/include/uuid -fdiagnostics-color=always -pipe -D_FILE_OFFSET_BITS=64 -std=gnu99 -Wextra -Werror=undef -Wlogical-op -Wmissing-include-dirs -Wold-style-definition -Wpointer-arith -Winit-self -Wfloat-equal -Wsuggest-attribute=noreturn -Werror=missing-prototypes -Werror=implicit-function-declaration -Werror=missing-declarations -Werror=return-type -Werror=incompatible-pointer-types -Werror=format=2 -Wstrict-prototypes -Wredundant-decls -Wmissing-noreturn -Wimplicit-fallthrough=5 -Wshadow -Wendif-labels -Wstrict-aliasing=2 -Wwrite-strings -Werror=overflow -Werror=shift-count-overflow -Werror=shift-overflow=2 -Wdate-time -Wnested-externs -ffast-math -fno-common -fdiagnostics-show-option -fno-strict-aliasing -fvisibility=hidden -fstack-protector -fstack-protector-strong --param=ssp-buffer-size=4 -fPIE -ffunction-sections -fdata-sections -Wno-unused-parameter -Wno-missing-field-initializers -Wno-unused-result -Wno-format-signedness -Wno-error=nonnull -Werror=shadow -include config.h -O2 -fwrapv -Wformat -Werror=format-security -gdwarf-4 -fno-debug-types-section -fvar-tracking-assignments -g2 -Wp,-D_FORTIFY_SOURCE=2 -fstack-protector-strong --param=ssp-buffer-size=4 -fomit-frame-pointer -march=i686 -fasynchronous-unwind-tables -mtune=pentium4 -gdwarf-4 -fno-debug-types-section -fvar-tracking-assignments -g2  -MD -MQ 'systemd-gpt-auto-generator@exe/src_gpt-auto-generator_gpt-auto-generator.c.o' -MF 'systemd-gpt-auto-generator@exe/src_gpt-auto-generator_gpt-auto-generator.c.o.d' -o 'systemd-gpt-auto-generator@exe/src_gpt-auto-generator_gpt-auto-generator.c.o' -c ../src/gpt-auto-generator/gpt-auto-generator.c
[560/1582] i686-pld-linux-gcc -Isystemd-analyze@exe -I. -I.. -Isrc/basic -I../src/basic -Isrc/shared -I../src/shared -Isrc/systemd -I../src/systemd -Isrc/journal -I../src/journal -Isrc/journal-remote -I../src/journal-remote -Isrc/nspawn -I../src/nspawn -Isrc/resolve -I../src/resolve -Isrc/timesync -I../src/timesync -I../src/time-wait-sync -Isrc/login -I../src/login -Isrc/udev -I../src/udev -Isrc/libudev -I../src/libudev -Isrc/core -I../src/core -I../src/libsystemd/sd-bus -I../src/libsystemd/sd-device -I../src/libsystemd/sd-hwdb -I../src/libsystemd/sd-id128 -I../src/libsystemd/sd-netlink -I../src/libsystemd/sd-network -Isrc/libsystemd-network -I../src/libsystemd-network -I../ -I/usr/include/libmount -I/usr/include/blkid -I/usr/include/uuid -fdiagnostics-color=always -pipe -D_FILE_OFFSET_BITS=64 -std=gnu99 -Wextra -Werror=undef -Wlogical-op -Wmissing-include-dirs -Wold-style-definition -Wpointer-arith -Winit-self -Wfloat-equal -Wsuggest-attribute=noreturn -Werror=missing-prototypes -Werror=implicit-function-declaration -Werror=missing-declarations -Werror=return-type -Werror=incompatible-pointer-types -Werror=format=2 -Wstrict-prototypes -Wredundant-decls -Wmissing-noreturn -Wimplicit-fallthrough=5 -Wshadow -Wendif-labels -Wstrict-aliasing=2 -Wwrite-strings -Werror=overflow -Werror=shift-count-overflow -Werror=shift-overflow=2 -Wdate-time -Wnested-externs -ffast-math -fno-common -fdiagnostics-show-option -fno-strict-aliasing -fvisibility=hidden -fstack-protector -fstack-protector-strong --param=ssp-buffer-size=4 -fPIE -ffunction-sections -fdata-sections -Wno-unused-parameter -Wno-missing-field-initializers -Wno-unused-result -Wno-format-signedness -Wno-error=nonnull -Werror=shadow -include config.h -O2 -fwrapv -Wformat -Werror=format-security -gdwarf-4 -fno-debug-types-section -fvar-tracking-assignments -g2 -Wp,-D_FORTIFY_SOURCE=2 -fstack-protector-strong --param=ssp-buffer-size=4 -fomit-frame-pointer -march=i686 -fasynchronous-unwind-tables -mtune=pentium4 -gdwarf-4 -fno-debug-types-section -fvar-tracking-assignments -g2 -pthread  -MD -MQ 'systemd-analyze@exe/src_analyze_analyze.c.o' -MF 'systemd-analyze@exe/src_analyze_analyze.c.o.d' -o 'systemd-analyze@exe/src_analyze_analyze.c.o' -c ../src/analyze/analyze.c
[561/1582] i686-pld-linux-gcc -Isrc/resolve/src@resolve@@systemd-resolve-core@sta -Isrc/resolve -I../src/resolve -Isrc/basic -I../src/basic -Isrc/shared -I../src/shared -Isrc/systemd -I../src/systemd -Isrc/journal -I../src/journal -Isrc/journal-remote -I../src/journal-remote -Isrc/nspawn -I../src/nspawn -Isrc/timesync -I../src/timesync -I../src/time-wait-sync -Isrc/login -I../src/login -Isrc/udev -I../src/udev -Isrc/libudev -I../src/libudev -Isrc/core -I../src/core -I../src/libsystemd/sd-bus -I../src/libsystemd/sd-device -I../src/libsystemd/sd-hwdb -I../src/libsystemd/sd-id128 -I../src/libsystemd/sd-netlink -I../src/libsystemd/sd-network -Isrc/libsystemd-network -I../src/libsystemd-network -I. -I../ -fdiagnostics-color=always -pipe -D_FILE_OFFSET_BITS=64 -std=gnu99 -Wextra -Werror=undef -Wlogical-op -Wmissing-include-dirs -Wold-style-definition -Wpointer-arith -Winit-self -Wfloat-equal -Wsuggest-attribute=noreturn -Werror=missing-prototypes -Werror=implicit-function-declaration -Werror=missing-declarations -Werror=return-type -Werror=incompatible-pointer-types -Werror=format=2 -Wstrict-prototypes -Wredundant-decls -Wmissing-noreturn -Wimplicit-fallthrough=5 -Wshadow -Wendif-labels -Wstrict-aliasing=2 -Wwrite-strings -Werror=overflow -Werror=shift-count-overflow -Werror=shift-overflow=2 -Wdate-time -Wnested-externs -ffast-math -fno-common -fdiagnostics-show-option -fno-strict-aliasing -fvisibility=hidden -fstack-protector -fstack-protector-strong --param=ssp-buffer-size=4 -fPIE -ffunction-sections -fdata-sections -Wno-unused-parameter -Wno-missing-field-initializers -Wno-unused-result -Wno-format-signedness -Wno-error=nonnull -Werror=shadow -include config.h -O2 -fwrapv -Wformat -Werror=format-security -gdwarf-4 -fno-debug-types-section -fvar-tracking-assignments -g2 -Wp,-D_FORTIFY_SOURCE=2 -fstack-protector-strong --param=ssp-buffer-size=4 -fomit-frame-pointer -march=i686 -fasynchronous-unwind-tables -mtune=pentium4 -gdwarf-4 -fno-debug-types-section -fvar-tracking-assignments -g2 -fPIC  -MD -MQ 'src/resolve/src@resolve@@systemd-resolve-core@sta/resolved-dns-question.c.o' -MF 'src/resolve/src@resolve@@systemd-resolve-core@sta/resolved-dns-question.c.o.d' -o 'src/resolve/src@resolve@@systemd-resolve-core@sta/resolved-dns-question.c.o' -c ../src/resolve/resolved-dns-question.c
[562/1582] i686-pld-linux-gcc -Isrc/resolve/src@resolve@@systemd-resolve-core@sta -Isrc/resolve -I../src/resolve -Isrc/basic -I../src/basic -Isrc/shared -I../src/shared -Isrc/systemd -I../src/systemd -Isrc/journal -I../src/journal -Isrc/journal-remote -I../src/journal-remote -Isrc/nspawn -I../src/nspawn -Isrc/timesync -I../src/timesync -I../src/time-wait-sync -Isrc/login -I../src/login -Isrc/udev -I../src/udev -Isrc/libudev -I../src/libudev -Isrc/core -I../src/core -I../src/libsystemd/sd-bus -I../src/libsystemd/sd-device -I../src/libsystemd/sd-hwdb -I../src/libsystemd/sd-id128 -I../src/libsystemd/sd-netlink -I../src/libsystemd/sd-network -Isrc/libsystemd-network -I../src/libsystemd-network -I. -I../ -fdiagnostics-color=always -pipe -D_FILE_OFFSET_BITS=64 -std=gnu99 -Wextra -Werror=undef -Wlogical-op -Wmissing-include-dirs -Wold-style-definition -Wpointer-arith -Winit-self -Wfloat-equal -Wsuggest-attribute=noreturn -Werror=missing-prototypes -Werror=implicit-function-declaration -Werror=missing-declarations -Werror=return-type -Werror=incompatible-pointer-types -Werror=format=2 -Wstrict-prototypes -Wredundant-decls -Wmissing-noreturn -Wimplicit-fallthrough=5 -Wshadow -Wendif-labels -Wstrict-aliasing=2 -Wwrite-strings -Werror=overflow -Werror=shift-count-overflow -Werror=shift-overflow=2 -Wdate-time -Wnested-externs -ffast-math -fno-common -fdiagnostics-show-option -fno-strict-aliasing -fvisibility=hidden -fstack-protector -fstack-protector-strong --param=ssp-buffer-size=4 -fPIE -ffunction-sections -fdata-sections -Wno-unused-parameter -Wno-missing-field-initializers -Wno-unused-result -Wno-format-signedness -Wno-error=nonnull -Werror=shadow -include config.h -O2 -fwrapv -Wformat -Werror=format-security -gdwarf-4 -fno-debug-types-section -fvar-tracking-assignments -g2 -Wp,-D_FORTIFY_SOURCE=2 -fstack-protector-strong --param=ssp-buffer-size=4 -fomit-frame-pointer -march=i686 -fasynchronous-unwind-tables -mtune=pentium4 -gdwarf-4 -fno-debug-types-section -fvar-tracking-assignments -g2 -fPIC  -MD -MQ 'src/resolve/src@resolve@@systemd-resolve-core@sta/dns-type.c.o' -MF 'src/resolve/src@resolve@@systemd-resolve-core@sta/dns-type.c.o.d' -o 'src/resolve/src@resolve@@systemd-resolve-core@sta/dns-type.c.o' -c ../src/resolve/dns-type.c
[563/1582] i686-pld-linux-gcc -Isystemd@exe -I. -I.. -Isrc/basic -I../src/basic -Isrc/shared -I../src/shared -Isrc/systemd -I../src/systemd -Isrc/journal -I../src/journal -Isrc/journal-remote -I../src/journal-remote -Isrc/nspawn -I../src/nspawn -Isrc/resolve -I../src/resolve -Isrc/timesync -I../src/timesync -I../src/time-wait-sync -Isrc/login -I../src/login -Isrc/udev -I../src/udev -Isrc/libudev -I../src/libudev -Isrc/core -I../src/core -I../src/libsystemd/sd-bus -I../src/libsystemd/sd-device -I../src/libsystemd/sd-hwdb -I../src/libsystemd/sd-id128 -I../src/libsystemd/sd-netlink -I../src/libsystemd/sd-network -Isrc/libsystemd-network -I../src/libsystemd-network -I../ -I/usr/include/libmount -I/usr/include/blkid -I/usr/include/uuid -fdiagnostics-color=always -pipe -D_FILE_OFFSET_BITS=64 -std=gnu99 -Wextra -Werror=undef -Wlogical-op -Wmissing-include-dirs -Wold-style-definition -Wpointer-arith -Winit-self -Wfloat-equal -Wsuggest-attribute=noreturn -Werror=missing-prototypes -Werror=implicit-function-declaration -Werror=missing-declarations -Werror=return-type -Werror=incompatible-pointer-types -Werror=format=2 -Wstrict-prototypes -Wredundant-decls -Wmissing-noreturn -Wimplicit-fallthrough=5 -Wshadow -Wendif-labels -Wstrict-aliasing=2 -Wwrite-strings -Werror=overflow -Werror=shift-count-overflow -Werror=shift-overflow=2 -Wdate-time -Wnested-externs -ffast-math -fno-common -fdiagnostics-show-option -fno-strict-aliasing -fvisibility=hidden -fstack-protector -fstack-protector-strong --param=ssp-buffer-size=4 -fPIE -ffunction-sections -fdata-sections -Wno-unused-parameter -Wno-missing-field-initializers -Wno-unused-result -Wno-format-signedness -Wno-error=nonnull -Werror=shadow -include config.h -O2 -fwrapv -Wformat -Werror=format-security -gdwarf-4 -fno-debug-types-section -fvar-tracking-assignments -g2 -Wp,-D_FORTIFY_SOURCE=2 -fstack-protector-strong --param=ssp-buffer-size=4 -fomit-frame-pointer -march=i686 -fasynchronous-unwind-tables -mtune=pentium4 -gdwarf-4 -fno-debug-types-section -fvar-tracking-assignments -g2 -pthread  -MD -MQ 'systemd@exe/src_core_main.c.o' -MF 'systemd@exe/src_core_main.c.o.d' -o 'systemd@exe/src_core_main.c.o' -c ../src/core/main.c
[564/1582] i686-pld-linux-gcc  -o systemd-debug-generator 'systemd-debug-generator@exe/src_debug-generator_debug-generator.c.o' -Wl,--no-undefined -Wl,--as-needed -Wl,-z,relro -Wl,-z,now -pie -Wl,--gc-sections -O2 -fwrapv -pipe -Wformat -Werror=format-security -gdwarf-4 -fno-debug-types-section -fvar-tracking-assignments -g2 -Wp,-D_FORTIFY_SOURCE=2 -fstack-protector-strong --param=ssp-buffer-size=4 -fomit-frame-pointer -march=i686 -fasynchronous-unwind-tables -mtune=pentium4 -gdwarf-4 -fno-debug-types-section -fvar-tracking-assignments -g2 -Wl,--as-needed -Wl,--no-copy-dt-needed-entries -Wl,-z,relro -Wl,-z,combreloc -Wl,--start-group src/shared/libsystemd-shared-239.so -Wl,--end-group '-Wl,-rpath,$ORIGIN/src/shared' -Wl,-rpath-link,/tmp/B.JN6jpr/BUILD/systemd-239/build/src/shared  
[565/1582] i686-pld-linux-gcc  -o systemd-getty-generator 'systemd-getty-generator@exe/src_getty-generator_getty-generator.c.o' -Wl,--no-undefined -Wl,--as-needed -Wl,-z,relro -Wl,-z,now -pie -Wl,--gc-sections -O2 -fwrapv -pipe -Wformat -Werror=format-security -gdwarf-4 -fno-debug-types-section -fvar-tracking-assignments -g2 -Wp,-D_FORTIFY_SOURCE=2 -fstack-protector-strong --param=ssp-buffer-size=4 -fomit-frame-pointer -march=i686 -fasynchronous-unwind-tables -mtune=pentium4 -gdwarf-4 -fno-debug-types-section -fvar-tracking-assignments -g2 -Wl,--as-needed -Wl,--no-copy-dt-needed-entries -Wl,-z,relro -Wl,-z,combreloc -Wl,--start-group src/shared/libsystemd-shared-239.so -Wl,--end-group '-Wl,-rpath,$ORIGIN/src/shared' -Wl,-rpath-link,/tmp/B.JN6jpr/BUILD/systemd-239/build/src/shared  
[566/1582] i686-pld-linux-gcc  -o systemd-gpt-auto-generator 'systemd-gpt-auto-generator@exe/src_gpt-auto-generator_gpt-auto-generator.c.o' -Wl,--no-undefined -Wl,--as-needed -Wl,-z,relro -Wl,-z,now -pie -Wl,--gc-sections -O2 -fwrapv -pipe -Wformat -Werror=format-security -gdwarf-4 -fno-debug-types-section -fvar-tracking-assignments -g2 -Wp,-D_FORTIFY_SOURCE=2 -fstack-protector-strong --param=ssp-buffer-size=4 -fomit-frame-pointer -march=i686 -fasynchronous-unwind-tables -mtune=pentium4 -gdwarf-4 -fno-debug-types-section -fvar-tracking-assignments -g2 -Wl,--as-needed -Wl,--no-copy-dt-needed-entries -Wl,-z,relro -Wl,-z,combreloc -Wl,--start-group src/shared/libsystemd-shared-239.so /usr/lib/libblkid.so -Wl,--end-group '-Wl,-rpath,$ORIGIN/src/shared' -Wl,-rpath-link,/tmp/B.JN6jpr/BUILD/systemd-239/build/src/shared  
[567/1582] i686-pld-linux-gcc -Isrc/resolve/src@resolve@@systemd-resolve-core@sta -Isrc/resolve -I../src/resolve -Isrc/basic -I../src/basic -Isrc/shared -I../src/shared -Isrc/systemd -I../src/systemd -Isrc/journal -I../src/journal -Isrc/journal-remote -I../src/journal-remote -Isrc/nspawn -I../src/nspawn -Isrc/timesync -I../src/timesync -I../src/time-wait-sync -Isrc/login -I../src/login -Isrc/udev -I../src/udev -Isrc/libudev -I../src/libudev -Isrc/core -I../src/core -I../src/libsystemd/sd-bus -I../src/libsystemd/sd-device -I../src/libsystemd/sd-hwdb -I../src/libsystemd/sd-id128 -I../src/libsystemd/sd-netlink -I../src/libsystemd/sd-network -Isrc/libsystemd-network -I../src/libsystemd-network -I. -I../ -fdiagnostics-color=always -pipe -D_FILE_OFFSET_BITS=64 -std=gnu99 -Wextra -Werror=undef -Wlogical-op -Wmissing-include-dirs -Wold-style-definition -Wpointer-arith -Winit-self -Wfloat-equal -Wsuggest-attribute=noreturn -Werror=missing-prototypes -Werror=implicit-function-declaration -Werror=missing-declarations -Werror=return-type -Werror=incompatible-pointer-types -Werror=format=2 -Wstrict-prototypes -Wredundant-decls -Wmissing-noreturn -Wimplicit-fallthrough=5 -Wshadow -Wendif-labels -Wstrict-aliasing=2 -Wwrite-strings -Werror=overflow -Werror=shift-count-overflow -Werror=shift-overflow=2 -Wdate-time -Wnested-externs -ffast-math -fno-common -fdiagnostics-show-option -fno-strict-aliasing -fvisibility=hidden -fstack-protector -fstack-protector-strong --param=ssp-buffer-size=4 -fPIE -ffunction-sections -fdata-sections -Wno-unused-parameter -Wno-missing-field-initializers -Wno-unused-result -Wno-format-signedness -Wno-error=nonnull -Werror=shadow -include config.h -O2 -fwrapv -Wformat -Werror=format-security -gdwarf-4 -fno-debug-types-section -fvar-tracking-assignments -g2 -Wp,-D_FORTIFY_SOURCE=2 -fstack-protector-strong --param=ssp-buffer-size=4 -fomit-frame-pointer -march=i686 -fasynchronous-unwind-tables -mtune=pentium4 -gdwarf-4 -fno-debug-types-section -fvar-tracking-assignments -g2 -fPIC  -MD -MQ 'src/resolve/src@resolve@@systemd-resolve-core@sta/resolved-dns-answer.c.o' -MF 'src/resolve/src@resolve@@systemd-resolve-core@sta/resolved-dns-answer.c.o.d' -o 'src/resolve/src@resolve@@systemd-resolve-core@sta/resolved-dns-answer.c.o' -c ../src/resolve/resolved-dns-answer.c
[568/1582] i686-pld-linux-gcc -Ijournalctl@exe -I. -I.. -Isrc/basic -I../src/basic -Isrc/shared -I../src/shared -Isrc/systemd -I../src/systemd -Isrc/journal -I../src/journal -Isrc/journal-remote -I../src/journal-remote -Isrc/nspawn -I../src/nspawn -Isrc/resolve -I../src/resolve -Isrc/timesync -I../src/timesync -I../src/time-wait-sync -Isrc/login -I../src/login -Isrc/udev -I../src/udev -Isrc/libudev -I../src/libudev -Isrc/core -I../src/core -I../src/libsystemd/sd-bus -I../src/libsystemd/sd-device -I../src/libsystemd/sd-hwdb -I../src/libsystemd/sd-id128 -I../src/libsystemd/sd-netlink -I../src/libsystemd/sd-network -Isrc/libsystemd-network -I../src/libsystemd-network -I../ -fdiagnostics-color=always -pipe -D_FILE_OFFSET_BITS=64 -std=gnu99 -Wextra -Werror=undef -Wlogical-op -Wmissing-include-dirs -Wold-style-definition -Wpointer-arith -Winit-self -Wfloat-equal -Wsuggest-attribute=noreturn -Werror=missing-prototypes -Werror=implicit-function-declaration -Werror=missing-declarations -Werror=return-type -Werror=incompatible-pointer-types -Werror=format=2 -Wstrict-prototypes -Wredundant-decls -Wmissing-noreturn -Wimplicit-fallthrough=5 -Wshadow -Wendif-labels -Wstrict-aliasing=2 -Wwrite-strings -Werror=overflow -Werror=shift-count-overflow -Werror=shift-overflow=2 -Wdate-time -Wnested-externs -ffast-math -fno-common -fdiagnostics-show-option -fno-strict-aliasing -fvisibility=hidden -fstack-protector -fstack-protector-strong --param=ssp-buffer-size=4 -fPIE -ffunction-sections -fdata-sections -Wno-unused-parameter -Wno-missing-field-initializers -Wno-unused-result -Wno-format-signedness -Wno-error=nonnull -Werror=shadow -include config.h -O2 -fwrapv -Wformat -Werror=format-security -gdwarf-4 -fno-debug-types-section -fvar-tracking-assignments -g2 -Wp,-D_FORTIFY_SOURCE=2 -fstack-protector-strong --param=ssp-buffer-size=4 -fomit-frame-pointer -march=i686 -fasynchronous-unwind-tables -mtune=pentium4 -gdwarf-4 -fno-debug-types-section -fvar-tracking-assignments -g2 -pthread  -MD -MQ 'journalctl@exe/src_journal_journalctl.c.o' -MF 'journalctl@exe/src_journal_journalctl.c.o.d' -o 'journalctl@exe/src_journal_journalctl.c.o' -c ../src/journal/journalctl.c
[569/1582] i686-pld-linux-gcc  -o systemd-analyze 'systemd-analyze@exe/src_analyze_analyze.c.o' 'systemd-analyze@exe/src_analyze_analyze-verify.c.o' -Wl,--no-undefined -Wl,--as-needed -Wl,-z,relro -Wl,-z,now -pie -Wl,--gc-sections -O2 -fwrapv -pipe -Wformat -Werror=format-security -gdwarf-4 -fno-debug-types-section -fvar-tracking-assignments -g2 -Wp,-D_FORTIFY_SOURCE=2 -fstack-protector-strong --param=ssp-buffer-size=4 -fomit-frame-pointer -march=i686 -fasynchronous-unwind-tables -mtune=pentium4 -gdwarf-4 -fno-debug-types-section -fvar-tracking-assignments -g2 -Wl,--as-needed -Wl,--no-copy-dt-needed-entries -Wl,-z,relro -Wl,-z,combreloc -Wl,--start-group src/core/libcore.a src/shared/libsystemd-shared-239.so -lrt /usr/lib/libseccomp.so /usr/lib/libselinux.so /usr/lib/libmount.so /usr/lib/libblkid.so -lrt -lpam /usr/lib/libaudit.so /usr/lib/libkmod.so /usr/lib/libapparmor.so -Wl,--end-group -pthread '-Wl,-rpath,$ORIGIN/src/core:$ORIGIN/src/shared' -Wl,-rpath-link,/tmp/B.JN6jpr/BUILD/systemd-239/build/src/core:/tmp/B.JN6jpr/BUILD/systemd-239/build/src/shared  
[570/1582] i686-pld-linux-gcc  -o systemd-dissect 'systemd-dissect@exe/src_dissect_dissect.c.o' -Wl,--no-undefined -Wl,--as-needed -Wl,-z,relro -Wl,-z,now -pie -Wl,--gc-sections -O2 -fwrapv -pipe -Wformat -Werror=format-security -gdwarf-4 -fno-debug-types-section -fvar-tracking-assignments -g2 -Wp,-D_FORTIFY_SOURCE=2 -fstack-protector-strong --param=ssp-buffer-size=4 -fomit-frame-pointer -march=i686 -fasynchronous-unwind-tables -mtune=pentium4 -gdwarf-4 -fno-debug-types-section -fvar-tracking-assignments -g2 -Wl,--as-needed -Wl,--no-copy-dt-needed-entries -Wl,-z,relro -Wl,-z,combreloc -Wl,--start-group src/shared/libsystemd-shared-239.so -Wl,--end-group '-Wl,-rpath,$ORIGIN/src/shared' -Wl,-rpath-link,/tmp/B.JN6jpr/BUILD/systemd-239/build/src/shared  
[571/1582] i686-pld-linux-gcc  -o systemd-fstab-generator 'systemd-fstab-generator@exe/src_fstab-generator_fstab-generator.c.o' 'systemd-fstab-generator@exe/src_core_mount-setup.c.o' -Wl,--no-undefined -Wl,--as-needed -Wl,-z,relro -Wl,-z,now -pie -Wl,--gc-sections -O2 -fwrapv -pipe -Wformat -Werror=format-security -gdwarf-4 -fno-debug-types-section -fvar-tracking-assignments -g2 -Wp,-D_FORTIFY_SOURCE=2 -fstack-protector-strong --param=ssp-buffer-size=4 -fomit-frame-pointer -march=i686 -fasynchronous-unwind-tables -mtune=pentium4 -gdwarf-4 -fno-debug-types-section -fvar-tracking-assignments -g2 -Wl,--as-needed -Wl,--no-copy-dt-needed-entries -Wl,-z,relro -Wl,-z,combreloc -Wl,--start-group src/shared/libsystemd-shared-239.so -Wl,--end-group '-Wl,-rpath,$ORIGIN/src/shared' -Wl,-rpath-link,/tmp/B.JN6jpr/BUILD/systemd-239/build/src/shared  
[572/1582] i686-pld-linux-gcc -Isrc/resolve/src@resolve@@systemd-resolve-core@sta -Isrc/resolve -I../src/resolve -Isrc/basic -I../src/basic -Isrc/shared -I../src/shared -Isrc/systemd -I../src/systemd -Isrc/journal -I../src/journal -Isrc/journal-remote -I../src/journal-remote -Isrc/nspawn -I../src/nspawn -Isrc/timesync -I../src/timesync -I../src/time-wait-sync -Isrc/login -I../src/login -Isrc/udev -I../src/udev -Isrc/libudev -I../src/libudev -Isrc/core -I../src/core -I../src/libsystemd/sd-bus -I../src/libsystemd/sd-device -I../src/libsystemd/sd-hwdb -I../src/libsystemd/sd-id128 -I../src/libsystemd/sd-netlink -I../src/libsystemd/sd-network -Isrc/libsystemd-network -I../src/libsystemd-network -I. -I../ -fdiagnostics-color=always -pipe -D_FILE_OFFSET_BITS=64 -std=gnu99 -Wextra -Werror=undef -Wlogical-op -Wmissing-include-dirs -Wold-style-definition -Wpointer-arith -Winit-self -Wfloat-equal -Wsuggest-attribute=noreturn -Werror=missing-prototypes -Werror=implicit-function-declaration -Werror=missing-declarations -Werror=return-type -Werror=incompatible-pointer-types -Werror=format=2 -Wstrict-prototypes -Wredundant-decls -Wmissing-noreturn -Wimplicit-fallthrough=5 -Wshadow -Wendif-labels -Wstrict-aliasing=2 -Wwrite-strings -Werror=overflow -Werror=shift-count-overflow -Werror=shift-overflow=2 -Wdate-time -Wnested-externs -ffast-math -fno-common -fdiagnostics-show-option -fno-strict-aliasing -fvisibility=hidden -fstack-protector -fstack-protector-strong --param=ssp-buffer-size=4 -fPIE -ffunction-sections -fdata-sections -Wno-unused-parameter -Wno-missing-field-initializers -Wno-unused-result -Wno-format-signedness -Wno-error=nonnull -Werror=shadow -include config.h -O2 -fwrapv -Wformat -Werror=format-security -gdwarf-4 -fno-debug-types-section -fvar-tracking-assignments -g2 -Wp,-D_FORTIFY_SOURCE=2 -fstack-protector-strong --param=ssp-buffer-size=4 -fomit-frame-pointer -march=i686 -fasynchronous-unwind-tables -mtune=pentium4 -gdwarf-4 -fno-debug-types-section -fvar-tracking-assignments -g2 -fPIC  -MD -MQ 'src/resolve/src@resolve@@systemd-resolve-core@sta/resolved-dns-dnssec.c.o' -MF 'src/resolve/src@resolve@@systemd-resolve-core@sta/resolved-dns-dnssec.c.o.d' -o 'src/resolve/src@resolve@@systemd-resolve-core@sta/resolved-dns-dnssec.c.o' -c ../src/resolve/resolved-dns-dnssec.c
[573/1582] i686-pld-linux-gcc -I30-systemd-environment-d-generator@exe -I. -I.. -Isrc/basic -I../src/basic -Isrc/shared -I../src/shared -Isrc/systemd -I../src/systemd -Isrc/journal -I../src/journal -Isrc/journal-remote -I../src/journal-remote -Isrc/nspawn -I../src/nspawn -Isrc/resolve -I../src/resolve -Isrc/timesync -I../src/timesync -I../src/time-wait-sync -Isrc/login -I../src/login -Isrc/udev -I../src/udev -Isrc/libudev -I../src/libudev -Isrc/core -I../src/core -I../src/libsystemd/sd-bus -I../src/libsystemd/sd-device -I../src/libsystemd/sd-hwdb -I../src/libsystemd/sd-id128 -I../src/libsystemd/sd-netlink -I../src/libsystemd/sd-network -Isrc/libsystemd-network -I../src/libsystemd-network -I../ -fdiagnostics-color=always -pipe -D_FILE_OFFSET_BITS=64 -std=gnu99 -Wextra -Werror=undef -Wlogical-op -Wmissing-include-dirs -Wold-style-definition -Wpointer-arith -Winit-self -Wfloat-equal -Wsuggest-attribute=noreturn -Werror=missing-prototypes -Werror=implicit-function-declaration -Werror=missing-declarations -Werror=return-type -Werror=incompatible-pointer-types -Werror=format=2 -Wstrict-prototypes -Wredundant-decls -Wmissing-noreturn -Wimplicit-fallthrough=5 -Wshadow -Wendif-labels -Wstrict-aliasing=2 -Wwrite-strings -Werror=overflow -Werror=shift-count-overflow -Werror=shift-overflow=2 -Wdate-time -Wnested-externs -ffast-math -fno-common -fdiagnostics-show-option -fno-strict-aliasing -fvisibility=hidden -fstack-protector -fstack-protector-strong --param=ssp-buffer-size=4 -fPIE -ffunction-sections -fdata-sections -Wno-unused-parameter -Wno-missing-field-initializers -Wno-unused-result -Wno-format-signedness -Wno-error=nonnull -Werror=shadow -include config.h -O2 -fwrapv -Wformat -Werror=format-security -gdwarf-4 -fno-debug-types-section -fvar-tracking-assignments -g2 -Wp,-D_FORTIFY_SOURCE=2 -fstack-protector-strong --param=ssp-buffer-size=4 -fomit-frame-pointer -march=i686 -fasynchronous-unwind-tables -mtune=pentium4 -gdwarf-4 -fno-debug-types-section -fvar-tracking-assignments -g2  -MD -MQ '30-systemd-environment-d-generator@exe/src_environment-d-generator_environment-d-generator.c.o' -MF '30-systemd-environment-d-generator@exe/src_environment-d-generator_environment-d-generator.c.o.d' -o '30-systemd-environment-d-generator@exe/src_environment-d-generator_environment-d-generator.c.o' -c ../src/environment-d-generator/environment-d-generator.c
[574/1582] i686-pld-linux-gcc  -o journalctl 'journalctl@exe/src_journal_journalctl.c.o' 'journalctl@exe/src_journal_journal-qrcode.c.o' -Wl,--no-undefined -Wl,--as-needed -Wl,-z,relro -Wl,-z,now -pie -Wl,--gc-sections -O2 -fwrapv -pipe -Wformat -Werror=format-security -gdwarf-4 -fno-debug-types-section -fvar-tracking-assignments -g2 -Wp,-D_FORTIFY_SOURCE=2 -fstack-protector-strong --param=ssp-buffer-size=4 -fomit-frame-pointer -march=i686 -fasynchronous-unwind-tables -mtune=pentium4 -gdwarf-4 -fno-debug-types-section -fvar-tracking-assignments -g2 -Wl,--as-needed -Wl,--no-copy-dt-needed-entries -Wl,-z,relro -Wl,-z,combreloc -Wl,--start-group src/shared/libsystemd-shared-239.so /usr/lib/libqrencode.so /usr/lib/liblzma.so /usr/lib/liblz4.so /usr/lib/libpcre2-8.so -Wl,--end-group -pthread '-Wl,-rpath,$ORIGIN/src/shared' -Wl,-rpath-link,/tmp/B.JN6jpr/BUILD/systemd-239/build/src/shared  
[575/1582] i686-pld-linux-gcc  -o systemd 'systemd@exe/src_core_main.c.o' -Wl,--no-undefined -Wl,--as-needed -Wl,-z,relro -Wl,-z,now -pie -Wl,--gc-sections -O2 -fwrapv -pipe -Wformat -Werror=format-security -gdwarf-4 -fno-debug-types-section -fvar-tracking-assignments -g2 -Wp,-D_FORTIFY_SOURCE=2 -fstack-protector-strong --param=ssp-buffer-size=4 -fomit-frame-pointer -march=i686 -fasynchronous-unwind-tables -mtune=pentium4 -gdwarf-4 -fno-debug-types-section -fvar-tracking-assignments -g2 -Wl,--as-needed -Wl,--no-copy-dt-needed-entries -Wl,-z,relro -Wl,-z,combreloc -Wl,--start-group src/core/libcore.a src/shared/libsystemd-shared-239.so -lrt /usr/lib/libseccomp.so /usr/lib/libselinux.so /usr/lib/libmount.so /usr/lib/libblkid.so -lrt -lpam /usr/lib/libaudit.so /usr/lib/libkmod.so /usr/lib/libapparmor.so -Wl,--end-group -pthread '-Wl,-rpath,$ORIGIN/src/core:$ORIGIN/src/shared' -Wl,-rpath-link,/tmp/B.JN6jpr/BUILD/systemd-239/build/src/core:/tmp/B.JN6jpr/BUILD/systemd-239/build/src/shared  
[576/1582] i686-pld-linux-gcc -Isrc/resolve/src@resolve@@systemd-resolve-core@sta -Isrc/resolve -I../src/resolve -Isrc/basic -I../src/basic -Isrc/shared -I../src/shared -Isrc/systemd -I../src/systemd -Isrc/journal -I../src/journal -Isrc/journal-remote -I../src/journal-remote -Isrc/nspawn -I../src/nspawn -Isrc/timesync -I../src/timesync -I../src/time-wait-sync -Isrc/login -I../src/login -Isrc/udev -I../src/udev -Isrc/libudev -I../src/libudev -Isrc/core -I../src/core -I../src/libsystemd/sd-bus -I../src/libsystemd/sd-device -I../src/libsystemd/sd-hwdb -I../src/libsystemd/sd-id128 -I../src/libsystemd/sd-netlink -I../src/libsystemd/sd-network -Isrc/libsystemd-network -I../src/libsystemd-network -I. -I../ -fdiagnostics-color=always -pipe -D_FILE_OFFSET_BITS=64 -std=gnu99 -Wextra -Werror=undef -Wlogical-op -Wmissing-include-dirs -Wold-style-definition -Wpointer-arith -Winit-self -Wfloat-equal -Wsuggest-attribute=noreturn -Werror=missing-prototypes -Werror=implicit-function-declaration -Werror=missing-declarations -Werror=return-type -Werror=incompatible-pointer-types -Werror=format=2 -Wstrict-prototypes -Wredundant-decls -Wmissing-noreturn -Wimplicit-fallthrough=5 -Wshadow -Wendif-labels -Wstrict-aliasing=2 -Wwrite-strings -Werror=overflow -Werror=shift-count-overflow -Werror=shift-overflow=2 -Wdate-time -Wnested-externs -ffast-math -fno-common -fdiagnostics-show-option -fno-strict-aliasing -fvisibility=hidden -fstack-protector -fstack-protector-strong --param=ssp-buffer-size=4 -fPIE -ffunction-sections -fdata-sections -Wno-unused-parameter -Wno-missing-field-initializers -Wno-unused-result -Wno-format-signedness -Wno-error=nonnull -Werror=shadow -include config.h -O2 -fwrapv -Wformat -Werror=format-security -gdwarf-4 -fno-debug-types-section -fvar-tracking-assignments -g2 -Wp,-D_FORTIFY_SOURCE=2 -fstack-protector-strong --param=ssp-buffer-size=4 -fomit-frame-pointer -march=i686 -fasynchronous-unwind-tables -mtune=pentium4 -gdwarf-4 -fno-debug-types-section -fvar-tracking-assignments -g2 -fPIC  -MD -MQ 'src/resolve/src@resolve@@systemd-resolve-core@sta/resolved-dns-packet.c.o' -MF 'src/resolve/src@resolve@@systemd-resolve-core@sta/resolved-dns-packet.c.o.d' -o 'src/resolve/src@resolve@@systemd-resolve-core@sta/resolved-dns-packet.c.o' -c ../src/resolve/resolved-dns-packet.c
[577/1582] i686-pld-linux-gcc -Isystemd-hibernate-resume@exe -I. -I.. -Isrc/basic -I../src/basic -Isrc/shared -I../src/shared -Isrc/systemd -I../src/systemd -Isrc/journal -I../src/journal -Isrc/journal-remote -I../src/journal-remote -Isrc/nspawn -I../src/nspawn -Isrc/resolve -I../src/resolve -Isrc/timesync -I../src/timesync -I../src/time-wait-sync -Isrc/login -I../src/login -Isrc/udev -I../src/udev -Isrc/libudev -I../src/libudev -Isrc/core -I../src/core -I../src/libsystemd/sd-bus -I../src/libsystemd/sd-device -I../src/libsystemd/sd-hwdb -I../src/libsystemd/sd-id128 -I../src/libsystemd/sd-netlink -I../src/libsystemd/sd-network -Isrc/libsystemd-network -I../src/libsystemd-network -I../ -fdiagnostics-color=always -pipe -D_FILE_OFFSET_BITS=64 -std=gnu99 -Wextra -Werror=undef -Wlogical-op -Wmissing-include-dirs -Wold-style-definition -Wpointer-arith -Winit-self -Wfloat-equal -Wsuggest-attribute=noreturn -Werror=missing-prototypes -Werror=implicit-function-declaration -Werror=missing-declarations -Werror=return-type -Werror=incompatible-pointer-types -Werror=format=2 -Wstrict-prototypes -Wredundant-decls -Wmissing-noreturn -Wimplicit-fallthrough=5 -Wshadow -Wendif-labels -Wstrict-aliasing=2 -Wwrite-strings -Werror=overflow -Werror=shift-count-overflow -Werror=shift-overflow=2 -Wdate-time -Wnested-externs -ffast-math -fno-common -fdiagnostics-show-option -fno-strict-aliasing -fvisibility=hidden -fstack-protector -fstack-protector-strong --param=ssp-buffer-size=4 -fPIE -ffunction-sections -fdata-sections -Wno-unused-parameter -Wno-missing-field-initializers -Wno-unused-result -Wno-format-signedness -Wno-error=nonnull -Werror=shadow -include config.h -O2 -fwrapv -Wformat -Werror=format-security -gdwarf-4 -fno-debug-types-section -fvar-tracking-assignments -g2 -Wp,-D_FORTIFY_SOURCE=2 -fstack-protector-strong --param=ssp-buffer-size=4 -fomit-frame-pointer -march=i686 -fasynchronous-unwind-tables -mtune=pentium4 -gdwarf-4 -fno-debug-types-section -fvar-tracking-assignments -g2  -MD -MQ 'systemd-hibernate-resume@exe/src_hibernate-resume_hibernate-resume.c.o' -MF 'systemd-hibernate-resume@exe/src_hibernate-resume_hibernate-resume.c.o.d' -o 'systemd-hibernate-resume@exe/src_hibernate-resume_hibernate-resume.c.o' -c ../src/hibernate-resume/hibernate-resume.c
[578/1582] i686-pld-linux-gcc -Isrc/resolve/src@resolve@@systemd-resolve-core@sta -Isrc/resolve -I../src/resolve -Isrc/basic -I../src/basic -Isrc/shared -I../src/shared -Isrc/systemd -I../src/systemd -Isrc/journal -I../src/journal -Isrc/journal-remote -I../src/journal-remote -Isrc/nspawn -I../src/nspawn -Isrc/timesync -I../src/timesync -I../src/time-wait-sync -Isrc/login -I../src/login -Isrc/udev -I../src/udev -Isrc/libudev -I../src/libudev -Isrc/core -I../src/core -I../src/libsystemd/sd-bus -I../src/libsystemd/sd-device -I../src/libsystemd/sd-hwdb -I../src/libsystemd/sd-id128 -I../src/libsystemd/sd-netlink -I../src/libsystemd/sd-network -Isrc/libsystemd-network -I../src/libsystemd-network -I. -I../ -fdiagnostics-color=always -pipe -D_FILE_OFFSET_BITS=64 -std=gnu99 -Wextra -Werror=undef -Wlogical-op -Wmissing-include-dirs -Wold-style-definition -Wpointer-arith -Winit-self -Wfloat-equal -Wsuggest-attribute=noreturn -Werror=missing-prototypes -Werror=implicit-function-declaration -Werror=missing-declarations -Werror=return-type -Werror=incompatible-pointer-types -Werror=format=2 -Wstrict-prototypes -Wredundant-decls -Wmissing-noreturn -Wimplicit-fallthrough=5 -Wshadow -Wendif-labels -Wstrict-aliasing=2 -Wwrite-strings -Werror=overflow -Werror=shift-count-overflow -Werror=shift-overflow=2 -Wdate-time -Wnested-externs -ffast-math -fno-common -fdiagnostics-show-option -fno-strict-aliasing -fvisibility=hidden -fstack-protector -fstack-protector-strong --param=ssp-buffer-size=4 -fPIE -ffunction-sections -fdata-sections -Wno-unused-parameter -Wno-missing-field-initializers -Wno-unused-result -Wno-format-signedness -Wno-error=nonnull -Werror=shadow -include config.h -O2 -fwrapv -Wformat -Werror=format-security -gdwarf-4 -fno-debug-types-section -fvar-tracking-assignments -g2 -Wp,-D_FORTIFY_SOURCE=2 -fstack-protector-strong --param=ssp-buffer-size=4 -fomit-frame-pointer -march=i686 -fasynchronous-unwind-tables -mtune=pentium4 -gdwarf-4 -fno-debug-types-section -fvar-tracking-assignments -g2 -fPIC  -MD -MQ 'src/resolve/src@resolve@@systemd-resolve-core@sta/resolved-dns-rr.c.o' -MF 'src/resolve/src@resolve@@systemd-resolve-core@sta/resolved-dns-rr.c.o.d' -o 'src/resolve/src@resolve@@systemd-resolve-core@sta/resolved-dns-rr.c.o' -c ../src/resolve/resolved-dns-rr.c
[579/1582] i686-pld-linux-gcc -Isystemd-hibernate-resume-generator@exe -I. -I.. -Isrc/basic -I../src/basic -Isrc/shared -I../src/shared -Isrc/systemd -I../src/systemd -Isrc/journal -I../src/journal -Isrc/journal-remote -I../src/journal-remote -Isrc/nspawn -I../src/nspawn -Isrc/resolve -I../src/resolve -Isrc/timesync -I../src/timesync -I../src/time-wait-sync -Isrc/login -I../src/login -Isrc/udev -I../src/udev -Isrc/libudev -I../src/libudev -Isrc/core -I../src/core -I../src/libsystemd/sd-bus -I../src/libsystemd/sd-device -I../src/libsystemd/sd-hwdb -I../src/libsystemd/sd-id128 -I../src/libsystemd/sd-netlink -I../src/libsystemd/sd-network -Isrc/libsystemd-network -I../src/libsystemd-network -I../ -fdiagnostics-color=always -pipe -D_FILE_OFFSET_BITS=64 -std=gnu99 -Wextra -Werror=undef -Wlogical-op -Wmissing-include-dirs -Wold-style-definition -Wpointer-arith -Winit-self -Wfloat-equal -Wsuggest-attribute=noreturn -Werror=missing-prototypes -Werror=implicit-function-declaration -Werror=missing-declarations -Werror=return-type -Werror=incompatible-pointer-types -Werror=format=2 -Wstrict-prototypes -Wredundant-decls -Wmissing-noreturn -Wimplicit-fallthrough=5 -Wshadow -Wendif-labels -Wstrict-aliasing=2 -Wwrite-strings -Werror=overflow -Werror=shift-count-overflow -Werror=shift-overflow=2 -Wdate-time -Wnested-externs -ffast-math -fno-common -fdiagnostics-show-option -fno-strict-aliasing -fvisibility=hidden -fstack-protector -fstack-protector-strong --param=ssp-buffer-size=4 -fPIE -ffunction-sections -fdata-sections -Wno-unused-parameter -Wno-missing-field-initializers -Wno-unused-result -Wno-format-signedness -Wno-error=nonnull -Werror=shadow -include config.h -O2 -fwrapv -Wformat -Werror=format-security -gdwarf-4 -fno-debug-types-section -fvar-tracking-assignments -g2 -Wp,-D_FORTIFY_SOURCE=2 -fstack-protector-strong --param=ssp-buffer-size=4 -fomit-frame-pointer -march=i686 -fasynchronous-unwind-tables -mtune=pentium4 -gdwarf-4 -fno-debug-types-section -fvar-tracking-assignments -g2  -MD -MQ 'systemd-hibernate-resume-generator@exe/src_hibernate-resume_hibernate-resume-generator.c.o' -MF 'systemd-hibernate-resume-generator@exe/src_hibernate-resume_hibernate-resume-generator.c.o.d' -o 'systemd-hibernate-resume-generator@exe/src_hibernate-resume_hibernate-resume-generator.c.o' -c ../src/hibernate-resume/hibernate-resume-generator.c
[580/1582] i686-pld-linux-gcc  -o 30-systemd-environment-d-generator '30-systemd-environment-d-generator@exe/src_environment-d-generator_environment-d-generator.c.o' -Wl,--no-undefined -Wl,--as-needed -Wl,-z,relro -Wl,-z,now -pie -Wl,--gc-sections -O2 -fwrapv -pipe -Wformat -Werror=format-security -gdwarf-4 -fno-debug-types-section -fvar-tracking-assignments -g2 -Wp,-D_FORTIFY_SOURCE=2 -fstack-protector-strong --param=ssp-buffer-size=4 -fomit-frame-pointer -march=i686 -fasynchronous-unwind-tables -mtune=pentium4 -gdwarf-4 -fno-debug-types-section -fvar-tracking-assignments -g2 -Wl,--as-needed -Wl,--no-copy-dt-needed-entries -Wl,-z,relro -Wl,-z,combreloc -Wl,--start-group src/shared/libsystemd-shared-239.so -Wl,--end-group '-Wl,-rpath,$ORIGIN/src/shared' -Wl,-rpath-link,/tmp/B.JN6jpr/BUILD/systemd-239/build/src/shared  
[581/1582] rm -f src/resolve/libsystemd-resolve-core.a && gcc-ar csrD src/resolve/libsystemd-resolve-core.a 'src/resolve/src@resolve@@systemd-resolve-core@sta/resolved-dns-dnssec.c.o' 'src/resolve/src@resolve@@systemd-resolve-core@sta/resolved-dns-packet.c.o' 'src/resolve/src@resolve@@systemd-resolve-core@sta/resolved-dns-rr.c.o' 'src/resolve/src@resolve@@systemd-resolve-core@sta/resolved-dns-answer.c.o' 'src/resolve/src@resolve@@systemd-resolve-core@sta/resolved-dns-question.c.o' 'src/resolve/src@resolve@@systemd-resolve-core@sta/dns-type.c.o'
[582/1582] i686-pld-linux-gcc  -o systemd-hibernate-resume 'systemd-hibernate-resume@exe/src_hibernate-resume_hibernate-resume.c.o' -Wl,--no-undefined -Wl,--as-needed -Wl,-z,relro -Wl,-z,now -pie -Wl,--gc-sections -O2 -fwrapv -pipe -Wformat -Werror=format-security -gdwarf-4 -fno-debug-types-section -fvar-tracking-assignments -g2 -Wp,-D_FORTIFY_SOURCE=2 -fstack-protector-strong --param=ssp-buffer-size=4 -fomit-frame-pointer -march=i686 -fasynchronous-unwind-tables -mtune=pentium4 -gdwarf-4 -fno-debug-types-section -fvar-tracking-assignments -g2 -Wl,--as-needed -Wl,--no-copy-dt-needed-entries -Wl,-z,relro -Wl,-z,combreloc -Wl,--start-group src/shared/libsystemd-shared-239.so -Wl,--end-group '-Wl,-rpath,$ORIGIN/src/shared' -Wl,-rpath-link,/tmp/B.JN6jpr/BUILD/systemd-239/build/src/shared  
[583/1582] i686-pld-linux-gcc  -o systemd-hibernate-resume-generator 'systemd-hibernate-resume-generator@exe/src_hibernate-resume_hibernate-resume-generator.c.o' -Wl,--no-undefined -Wl,--as-needed -Wl,-z,relro -Wl,-z,now -pie -Wl,--gc-sections -O2 -fwrapv -pipe -Wformat -Werror=format-security -gdwarf-4 -fno-debug-types-section -fvar-tracking-assignments -g2 -Wp,-D_FORTIFY_SOURCE=2 -fstack-protector-strong --param=ssp-buffer-size=4 -fomit-frame-pointer -march=i686 -fasynchronous-unwind-tables -mtune=pentium4 -gdwarf-4 -fno-debug-types-section -fvar-tracking-assignments -g2 -Wl,--as-needed -Wl,--no-copy-dt-needed-entries -Wl,-z,relro -Wl,-z,combreloc -Wl,--start-group src/shared/libsystemd-shared-239.so -Wl,--end-group '-Wl,-rpath,$ORIGIN/src/shared' -Wl,-rpath-link,/tmp/B.JN6jpr/BUILD/systemd-239/build/src/shared  
[584/1582] i686-pld-linux-gcc -Iresolvectl@exe -I. -I.. -Isrc/basic -I../src/basic -Isrc/shared -I../src/shared -Isrc/systemd -I../src/systemd -Isrc/journal -I../src/journal -Isrc/journal-remote -I../src/journal-remote -Isrc/nspawn -I../src/nspawn -Isrc/resolve -I../src/resolve -Isrc/timesync -I../src/timesync -I../src/time-wait-sync -Isrc/login -I../src/login -Isrc/udev -I../src/udev -Isrc/libudev -I../src/libudev -Isrc/core -I../src/core -I../src/libsystemd/sd-bus -I../src/libsystemd/sd-device -I../src/libsystemd/sd-hwdb -I../src/libsystemd/sd-id128 -I../src/libsystemd/sd-netlink -I../src/libsystemd/sd-network -Isrc/libsystemd-network -I../src/libsystemd-network -I../ -fdiagnostics-color=always -pipe -D_FILE_OFFSET_BITS=64 -std=gnu99 -Wextra -Werror=undef -Wlogical-op -Wmissing-include-dirs -Wold-style-definition -Wpointer-arith -Winit-self -Wfloat-equal -Wsuggest-attribute=noreturn -Werror=missing-prototypes -Werror=implicit-function-declaration -Werror=missing-declarations -Werror=return-type -Werror=incompatible-pointer-types -Werror=format=2 -Wstrict-prototypes -Wredundant-decls -Wmissing-noreturn -Wimplicit-fallthrough=5 -Wshadow -Wendif-labels -Wstrict-aliasing=2 -Wwrite-strings -Werror=overflow -Werror=shift-count-overflow -Werror=shift-overflow=2 -Wdate-time -Wnested-externs -ffast-math -fno-common -fdiagnostics-show-option -fno-strict-aliasing -fvisibility=hidden -fstack-protector -fstack-protector-strong --param=ssp-buffer-size=4 -fPIE -ffunction-sections -fdata-sections -Wno-unused-parameter -Wno-missing-field-initializers -Wno-unused-result -Wno-format-signedness -Wno-error=nonnull -Werror=shadow -include config.h -O2 -fwrapv -Wformat -Werror=format-security -gdwarf-4 -fno-debug-types-section -fvar-tracking-assignments -g2 -Wp,-D_FORTIFY_SOURCE=2 -fstack-protector-strong --param=ssp-buffer-size=4 -fomit-frame-pointer -march=i686 -fasynchronous-unwind-tables -mtune=pentium4 -gdwarf-4 -fno-debug-types-section -fvar-tracking-assignments -g2 -pthread  -MD -MQ 'resolvectl@exe/src_resolve_resolvconf-compat.c.o' -MF 'resolvectl@exe/src_resolve_resolvconf-compat.c.o.d' -o 'resolvectl@exe/src_resolve_resolvconf-compat.c.o' -c ../src/resolve/resolvconf-compat.c
[585/1582] /usr/bin/xsltproc -o man/sd_bus_set_connected_signal.3 --nonet --xinclude --maxdepth 9000 --stringparam man.output.quietly 1 --stringparam funcsynopsis.style ansi --stringparam man.authors.section.enabled 0 --stringparam man.copyright.section.enabled 0 --stringparam systemd.version 239 --path /tmp/B.JN6jpr/BUILD/systemd-239/build/man:/tmp/B.JN6jpr/BUILD/systemd-239/man ../man/custom-man.xsl ../man/sd_bus_set_connected_signal.xml
[586/1582] /usr/bin/xsltproc -o man/sd_bus_set_sender.3 --nonet --xinclude --maxdepth 9000 --stringparam man.output.quietly 1 --stringparam funcsynopsis.style ansi --stringparam man.authors.section.enabled 0 --stringparam man.copyright.section.enabled 0 --stringparam systemd.version 239 --path /tmp/B.JN6jpr/BUILD/systemd-239/build/man:/tmp/B.JN6jpr/BUILD/systemd-239/man ../man/custom-man.xsl ../man/sd_bus_set_sender.xml
[587/1582] /usr/bin/xsltproc -o man/sd_bus_set_watch_bind.3 --nonet --xinclude --maxdepth 9000 --stringparam man.output.quietly 1 --stringparam funcsynopsis.style ansi --stringparam man.authors.section.enabled 0 --stringparam man.copyright.section.enabled 0 --stringparam systemd.version 239 --path /tmp/B.JN6jpr/BUILD/systemd-239/build/man:/tmp/B.JN6jpr/BUILD/systemd-239/man ../man/custom-man.xsl ../man/sd_bus_set_watch_bind.xml
[588/1582] i686-pld-linux-gcc -Isystemd-resolved@exe -I. -I.. -Isrc/basic -I../src/basic -Isrc/shared -I../src/shared -Isrc/systemd -I../src/systemd -Isrc/journal -I../src/journal -Isrc/journal-remote -I../src/journal-remote -Isrc/nspawn -I../src/nspawn -Isrc/resolve -I../src/resolve -Isrc/timesync -I../src/timesync -I../src/time-wait-sync -Isrc/login -I../src/login -Isrc/udev -I../src/udev -Isrc/libudev -I../src/libudev -Isrc/core -I../src/core -I../src/libsystemd/sd-bus -I../src/libsystemd/sd-device -I../src/libsystemd/sd-hwdb -I../src/libsystemd/sd-id128 -I../src/libsystemd/sd-netlink -I../src/libsystemd/sd-network -Isrc/libsystemd-network -I../src/libsystemd-network -I../ -I/usr/include/p11-kit-1 -fdiagnostics-color=always -pipe -D_FILE_OFFSET_BITS=64 -std=gnu99 -Wextra -Werror=undef -Wlogical-op -Wmissing-include-dirs -Wold-style-definition -Wpointer-arith -Winit-self -Wfloat-equal -Wsuggest-attribute=noreturn -Werror=missing-prototypes -Werror=implicit-function-declaration -Werror=missing-declarations -Werror=return-type -Werror=incompatible-pointer-types -Werror=format=2 -Wstrict-prototypes -Wredundant-decls -Wmissing-noreturn -Wimplicit-fallthrough=5 -Wshadow -Wendif-labels -Wstrict-aliasing=2 -Wwrite-strings -Werror=overflow -Werror=shift-count-overflow -Werror=shift-overflow=2 -Wdate-time -Wnested-externs -ffast-math -fno-common -fdiagnostics-show-option -fno-strict-aliasing -fvisibility=hidden -fstack-protector -fstack-protector-strong --param=ssp-buffer-size=4 -fPIE -ffunction-sections -fdata-sections -Wno-unused-parameter -Wno-missing-field-initializers -Wno-unused-result -Wno-format-signedness -Wno-error=nonnull -Werror=shadow -include config.h -O2 -fwrapv -Wformat -Werror=format-security -gdwarf-4 -fno-debug-types-section -fvar-tracking-assignments -g2 -Wp,-D_FORTIFY_SOURCE=2 -fstack-protector-strong --param=ssp-buffer-size=4 -fomit-frame-pointer -march=i686 -fasynchronous-unwind-tables -mtune=pentium4 -gdwarf-4 -fno-debug-types-section -fvar-tracking-assignments -g2 -pthread  -MD -MQ 'systemd-resolved@exe/src_resolve_resolved-resolv-conf.c.o' -MF 'systemd-resolved@exe/src_resolve_resolved-resolv-conf.c.o.d' -o 'systemd-resolved@exe/src_resolve_resolved-resolv-conf.c.o' -c ../src/resolve/resolved-resolv-conf.c
[589/1582] /usr/bin/xsltproc -o man/sd_bus_slot_set_destroy_callback.3 --nonet --xinclude --maxdepth 9000 --stringparam man.output.quietly 1 --stringparam funcsynopsis.style ansi --stringparam man.authors.section.enabled 0 --stringparam man.copyright.section.enabled 0 --stringparam systemd.version 239 --path /tmp/B.JN6jpr/BUILD/systemd-239/build/man:/tmp/B.JN6jpr/BUILD/systemd-239/man ../man/custom-man.xsl ../man/sd_bus_slot_set_destroy_callback.xml
[590/1582] i686-pld-linux-gcc -Isystemd-logind@exe -I. -I.. -Isrc/basic -I../src/basic -Isrc/shared -I../src/shared -Isrc/systemd -I../src/systemd -Isrc/journal -I../src/journal -Isrc/journal-remote -I../src/journal-remote -Isrc/nspawn -I../src/nspawn -Isrc/resolve -I../src/resolve -Isrc/timesync -I../src/timesync -I../src/time-wait-sync -Isrc/login -I../src/login -Isrc/udev -I../src/udev -Isrc/libudev -I../src/libudev -Isrc/core -I../src/core -I../src/libsystemd/sd-bus -I../src/libsystemd/sd-device -I../src/libsystemd/sd-hwdb -I../src/libsystemd/sd-id128 -I../src/libsystemd/sd-netlink -I../src/libsystemd/sd-network -Isrc/libsystemd-network -I../src/libsystemd-network -I../ -fdiagnostics-color=always -pipe -D_FILE_OFFSET_BITS=64 -std=gnu99 -Wextra -Werror=undef -Wlogical-op -Wmissing-include-dirs -Wold-style-definition -Wpointer-arith -Winit-self -Wfloat-equal -Wsuggest-attribute=noreturn -Werror=missing-prototypes -Werror=implicit-function-declaration -Werror=missing-declarations -Werror=return-type -Werror=incompatible-pointer-types -Werror=format=2 -Wstrict-prototypes -Wredundant-decls -Wmissing-noreturn -Wimplicit-fallthrough=5 -Wshadow -Wendif-labels -Wstrict-aliasing=2 -Wwrite-strings -Werror=overflow -Werror=shift-count-overflow -Werror=shift-overflow=2 -Wdate-time -Wnested-externs -ffast-math -fno-common -fdiagnostics-show-option -fno-strict-aliasing -fvisibility=hidden -fstack-protector -fstack-protector-strong --param=ssp-buffer-size=4 -fPIE -ffunction-sections -fdata-sections -Wno-unused-parameter -Wno-missing-field-initializers -Wno-unused-result -Wno-format-signedness -Wno-error=nonnull -Werror=shadow -include config.h -O2 -fwrapv -Wformat -Werror=format-security -gdwarf-4 -fno-debug-types-section -fvar-tracking-assignments -g2 -Wp,-D_FORTIFY_SOURCE=2 -fstack-protector-strong --param=ssp-buffer-size=4 -fomit-frame-pointer -march=i686 -fasynchronous-unwind-tables -mtune=pentium4 -gdwarf-4 -fno-debug-types-section -fvar-tracking-assignments -g2 -pthread  -MD -MQ 'systemd-logind@exe/src_login_logind.c.o' -MF 'systemd-logind@exe/src_login_logind.c.o.d' -o 'systemd-logind@exe/src_login_logind.c.o' -c ../src/login/logind.c
[591/1582] i686-pld-linux-gcc -Isystemd-resolved@exe -I. -I.. -Isrc/basic -I../src/basic -Isrc/shared -I../src/shared -Isrc/systemd -I../src/systemd -Isrc/journal -I../src/journal -Isrc/journal-remote -I../src/journal-remote -Isrc/nspawn -I../src/nspawn -Isrc/resolve -I../src/resolve -Isrc/timesync -I../src/timesync -I../src/time-wait-sync -Isrc/login -I../src/login -Isrc/udev -I../src/udev -Isrc/libudev -I../src/libudev -Isrc/core -I../src/core -I../src/libsystemd/sd-bus -I../src/libsystemd/sd-device -I../src/libsystemd/sd-hwdb -I../src/libsystemd/sd-id128 -I../src/libsystemd/sd-netlink -I../src/libsystemd/sd-network -Isrc/libsystemd-network -I../src/libsystemd-network -I../ -I/usr/include/p11-kit-1 -fdiagnostics-color=always -pipe -D_FILE_OFFSET_BITS=64 -std=gnu99 -Wextra -Werror=undef -Wlogical-op -Wmissing-include-dirs -Wold-style-definition -Wpointer-arith -Winit-self -Wfloat-equal -Wsuggest-attribute=noreturn -Werror=missing-prototypes -Werror=implicit-function-declaration -Werror=missing-declarations -Werror=return-type -Werror=incompatible-pointer-types -Werror=format=2 -Wstrict-prototypes -Wredundant-decls -Wmissing-noreturn -Wimplicit-fallthrough=5 -Wshadow -Wendif-labels -Wstrict-aliasing=2 -Wwrite-strings -Werror=overflow -Werror=shift-count-overflow -Werror=shift-overflow=2 -Wdate-time -Wnested-externs -ffast-math -fno-common -fdiagnostics-show-option -fno-strict-aliasing -fvisibility=hidden -fstack-protector -fstack-protector-strong --param=ssp-buffer-size=4 -fPIE -ffunction-sections -fdata-sections -Wno-unused-parameter -Wno-missing-field-initializers -Wno-unused-result -Wno-format-signedness -Wno-error=nonnull -Werror=shadow -include config.h -O2 -fwrapv -Wformat -Werror=format-security -gdwarf-4 -fno-debug-types-section -fvar-tracking-assignments -g2 -Wp,-D_FORTIFY_SOURCE=2 -fstack-protector-strong --param=ssp-buffer-size=4 -fomit-frame-pointer -march=i686 -fasynchronous-unwind-tables -mtune=pentium4 -gdwarf-4 -fno-debug-types-section -fvar-tracking-assignments -g2 -pthread  -MD -MQ 'systemd-resolved@exe/src_resolve_resolved-manager.c.o' -MF 'systemd-resolved@exe/src_resolve_resolved-manager.c.o.d' -o 'systemd-resolved@exe/src_resolve_resolved-manager.c.o' -c ../src/resolve/resolved-manager.c
[592/1582] i686-pld-linux-gcc -Isystemd-resolved@exe -I. -I.. -Isrc/basic -I../src/basic -Isrc/shared -I../src/shared -Isrc/systemd -I../src/systemd -Isrc/journal -I../src/journal -Isrc/journal-remote -I../src/journal-remote -Isrc/nspawn -I../src/nspawn -Isrc/resolve -I../src/resolve -Isrc/timesync -I../src/timesync -I../src/time-wait-sync -Isrc/login -I../src/login -Isrc/udev -I../src/udev -Isrc/libudev -I../src/libudev -Isrc/core -I../src/core -I../src/libsystemd/sd-bus -I../src/libsystemd/sd-device -I../src/libsystemd/sd-hwdb -I../src/libsystemd/sd-id128 -I../src/libsystemd/sd-netlink -I../src/libsystemd/sd-network -Isrc/libsystemd-network -I../src/libsystemd-network -I../ -I/usr/include/p11-kit-1 -fdiagnostics-color=always -pipe -D_FILE_OFFSET_BITS=64 -std=gnu99 -Wextra -Werror=undef -Wlogical-op -Wmissing-include-dirs -Wold-style-definition -Wpointer-arith -Winit-self -Wfloat-equal -Wsuggest-attribute=noreturn -Werror=missing-prototypes -Werror=implicit-function-declaration -Werror=missing-declarations -Werror=return-type -Werror=incompatible-pointer-types -Werror=format=2 -Wstrict-prototypes -Wredundant-decls -Wmissing-noreturn -Wimplicit-fallthrough=5 -Wshadow -Wendif-labels -Wstrict-aliasing=2 -Wwrite-strings -Werror=overflow -Werror=shift-count-overflow -Werror=shift-overflow=2 -Wdate-time -Wnested-externs -ffast-math -fno-common -fdiagnostics-show-option -fno-strict-aliasing -fvisibility=hidden -fstack-protector -fstack-protector-strong --param=ssp-buffer-size=4 -fPIE -ffunction-sections -fdata-sections -Wno-unused-parameter -Wno-missing-field-initializers -Wno-unused-result -Wno-format-signedness -Wno-error=nonnull -Werror=shadow -include config.h -O2 -fwrapv -Wformat -Werror=format-security -gdwarf-4 -fno-debug-types-section -fvar-tracking-assignments -g2 -Wp,-D_FORTIFY_SOURCE=2 -fstack-protector-strong --param=ssp-buffer-size=4 -fomit-frame-pointer -march=i686 -fasynchronous-unwind-tables -mtune=pentium4 -gdwarf-4 -fno-debug-types-section -fvar-tracking-assignments -g2 -pthread  -MD -MQ 'systemd-resolved@exe/src_resolve_resolved-link-bus.c.o' -MF 'systemd-resolved@exe/src_resolve_resolved-link-bus.c.o.d' -o 'systemd-resolved@exe/src_resolve_resolved-link-bus.c.o' -c ../src/resolve/resolved-link-bus.c
[593/1582] i686-pld-linux-gcc -Isystemd-resolved@exe -I. -I.. -Isrc/basic -I../src/basic -Isrc/shared -I../src/shared -Isrc/systemd -I../src/systemd -Isrc/journal -I../src/journal -Isrc/journal-remote -I../src/journal-remote -Isrc/nspawn -I../src/nspawn -Isrc/resolve -I../src/resolve -Isrc/timesync -I../src/timesync -I../src/time-wait-sync -Isrc/login -I../src/login -Isrc/udev -I../src/udev -Isrc/libudev -I../src/libudev -Isrc/core -I../src/core -I../src/libsystemd/sd-bus -I../src/libsystemd/sd-device -I../src/libsystemd/sd-hwdb -I../src/libsystemd/sd-id128 -I../src/libsystemd/sd-netlink -I../src/libsystemd/sd-network -Isrc/libsystemd-network -I../src/libsystemd-network -I../ -I/usr/include/p11-kit-1 -fdiagnostics-color=always -pipe -D_FILE_OFFSET_BITS=64 -std=gnu99 -Wextra -Werror=undef -Wlogical-op -Wmissing-include-dirs -Wold-style-definition -Wpointer-arith -Winit-self -Wfloat-equal -Wsuggest-attribute=noreturn -Werror=missing-prototypes -Werror=implicit-function-declaration -Werror=missing-declarations -Werror=return-type -Werror=incompatible-pointer-types -Werror=format=2 -Wstrict-prototypes -Wredundant-decls -Wmissing-noreturn -Wimplicit-fallthrough=5 -Wshadow -Wendif-labels -Wstrict-aliasing=2 -Wwrite-strings -Werror=overflow -Werror=shift-count-overflow -Werror=shift-overflow=2 -Wdate-time -Wnested-externs -ffast-math -fno-common -fdiagnostics-show-option -fno-strict-aliasing -fvisibility=hidden -fstack-protector -fstack-protector-strong --param=ssp-buffer-size=4 -fPIE -ffunction-sections -fdata-sections -Wno-unused-parameter -Wno-missing-field-initializers -Wno-unused-result -Wno-format-signedness -Wno-error=nonnull -Werror=shadow -include config.h -O2 -fwrapv -Wformat -Werror=format-security -gdwarf-4 -fno-debug-types-section -fvar-tracking-assignments -g2 -Wp,-D_FORTIFY_SOURCE=2 -fstack-protector-strong --param=ssp-buffer-size=4 -fomit-frame-pointer -march=i686 -fasynchronous-unwind-tables -mtune=pentium4 -gdwarf-4 -fno-debug-types-section -fvar-tracking-assignments -g2 -pthread  -MD -MQ 'systemd-resolved@exe/src_resolve_resolved-llmnr.c.o' -MF 'systemd-resolved@exe/src_resolve_resolved-llmnr.c.o.d' -o 'systemd-resolved@exe/src_resolve_resolved-llmnr.c.o' -c ../src/resolve/resolved-llmnr.c
[594/1582] i686-pld-linux-gcc  -o systemd-logind 'systemd-logind@exe/src_login_logind.c.o' -Wl,--no-undefined -Wl,--as-needed -Wl,-z,relro -Wl,-z,now -pie -Wl,--gc-sections -O2 -fwrapv -pipe -Wformat -Werror=format-security -gdwarf-4 -fno-debug-types-section -fvar-tracking-assignments -g2 -Wp,-D_FORTIFY_SOURCE=2 -fstack-protector-strong --param=ssp-buffer-size=4 -fomit-frame-pointer -march=i686 -fasynchronous-unwind-tables -mtune=pentium4 -gdwarf-4 -fno-debug-types-section -fvar-tracking-assignments -g2 -Wl,--as-needed -Wl,--no-copy-dt-needed-entries -Wl,-z,relro -Wl,-z,combreloc -Wl,--start-group src/login/liblogind-core.a src/shared/libsystemd-shared-239.so -lacl -lacl -Wl,--end-group -pthread '-Wl,-rpath,$ORIGIN/src/login:$ORIGIN/src/shared' -Wl,-rpath-link,/tmp/B.JN6jpr/BUILD/systemd-239/build/src/login:/tmp/B.JN6jpr/BUILD/systemd-239/build/src/shared  
[595/1582] i686-pld-linux-gcc -Isystemd-resolved@exe -I. -I.. -Isrc/basic -I../src/basic -Isrc/shared -I../src/shared -Isrc/systemd -I../src/systemd -Isrc/journal -I../src/journal -Isrc/journal-remote -I../src/journal-remote -Isrc/nspawn -I../src/nspawn -Isrc/resolve -I../src/resolve -Isrc/timesync -I../src/timesync -I../src/time-wait-sync -Isrc/login -I../src/login -Isrc/udev -I../src/udev -Isrc/libudev -I../src/libudev -Isrc/core -I../src/core -I../src/libsystemd/sd-bus -I../src/libsystemd/sd-device -I../src/libsystemd/sd-hwdb -I../src/libsystemd/sd-id128 -I../src/libsystemd/sd-netlink -I../src/libsystemd/sd-network -Isrc/libsystemd-network -I../src/libsystemd-network -I../ -I/usr/include/p11-kit-1 -fdiagnostics-color=always -pipe -D_FILE_OFFSET_BITS=64 -std=gnu99 -Wextra -Werror=undef -Wlogical-op -Wmissing-include-dirs -Wold-style-definition -Wpointer-arith -Winit-self -Wfloat-equal -Wsuggest-attribute=noreturn -Werror=missing-prototypes -Werror=implicit-function-declaration -Werror=missing-declarations -Werror=return-type -Werror=incompatible-pointer-types -Werror=format=2 -Wstrict-prototypes -Wredundant-decls -Wmissing-noreturn -Wimplicit-fallthrough=5 -Wshadow -Wendif-labels -Wstrict-aliasing=2 -Wwrite-strings -Werror=overflow -Werror=shift-count-overflow -Werror=shift-overflow=2 -Wdate-time -Wnested-externs -ffast-math -fno-common -fdiagnostics-show-option -fno-strict-aliasing -fvisibility=hidden -fstack-protector -fstack-protector-strong --param=ssp-buffer-size=4 -fPIE -ffunction-sections -fdata-sections -Wno-unused-parameter -Wno-missing-field-initializers -Wno-unused-result -Wno-format-signedness -Wno-error=nonnull -Werror=shadow -include config.h -O2 -fwrapv -Wformat -Werror=format-security -gdwarf-4 -fno-debug-types-section -fvar-tracking-assignments -g2 -Wp,-D_FORTIFY_SOURCE=2 -fstack-protector-strong --param=ssp-buffer-size=4 -fomit-frame-pointer -march=i686 -fasynchronous-unwind-tables -mtune=pentium4 -gdwarf-4 -fno-debug-types-section -fvar-tracking-assignments -g2 -pthread  -MD -MQ 'systemd-resolved@exe/src_resolve_resolved-link.c.o' -MF 'systemd-resolved@exe/src_resolve_resolved-link.c.o.d' -o 'systemd-resolved@exe/src_resolve_resolved-link.c.o' -c ../src/resolve/resolved-link.c
[596/1582] i686-pld-linux-gcc -Isystemd-resolved@exe -I. -I.. -Isrc/basic -I../src/basic -Isrc/shared -I../src/shared -Isrc/systemd -I../src/systemd -Isrc/journal -I../src/journal -Isrc/journal-remote -I../src/journal-remote -Isrc/nspawn -I../src/nspawn -Isrc/resolve -I../src/resolve -Isrc/timesync -I../src/timesync -I../src/time-wait-sync -Isrc/login -I../src/login -Isrc/udev -I../src/udev -Isrc/libudev -I../src/libudev -Isrc/core -I../src/core -I../src/libsystemd/sd-bus -I../src/libsystemd/sd-device -I../src/libsystemd/sd-hwdb -I../src/libsystemd/sd-id128 -I../src/libsystemd/sd-netlink -I../src/libsystemd/sd-network -Isrc/libsystemd-network -I../src/libsystemd-network -I../ -I/usr/include/p11-kit-1 -fdiagnostics-color=always -pipe -D_FILE_OFFSET_BITS=64 -std=gnu99 -Wextra -Werror=undef -Wlogical-op -Wmissing-include-dirs -Wold-style-definition -Wpointer-arith -Winit-self -Wfloat-equal -Wsuggest-attribute=noreturn -Werror=missing-prototypes -Werror=implicit-function-declaration -Werror=missing-declarations -Werror=return-type -Werror=incompatible-pointer-types -Werror=format=2 -Wstrict-prototypes -Wredundant-decls -Wmissing-noreturn -Wimplicit-fallthrough=5 -Wshadow -Wendif-labels -Wstrict-aliasing=2 -Wwrite-strings -Werror=overflow -Werror=shift-count-overflow -Werror=shift-overflow=2 -Wdate-time -Wnested-externs -ffast-math -fno-common -fdiagnostics-show-option -fno-strict-aliasing -fvisibility=hidden -fstack-protector -fstack-protector-strong --param=ssp-buffer-size=4 -fPIE -ffunction-sections -fdata-sections -Wno-unused-parameter -Wno-missing-field-initializers -Wno-unused-result -Wno-format-signedness -Wno-error=nonnull -Werror=shadow -include config.h -O2 -fwrapv -Wformat -Werror=format-security -gdwarf-4 -fno-debug-types-section -fvar-tracking-assignments -g2 -Wp,-D_FORTIFY_SOURCE=2 -fstack-protector-strong --param=ssp-buffer-size=4 -fomit-frame-pointer -march=i686 -fasynchronous-unwind-tables -mtune=pentium4 -gdwarf-4 -fno-debug-types-section -fvar-tracking-assignments -g2 -pthread  -MD -MQ 'systemd-resolved@exe/src_resolve_resolved-mdns.c.o' -MF 'systemd-resolved@exe/src_resolve_resolved-mdns.c.o.d' -o 'systemd-resolved@exe/src_resolve_resolved-mdns.c.o' -c ../src/resolve/resolved-mdns.c
[597/1582] i686-pld-linux-gcc -Isystemd-resolved@exe -I. -I.. -Isrc/basic -I../src/basic -Isrc/shared -I../src/shared -Isrc/systemd -I../src/systemd -Isrc/journal -I../src/journal -Isrc/journal-remote -I../src/journal-remote -Isrc/nspawn -I../src/nspawn -Isrc/resolve -I../src/resolve -Isrc/timesync -I../src/timesync -I../src/time-wait-sync -Isrc/login -I../src/login -Isrc/udev -I../src/udev -Isrc/libudev -I../src/libudev -Isrc/core -I../src/core -I../src/libsystemd/sd-bus -I../src/libsystemd/sd-device -I../src/libsystemd/sd-hwdb -I../src/libsystemd/sd-id128 -I../src/libsystemd/sd-netlink -I../src/libsystemd/sd-network -Isrc/libsystemd-network -I../src/libsystemd-network -I../ -I/usr/include/p11-kit-1 -fdiagnostics-color=always -pipe -D_FILE_OFFSET_BITS=64 -std=gnu99 -Wextra -Werror=undef -Wlogical-op -Wmissing-include-dirs -Wold-style-definition -Wpointer-arith -Winit-self -Wfloat-equal -Wsuggest-attribute=noreturn -Werror=missing-prototypes -Werror=implicit-function-declaration -Werror=missing-declarations -Werror=return-type -Werror=incompatible-pointer-types -Werror=format=2 -Wstrict-prototypes -Wredundant-decls -Wmissing-noreturn -Wimplicit-fallthrough=5 -Wshadow -Wendif-labels -Wstrict-aliasing=2 -Wwrite-strings -Werror=overflow -Werror=shift-count-overflow -Werror=shift-overflow=2 -Wdate-time -Wnested-externs -ffast-math -fno-common -fdiagnostics-show-option -fno-strict-aliasing -fvisibility=hidden -fstack-protector -fstack-protector-strong --param=ssp-buffer-size=4 -fPIE -ffunction-sections -fdata-sections -Wno-unused-parameter -Wno-missing-field-initializers -Wno-unused-result -Wno-format-signedness -Wno-error=nonnull -Werror=shadow -include config.h -O2 -fwrapv -Wformat -Werror=format-security -gdwarf-4 -fno-debug-types-section -fvar-tracking-assignments -g2 -Wp,-D_FORTIFY_SOURCE=2 -fstack-protector-strong --param=ssp-buffer-size=4 -fomit-frame-pointer -march=i686 -fasynchronous-unwind-tables -mtune=pentium4 -gdwarf-4 -fno-debug-types-section -fvar-tracking-assignments -g2 -pthread  -MD -MQ 'systemd-resolved@exe/src_resolve_resolved-dns-synthesize.c.o' -MF 'systemd-resolved@exe/src_resolve_resolved-dns-synthesize.c.o.d' -o 'systemd-resolved@exe/src_resolve_resolved-dns-synthesize.c.o' -c ../src/resolve/resolved-dns-synthesize.c
[598/1582] i686-pld-linux-gcc -Isystemd-resolved@exe -I. -I.. -Isrc/basic -I../src/basic -Isrc/shared -I../src/shared -Isrc/systemd -I../src/systemd -Isrc/journal -I../src/journal -Isrc/journal-remote -I../src/journal-remote -Isrc/nspawn -I../src/nspawn -Isrc/resolve -I../src/resolve -Isrc/timesync -I../src/timesync -I../src/time-wait-sync -Isrc/login -I../src/login -Isrc/udev -I../src/udev -Isrc/libudev -I../src/libudev -Isrc/core -I../src/core -I../src/libsystemd/sd-bus -I../src/libsystemd/sd-device -I../src/libsystemd/sd-hwdb -I../src/libsystemd/sd-id128 -I../src/libsystemd/sd-netlink -I../src/libsystemd/sd-network -Isrc/libsystemd-network -I../src/libsystemd-network -I../ -I/usr/include/p11-kit-1 -fdiagnostics-color=always -pipe -D_FILE_OFFSET_BITS=64 -std=gnu99 -Wextra -Werror=undef -Wlogical-op -Wmissing-include-dirs -Wold-style-definition -Wpointer-arith -Winit-self -Wfloat-equal -Wsuggest-attribute=noreturn -Werror=missing-prototypes -Werror=implicit-function-declaration -Werror=missing-declarations -Werror=return-type -Werror=incompatible-pointer-types -Werror=format=2 -Wstrict-prototypes -Wredundant-decls -Wmissing-noreturn -Wimplicit-fallthrough=5 -Wshadow -Wendif-labels -Wstrict-aliasing=2 -Wwrite-strings -Werror=overflow -Werror=shift-count-overflow -Werror=shift-overflow=2 -Wdate-time -Wnested-externs -ffast-math -fno-common -fdiagnostics-show-option -fno-strict-aliasing -fvisibility=hidden -fstack-protector -fstack-protector-strong --param=ssp-buffer-size=4 -fPIE -ffunction-sections -fdata-sections -Wno-unused-parameter -Wno-missing-field-initializers -Wno-unused-result -Wno-format-signedness -Wno-error=nonnull -Werror=shadow -include config.h -O2 -fwrapv -Wformat -Werror=format-security -gdwarf-4 -fno-debug-types-section -fvar-tracking-assignments -g2 -Wp,-D_FORTIFY_SOURCE=2 -fstack-protector-strong --param=ssp-buffer-size=4 -fomit-frame-pointer -march=i686 -fasynchronous-unwind-tables -mtune=pentium4 -gdwarf-4 -fno-debug-types-section -fvar-tracking-assignments -g2 -pthread  -MD -MQ 'systemd-resolved@exe/src_resolve_resolved-dns-query.c.o' -MF 'systemd-resolved@exe/src_resolve_resolved-dns-query.c.o.d' -o 'systemd-resolved@exe/src_resolve_resolved-dns-query.c.o' -c ../src/resolve/resolved-dns-query.c
[599/1582] i686-pld-linux-gcc -Isystemd-resolved@exe -I. -I.. -Isrc/basic -I../src/basic -Isrc/shared -I../src/shared -Isrc/systemd -I../src/systemd -Isrc/journal -I../src/journal -Isrc/journal-remote -I../src/journal-remote -Isrc/nspawn -I../src/nspawn -Isrc/resolve -I../src/resolve -Isrc/timesync -I../src/timesync -I../src/time-wait-sync -Isrc/login -I../src/login -Isrc/udev -I../src/udev -Isrc/libudev -I../src/libudev -Isrc/core -I../src/core -I../src/libsystemd/sd-bus -I../src/libsystemd/sd-device -I../src/libsystemd/sd-hwdb -I../src/libsystemd/sd-id128 -I../src/libsystemd/sd-netlink -I../src/libsystemd/sd-network -Isrc/libsystemd-network -I../src/libsystemd-network -I../ -I/usr/include/p11-kit-1 -fdiagnostics-color=always -pipe -D_FILE_OFFSET_BITS=64 -std=gnu99 -Wextra -Werror=undef -Wlogical-op -Wmissing-include-dirs -Wold-style-definition -Wpointer-arith -Winit-self -Wfloat-equal -Wsuggest-attribute=noreturn -Werror=missing-prototypes -Werror=implicit-function-declaration -Werror=missing-declarations -Werror=return-type -Werror=incompatible-pointer-types -Werror=format=2 -Wstrict-prototypes -Wredundant-decls -Wmissing-noreturn -Wimplicit-fallthrough=5 -Wshadow -Wendif-labels -Wstrict-aliasing=2 -Wwrite-strings -Werror=overflow -Werror=shift-count-overflow -Werror=shift-overflow=2 -Wdate-time -Wnested-externs -ffast-math -fno-common -fdiagnostics-show-option -fno-strict-aliasing -fvisibility=hidden -fstack-protector -fstack-protector-strong --param=ssp-buffer-size=4 -fPIE -ffunction-sections -fdata-sections -Wno-unused-parameter -Wno-missing-field-initializers -Wno-unused-result -Wno-format-signedness -Wno-error=nonnull -Werror=shadow -include config.h -O2 -fwrapv -Wformat -Werror=format-security -gdwarf-4 -fno-debug-types-section -fvar-tracking-assignments -g2 -Wp,-D_FORTIFY_SOURCE=2 -fstack-protector-strong --param=ssp-buffer-size=4 -fomit-frame-pointer -march=i686 -fasynchronous-unwind-tables -mtune=pentium4 -gdwarf-4 -fno-debug-types-section -fvar-tracking-assignments -g2 -pthread  -MD -MQ 'systemd-resolved@exe/src_resolve_resolved-bus.c.o' -MF 'systemd-resolved@exe/src_resolve_resolved-bus.c.o.d' -o 'systemd-resolved@exe/src_resolve_resolved-bus.c.o' -c ../src/resolve/resolved-bus.c
[600/1582] i686-pld-linux-gcc -Isystemd-resolved@exe -I. -I.. -Isrc/basic -I../src/basic -Isrc/shared -I../src/shared -Isrc/systemd -I../src/systemd -Isrc/journal -I../src/journal -Isrc/journal-remote -I../src/journal-remote -Isrc/nspawn -I../src/nspawn -Isrc/resolve -I../src/resolve -Isrc/timesync -I../src/timesync -I../src/time-wait-sync -Isrc/login -I../src/login -Isrc/udev -I../src/udev -Isrc/libudev -I../src/libudev -Isrc/core -I../src/core -I../src/libsystemd/sd-bus -I../src/libsystemd/sd-device -I../src/libsystemd/sd-hwdb -I../src/libsystemd/sd-id128 -I../src/libsystemd/sd-netlink -I../src/libsystemd/sd-network -Isrc/libsystemd-network -I../src/libsystemd-network -I../ -I/usr/include/p11-kit-1 -fdiagnostics-color=always -pipe -D_FILE_OFFSET_BITS=64 -std=gnu99 -Wextra -Werror=undef -Wlogical-op -Wmissing-include-dirs -Wold-style-definition -Wpointer-arith -Winit-self -Wfloat-equal -Wsuggest-attribute=noreturn -Werror=missing-prototypes -Werror=implicit-function-declaration -Werror=missing-declarations -Werror=return-type -Werror=incompatible-pointer-types -Werror=format=2 -Wstrict-prototypes -Wredundant-decls -Wmissing-noreturn -Wimplicit-fallthrough=5 -Wshadow -Wendif-labels -Wstrict-aliasing=2 -Wwrite-strings -Werror=overflow -Werror=shift-count-overflow -Werror=shift-overflow=2 -Wdate-time -Wnested-externs -ffast-math -fno-common -fdiagnostics-show-option -fno-strict-aliasing -fvisibility=hidden -fstack-protector -fstack-protector-strong --param=ssp-buffer-size=4 -fPIE -ffunction-sections -fdata-sections -Wno-unused-parameter -Wno-missing-field-initializers -Wno-unused-result -Wno-format-signedness -Wno-error=nonnull -Werror=shadow -include config.h -O2 -fwrapv -Wformat -Werror=format-security -gdwarf-4 -fno-debug-types-section -fvar-tracking-assignments -g2 -Wp,-D_FORTIFY_SOURCE=2 -fstack-protector-strong --param=ssp-buffer-size=4 -fomit-frame-pointer -march=i686 -fasynchronous-unwind-tables -mtune=pentium4 -gdwarf-4 -fno-debug-types-section -fvar-tracking-assignments -g2 -pthread  -MD -MQ 'systemd-resolved@exe/src_resolve_resolved-dns-search-domain.c.o' -MF 'systemd-resolved@exe/src_resolve_resolved-dns-search-domain.c.o.d' -o 'systemd-resolved@exe/src_resolve_resolved-dns-search-domain.c.o' -c ../src/resolve/resolved-dns-search-domain.c
[601/1582] i686-pld-linux-gcc -Isystemd-resolved@exe -I. -I.. -Isrc/basic -I../src/basic -Isrc/shared -I../src/shared -Isrc/systemd -I../src/systemd -Isrc/journal -I../src/journal -Isrc/journal-remote -I../src/journal-remote -Isrc/nspawn -I../src/nspawn -Isrc/resolve -I../src/resolve -Isrc/timesync -I../src/timesync -I../src/time-wait-sync -Isrc/login -I../src/login -Isrc/udev -I../src/udev -Isrc/libudev -I../src/libudev -Isrc/core -I../src/core -I../src/libsystemd/sd-bus -I../src/libsystemd/sd-device -I../src/libsystemd/sd-hwdb -I../src/libsystemd/sd-id128 -I../src/libsystemd/sd-netlink -I../src/libsystemd/sd-network -Isrc/libsystemd-network -I../src/libsystemd-network -I../ -I/usr/include/p11-kit-1 -fdiagnostics-color=always -pipe -D_FILE_OFFSET_BITS=64 -std=gnu99 -Wextra -Werror=undef -Wlogical-op -Wmissing-include-dirs -Wold-style-definition -Wpointer-arith -Winit-self -Wfloat-equal -Wsuggest-attribute=noreturn -Werror=missing-prototypes -Werror=implicit-function-declaration -Werror=missing-declarations -Werror=return-type -Werror=incompatible-pointer-types -Werror=format=2 -Wstrict-prototypes -Wredundant-decls -Wmissing-noreturn -Wimplicit-fallthrough=5 -Wshadow -Wendif-labels -Wstrict-aliasing=2 -Wwrite-strings -Werror=overflow -Werror=shift-count-overflow -Werror=shift-overflow=2 -Wdate-time -Wnested-externs -ffast-math -fno-common -fdiagnostics-show-option -fno-strict-aliasing -fvisibility=hidden -fstack-protector -fstack-protector-strong --param=ssp-buffer-size=4 -fPIE -ffunction-sections -fdata-sections -Wno-unused-parameter -Wno-missing-field-initializers -Wno-unused-result -Wno-format-signedness -Wno-error=nonnull -Werror=shadow -include config.h -O2 -fwrapv -Wformat -Werror=format-security -gdwarf-4 -fno-debug-types-section -fvar-tracking-assignments -g2 -Wp,-D_FORTIFY_SOURCE=2 -fstack-protector-strong --param=ssp-buffer-size=4 -fomit-frame-pointer -march=i686 -fasynchronous-unwind-tables -mtune=pentium4 -gdwarf-4 -fno-debug-types-section -fvar-tracking-assignments -g2 -pthread  -MD -MQ 'systemd-resolved@exe/src_resolve_resolved-dns-zone.c.o' -MF 'systemd-resolved@exe/src_resolve_resolved-dns-zone.c.o.d' -o 'systemd-resolved@exe/src_resolve_resolved-dns-zone.c.o' -c ../src/resolve/resolved-dns-zone.c
[602/1582] i686-pld-linux-gcc -Isystemd-resolved@exe -I. -I.. -Isrc/basic -I../src/basic -Isrc/shared -I../src/shared -Isrc/systemd -I../src/systemd -Isrc/journal -I../src/journal -Isrc/journal-remote -I../src/journal-remote -Isrc/nspawn -I../src/nspawn -Isrc/resolve -I../src/resolve -Isrc/timesync -I../src/timesync -I../src/time-wait-sync -Isrc/login -I../src/login -Isrc/udev -I../src/udev -Isrc/libudev -I../src/libudev -Isrc/core -I../src/core -I../src/libsystemd/sd-bus -I../src/libsystemd/sd-device -I../src/libsystemd/sd-hwdb -I../src/libsystemd/sd-id128 -I../src/libsystemd/sd-netlink -I../src/libsystemd/sd-network -Isrc/libsystemd-network -I../src/libsystemd-network -I../ -I/usr/include/p11-kit-1 -fdiagnostics-color=always -pipe -D_FILE_OFFSET_BITS=64 -std=gnu99 -Wextra -Werror=undef -Wlogical-op -Wmissing-include-dirs -Wold-style-definition -Wpointer-arith -Winit-self -Wfloat-equal -Wsuggest-attribute=noreturn -Werror=missing-prototypes -Werror=implicit-function-declaration -Werror=missing-declarations -Werror=return-type -Werror=incompatible-pointer-types -Werror=format=2 -Wstrict-prototypes -Wredundant-decls -Wmissing-noreturn -Wimplicit-fallthrough=5 -Wshadow -Wendif-labels -Wstrict-aliasing=2 -Wwrite-strings -Werror=overflow -Werror=shift-count-overflow -Werror=shift-overflow=2 -Wdate-time -Wnested-externs -ffast-math -fno-common -fdiagnostics-show-option -fno-strict-aliasing -fvisibility=hidden -fstack-protector -fstack-protector-strong --param=ssp-buffer-size=4 -fPIE -ffunction-sections -fdata-sections -Wno-unused-parameter -Wno-missing-field-initializers -Wno-unused-result -Wno-format-signedness -Wno-error=nonnull -Werror=shadow -include config.h -O2 -fwrapv -Wformat -Werror=format-security -gdwarf-4 -fno-debug-types-section -fvar-tracking-assignments -g2 -Wp,-D_FORTIFY_SOURCE=2 -fstack-protector-strong --param=ssp-buffer-size=4 -fomit-frame-pointer -march=i686 -fasynchronous-unwind-tables -mtune=pentium4 -gdwarf-4 -fno-debug-types-section -fvar-tracking-assignments -g2 -pthread  -MD -MQ 'systemd-resolved@exe/src_resolve_resolved-dns-stream.c.o' -MF 'systemd-resolved@exe/src_resolve_resolved-dns-stream.c.o.d' -o 'systemd-resolved@exe/src_resolve_resolved-dns-stream.c.o' -c ../src/resolve/resolved-dns-stream.c
[603/1582] i686-pld-linux-gcc -Isystemd-resolved@exe -I. -I.. -Isrc/basic -I../src/basic -Isrc/shared -I../src/shared -Isrc/systemd -I../src/systemd -Isrc/journal -I../src/journal -Isrc/journal-remote -I../src/journal-remote -Isrc/nspawn -I../src/nspawn -Isrc/resolve -I../src/resolve -Isrc/timesync -I../src/timesync -I../src/time-wait-sync -Isrc/login -I../src/login -Isrc/udev -I../src/udev -Isrc/libudev -I../src/libudev -Isrc/core -I../src/core -I../src/libsystemd/sd-bus -I../src/libsystemd/sd-device -I../src/libsystemd/sd-hwdb -I../src/libsystemd/sd-id128 -I../src/libsystemd/sd-netlink -I../src/libsystemd/sd-network -Isrc/libsystemd-network -I../src/libsystemd-network -I../ -I/usr/include/p11-kit-1 -fdiagnostics-color=always -pipe -D_FILE_OFFSET_BITS=64 -std=gnu99 -Wextra -Werror=undef -Wlogical-op -Wmissing-include-dirs -Wold-style-definition -Wpointer-arith -Winit-self -Wfloat-equal -Wsuggest-attribute=noreturn -Werror=missing-prototypes -Werror=implicit-function-declaration -Werror=missing-declarations -Werror=return-type -Werror=incompatible-pointer-types -Werror=format=2 -Wstrict-prototypes -Wredundant-decls -Wmissing-noreturn -Wimplicit-fallthrough=5 -Wshadow -Wendif-labels -Wstrict-aliasing=2 -Wwrite-strings -Werror=overflow -Werror=shift-count-overflow -Werror=shift-overflow=2 -Wdate-time -Wnested-externs -ffast-math -fno-common -fdiagnostics-show-option -fno-strict-aliasing -fvisibility=hidden -fstack-protector -fstack-protector-strong --param=ssp-buffer-size=4 -fPIE -ffunction-sections -fdata-sections -Wno-unused-parameter -Wno-missing-field-initializers -Wno-unused-result -Wno-format-signedness -Wno-error=nonnull -Werror=shadow -include config.h -O2 -fwrapv -Wformat -Werror=format-security -gdwarf-4 -fno-debug-types-section -fvar-tracking-assignments -g2 -Wp,-D_FORTIFY_SOURCE=2 -fstack-protector-strong --param=ssp-buffer-size=4 -fomit-frame-pointer -march=i686 -fasynchronous-unwind-tables -mtune=pentium4 -gdwarf-4 -fno-debug-types-section -fvar-tracking-assignments -g2 -pthread  -MD -MQ 'systemd-resolved@exe/src_resolve_resolved-dns-server.c.o' -MF 'systemd-resolved@exe/src_resolve_resolved-dns-server.c.o.d' -o 'systemd-resolved@exe/src_resolve_resolved-dns-server.c.o' -c ../src/resolve/resolved-dns-server.c
[604/1582] i686-pld-linux-gcc -Isystemd-resolved@exe -I. -I.. -Isrc/basic -I../src/basic -Isrc/shared -I../src/shared -Isrc/systemd -I../src/systemd -Isrc/journal -I../src/journal -Isrc/journal-remote -I../src/journal-remote -Isrc/nspawn -I../src/nspawn -Isrc/resolve -I../src/resolve -Isrc/timesync -I../src/timesync -I../src/time-wait-sync -Isrc/login -I../src/login -Isrc/udev -I../src/udev -Isrc/libudev -I../src/libudev -Isrc/core -I../src/core -I../src/libsystemd/sd-bus -I../src/libsystemd/sd-device -I../src/libsystemd/sd-hwdb -I../src/libsystemd/sd-id128 -I../src/libsystemd/sd-netlink -I../src/libsystemd/sd-network -Isrc/libsystemd-network -I../src/libsystemd-network -I../ -I/usr/include/p11-kit-1 -fdiagnostics-color=always -pipe -D_FILE_OFFSET_BITS=64 -std=gnu99 -Wextra -Werror=undef -Wlogical-op -Wmissing-include-dirs -Wold-style-definition -Wpointer-arith -Winit-self -Wfloat-equal -Wsuggest-attribute=noreturn -Werror=missing-prototypes -Werror=implicit-function-declaration -Werror=missing-declarations -Werror=return-type -Werror=incompatible-pointer-types -Werror=format=2 -Wstrict-prototypes -Wredundant-decls -Wmissing-noreturn -Wimplicit-fallthrough=5 -Wshadow -Wendif-labels -Wstrict-aliasing=2 -Wwrite-strings -Werror=overflow -Werror=shift-count-overflow -Werror=shift-overflow=2 -Wdate-time -Wnested-externs -ffast-math -fno-common -fdiagnostics-show-option -fno-strict-aliasing -fvisibility=hidden -fstack-protector -fstack-protector-strong --param=ssp-buffer-size=4 -fPIE -ffunction-sections -fdata-sections -Wno-unused-parameter -Wno-missing-field-initializers -Wno-unused-result -Wno-format-signedness -Wno-error=nonnull -Werror=shadow -include config.h -O2 -fwrapv -Wformat -Werror=format-security -gdwarf-4 -fno-debug-types-section -fvar-tracking-assignments -g2 -Wp,-D_FORTIFY_SOURCE=2 -fstack-protector-strong --param=ssp-buffer-size=4 -fomit-frame-pointer -march=i686 -fasynchronous-unwind-tables -mtune=pentium4 -gdwarf-4 -fno-debug-types-section -fvar-tracking-assignments -g2 -pthread  -MD -MQ 'systemd-resolved@exe/src_resolve_resolved-dns-cache.c.o' -MF 'systemd-resolved@exe/src_resolve_resolved-dns-cache.c.o.d' -o 'systemd-resolved@exe/src_resolve_resolved-dns-cache.c.o' -c ../src/resolve/resolved-dns-cache.c
[605/1582] i686-pld-linux-gcc -Isystemd-resolved@exe -I. -I.. -Isrc/basic -I../src/basic -Isrc/shared -I../src/shared -Isrc/systemd -I../src/systemd -Isrc/journal -I../src/journal -Isrc/journal-remote -I../src/journal-remote -Isrc/nspawn -I../src/nspawn -Isrc/resolve -I../src/resolve -Isrc/timesync -I../src/timesync -I../src/time-wait-sync -Isrc/login -I../src/login -Isrc/udev -I../src/udev -Isrc/libudev -I../src/libudev -Isrc/core -I../src/core -I../src/libsystemd/sd-bus -I../src/libsystemd/sd-device -I../src/libsystemd/sd-hwdb -I../src/libsystemd/sd-id128 -I../src/libsystemd/sd-netlink -I../src/libsystemd/sd-network -Isrc/libsystemd-network -I../src/libsystemd-network -I../ -I/usr/include/p11-kit-1 -fdiagnostics-color=always -pipe -D_FILE_OFFSET_BITS=64 -std=gnu99 -Wextra -Werror=undef -Wlogical-op -Wmissing-include-dirs -Wold-style-definition -Wpointer-arith -Winit-self -Wfloat-equal -Wsuggest-attribute=noreturn -Werror=missing-prototypes -Werror=implicit-function-declaration -Werror=missing-declarations -Werror=return-type -Werror=incompatible-pointer-types -Werror=format=2 -Wstrict-prototypes -Wredundant-decls -Wmissing-noreturn -Wimplicit-fallthrough=5 -Wshadow -Wendif-labels -Wstrict-aliasing=2 -Wwrite-strings -Werror=overflow -Werror=shift-count-overflow -Werror=shift-overflow=2 -Wdate-time -Wnested-externs -ffast-math -fno-common -fdiagnostics-show-option -fno-strict-aliasing -fvisibility=hidden -fstack-protector -fstack-protector-strong --param=ssp-buffer-size=4 -fPIE -ffunction-sections -fdata-sections -Wno-unused-parameter -Wno-missing-field-initializers -Wno-unused-result -Wno-format-signedness -Wno-error=nonnull -Werror=shadow -include config.h -O2 -fwrapv -Wformat -Werror=format-security -gdwarf-4 -fno-debug-types-section -fvar-tracking-assignments -g2 -Wp,-D_FORTIFY_SOURCE=2 -fstack-protector-strong --param=ssp-buffer-size=4 -fomit-frame-pointer -march=i686 -fasynchronous-unwind-tables -mtune=pentium4 -gdwarf-4 -fno-debug-types-section -fvar-tracking-assignments -g2 -pthread  -MD -MQ 'systemd-resolved@exe/src_resolve_resolved-dns-scope.c.o' -MF 'systemd-resolved@exe/src_resolve_resolved-dns-scope.c.o.d' -o 'systemd-resolved@exe/src_resolve_resolved-dns-scope.c.o' -c ../src/resolve/resolved-dns-scope.c
[606/1582] i686-pld-linux-gcc -Iresolvectl@exe -I. -I.. -Isrc/basic -I../src/basic -Isrc/shared -I../src/shared -Isrc/systemd -I../src/systemd -Isrc/journal -I../src/journal -Isrc/journal-remote -I../src/journal-remote -Isrc/nspawn -I../src/nspawn -Isrc/resolve -I../src/resolve -Isrc/timesync -I../src/timesync -I../src/time-wait-sync -Isrc/login -I../src/login -Isrc/udev -I../src/udev -Isrc/libudev -I../src/libudev -Isrc/core -I../src/core -I../src/libsystemd/sd-bus -I../src/libsystemd/sd-device -I../src/libsystemd/sd-hwdb -I../src/libsystemd/sd-id128 -I../src/libsystemd/sd-netlink -I../src/libsystemd/sd-network -Isrc/libsystemd-network -I../src/libsystemd-network -I../ -fdiagnostics-color=always -pipe -D_FILE_OFFSET_BITS=64 -std=gnu99 -Wextra -Werror=undef -Wlogical-op -Wmissing-include-dirs -Wold-style-definition -Wpointer-arith -Winit-self -Wfloat-equal -Wsuggest-attribute=noreturn -Werror=missing-prototypes -Werror=implicit-function-declaration -Werror=missing-declarations -Werror=return-type -Werror=incompatible-pointer-types -Werror=format=2 -Wstrict-prototypes -Wredundant-decls -Wmissing-noreturn -Wimplicit-fallthrough=5 -Wshadow -Wendif-labels -Wstrict-aliasing=2 -Wwrite-strings -Werror=overflow -Werror=shift-count-overflow -Werror=shift-overflow=2 -Wdate-time -Wnested-externs -ffast-math -fno-common -fdiagnostics-show-option -fno-strict-aliasing -fvisibility=hidden -fstack-protector -fstack-protector-strong --param=ssp-buffer-size=4 -fPIE -ffunction-sections -fdata-sections -Wno-unused-parameter -Wno-missing-field-initializers -Wno-unused-result -Wno-format-signedness -Wno-error=nonnull -Werror=shadow -include config.h -O2 -fwrapv -Wformat -Werror=format-security -gdwarf-4 -fno-debug-types-section -fvar-tracking-assignments -g2 -Wp,-D_FORTIFY_SOURCE=2 -fstack-protector-strong --param=ssp-buffer-size=4 -fomit-frame-pointer -march=i686 -fasynchronous-unwind-tables -mtune=pentium4 -gdwarf-4 -fno-debug-types-section -fvar-tracking-assignments -g2 -pthread  -MD -MQ 'resolvectl@exe/src_resolve_resolvectl.c.o' -MF 'resolvectl@exe/src_resolve_resolvectl.c.o.d' -o 'resolvectl@exe/src_resolve_resolvectl.c.o' -c ../src/resolve/resolvectl.c
[607/1582] i686-pld-linux-gcc -Isystemd-resolved@exe -I. -I.. -Isrc/basic -I../src/basic -Isrc/shared -I../src/shared -Isrc/systemd -I../src/systemd -Isrc/journal -I../src/journal -Isrc/journal-remote -I../src/journal-remote -Isrc/nspawn -I../src/nspawn -Isrc/resolve -I../src/resolve -Isrc/timesync -I../src/timesync -I../src/time-wait-sync -Isrc/login -I../src/login -Isrc/udev -I../src/udev -Isrc/libudev -I../src/libudev -Isrc/core -I../src/core -I../src/libsystemd/sd-bus -I../src/libsystemd/sd-device -I../src/libsystemd/sd-hwdb -I../src/libsystemd/sd-id128 -I../src/libsystemd/sd-netlink -I../src/libsystemd/sd-network -Isrc/libsystemd-network -I../src/libsystemd-network -I../ -I/usr/include/p11-kit-1 -fdiagnostics-color=always -pipe -D_FILE_OFFSET_BITS=64 -std=gnu99 -Wextra -Werror=undef -Wlogical-op -Wmissing-include-dirs -Wold-style-definition -Wpointer-arith -Winit-self -Wfloat-equal -Wsuggest-attribute=noreturn -Werror=missing-prototypes -Werror=implicit-function-declaration -Werror=missing-declarations -Werror=return-type -Werror=incompatible-pointer-types -Werror=format=2 -Wstrict-prototypes -Wredundant-decls -Wmissing-noreturn -Wimplicit-fallthrough=5 -Wshadow -Wendif-labels -Wstrict-aliasing=2 -Wwrite-strings -Werror=overflow -Werror=shift-count-overflow -Werror=shift-overflow=2 -Wdate-time -Wnested-externs -ffast-math -fno-common -fdiagnostics-show-option -fno-strict-aliasing -fvisibility=hidden -fstack-protector -fstack-protector-strong --param=ssp-buffer-size=4 -fPIE -ffunction-sections -fdata-sections -Wno-unused-parameter -Wno-missing-field-initializers -Wno-unused-result -Wno-format-signedness -Wno-error=nonnull -Werror=shadow -include config.h -O2 -fwrapv -Wformat -Werror=format-security -gdwarf-4 -fno-debug-types-section -fvar-tracking-assignments -g2 -Wp,-D_FORTIFY_SOURCE=2 -fstack-protector-strong --param=ssp-buffer-size=4 -fomit-frame-pointer -march=i686 -fasynchronous-unwind-tables -mtune=pentium4 -gdwarf-4 -fno-debug-types-section -fvar-tracking-assignments -g2 -pthread  -MD -MQ 'systemd-resolved@exe/src_resolve_resolved-dns-trust-anchor.c.o' -MF 'systemd-resolved@exe/src_resolve_resolved-dns-trust-anchor.c.o.d' -o 'systemd-resolved@exe/src_resolve_resolved-dns-trust-anchor.c.o' -c ../src/resolve/resolved-dns-trust-anchor.c
[608/1582] i686-pld-linux-gcc -Isystemd-resolved@exe -I. -I.. -Isrc/basic -I../src/basic -Isrc/shared -I../src/shared -Isrc/systemd -I../src/systemd -Isrc/journal -I../src/journal -Isrc/journal-remote -I../src/journal-remote -Isrc/nspawn -I../src/nspawn -Isrc/resolve -I../src/resolve -Isrc/timesync -I../src/timesync -I../src/time-wait-sync -Isrc/login -I../src/login -Isrc/udev -I../src/udev -Isrc/libudev -I../src/libudev -Isrc/core -I../src/core -I../src/libsystemd/sd-bus -I../src/libsystemd/sd-device -I../src/libsystemd/sd-hwdb -I../src/libsystemd/sd-id128 -I../src/libsystemd/sd-netlink -I../src/libsystemd/sd-network -Isrc/libsystemd-network -I../src/libsystemd-network -I../ -I/usr/include/p11-kit-1 -fdiagnostics-color=always -pipe -D_FILE_OFFSET_BITS=64 -std=gnu99 -Wextra -Werror=undef -Wlogical-op -Wmissing-include-dirs -Wold-style-definition -Wpointer-arith -Winit-self -Wfloat-equal -Wsuggest-attribute=noreturn -Werror=missing-prototypes -Werror=implicit-function-declaration -Werror=missing-declarations -Werror=return-type -Werror=incompatible-pointer-types -Werror=format=2 -Wstrict-prototypes -Wredundant-decls -Wmissing-noreturn -Wimplicit-fallthrough=5 -Wshadow -Wendif-labels -Wstrict-aliasing=2 -Wwrite-strings -Werror=overflow -Werror=shift-count-overflow -Werror=shift-overflow=2 -Wdate-time -Wnested-externs -ffast-math -fno-common -fdiagnostics-show-option -fno-strict-aliasing -fvisibility=hidden -fstack-protector -fstack-protector-strong --param=ssp-buffer-size=4 -fPIE -ffunction-sections -fdata-sections -Wno-unused-parameter -Wno-missing-field-initializers -Wno-unused-result -Wno-format-signedness -Wno-error=nonnull -Werror=shadow -include config.h -O2 -fwrapv -Wformat -Werror=format-security -gdwarf-4 -fno-debug-types-section -fvar-tracking-assignments -g2 -Wp,-D_FORTIFY_SOURCE=2 -fstack-protector-strong --param=ssp-buffer-size=4 -fomit-frame-pointer -march=i686 -fasynchronous-unwind-tables -mtune=pentium4 -gdwarf-4 -fno-debug-types-section -fvar-tracking-assignments -g2 -pthread  -MD -MQ 'systemd-resolved@exe/src_resolve_resolved-dns-stub.c.o' -MF 'systemd-resolved@exe/src_resolve_resolved-dns-stub.c.o.d' -o 'systemd-resolved@exe/src_resolve_resolved-dns-stub.c.o' -c ../src/resolve/resolved-dns-stub.c
[609/1582] i686-pld-linux-gcc  -o resolvectl 'resolvectl@exe/src_resolve_resolvconf-compat.c.o' 'resolvectl@exe/src_resolve_resolvectl.c.o' -Wl,--no-undefined -Wl,--as-needed -Wl,-z,relro -Wl,-z,now -pie -Wl,--gc-sections -O2 -fwrapv -pipe -Wformat -Werror=format-security -gdwarf-4 -fno-debug-types-section -fvar-tracking-assignments -g2 -Wp,-D_FORTIFY_SOURCE=2 -fstack-protector-strong --param=ssp-buffer-size=4 -fomit-frame-pointer -march=i686 -fasynchronous-unwind-tables -mtune=pentium4 -gdwarf-4 -fno-debug-types-section -fvar-tracking-assignments -g2 -Wl,--as-needed -Wl,--no-copy-dt-needed-entries -Wl,-z,relro -Wl,-z,combreloc -Wl,--start-group src/shared/libsystemd-shared-239.so src/basic/libbasic-gcrypt.a src/resolve/libsystemd-resolve-core.a -lgpg-error -lm /usr/lib/libidn2.so -lgcrypt -Wl,--end-group -pthread '-Wl,-rpath,$ORIGIN/src/shared:$ORIGIN/src/basic:$ORIGIN/src/resolve' -Wl,-rpath-link,/tmp/B.JN6jpr/BUILD/systemd-239/build/src/shared:/tmp/B.JN6jpr/BUILD/systemd-239/build/src/basic:/tmp/B.JN6jpr/BUILD/systemd-239/build/src/resolve  
[610/1582] i686-pld-linux-gcc -Isystemd-resolved@exe -I. -I.. -Isrc/basic -I../src/basic -Isrc/shared -I../src/shared -Isrc/systemd -I../src/systemd -Isrc/journal -I../src/journal -Isrc/journal-remote -I../src/journal-remote -Isrc/nspawn -I../src/nspawn -Isrc/resolve -I../src/resolve -Isrc/timesync -I../src/timesync -I../src/time-wait-sync -Isrc/login -I../src/login -Isrc/udev -I../src/udev -Isrc/libudev -I../src/libudev -Isrc/core -I../src/core -I../src/libsystemd/sd-bus -I../src/libsystemd/sd-device -I../src/libsystemd/sd-hwdb -I../src/libsystemd/sd-id128 -I../src/libsystemd/sd-netlink -I../src/libsystemd/sd-network -Isrc/libsystemd-network -I../src/libsystemd-network -I../ -I/usr/include/p11-kit-1 -fdiagnostics-color=always -pipe -D_FILE_OFFSET_BITS=64 -std=gnu99 -Wextra -Werror=undef -Wlogical-op -Wmissing-include-dirs -Wold-style-definition -Wpointer-arith -Winit-self -Wfloat-equal -Wsuggest-attribute=noreturn -Werror=missing-prototypes -Werror=implicit-function-declaration -Werror=missing-declarations -Werror=return-type -Werror=incompatible-pointer-types -Werror=format=2 -Wstrict-prototypes -Wredundant-decls -Wmissing-noreturn -Wimplicit-fallthrough=5 -Wshadow -Wendif-labels -Wstrict-aliasing=2 -Wwrite-strings -Werror=overflow -Werror=shift-count-overflow -Werror=shift-overflow=2 -Wdate-time -Wnested-externs -ffast-math -fno-common -fdiagnostics-show-option -fno-strict-aliasing -fvisibility=hidden -fstack-protector -fstack-protector-strong --param=ssp-buffer-size=4 -fPIE -ffunction-sections -fdata-sections -Wno-unused-parameter -Wno-missing-field-initializers -Wno-unused-result -Wno-format-signedness -Wno-error=nonnull -Werror=shadow -include config.h -O2 -fwrapv -Wformat -Werror=format-security -gdwarf-4 -fno-debug-types-section -fvar-tracking-assignments -g2 -Wp,-D_FORTIFY_SOURCE=2 -fstack-protector-strong --param=ssp-buffer-size=4 -fomit-frame-pointer -march=i686 -fasynchronous-unwind-tables -mtune=pentium4 -gdwarf-4 -fno-debug-types-section -fvar-tracking-assignments -g2 -pthread  -MD -MQ 'systemd-resolved@exe/src_resolve_resolved-etc-hosts.c.o' -MF 'systemd-resolved@exe/src_resolve_resolved-etc-hosts.c.o.d' -o 'systemd-resolved@exe/src_resolve_resolved-etc-hosts.c.o' -c ../src/resolve/resolved-etc-hosts.c
[611/1582] i686-pld-linux-gcc -Iloginctl@exe -I. -I.. -Isrc/basic -I../src/basic -Isrc/shared -I../src/shared -Isrc/systemd -I../src/systemd -Isrc/journal -I../src/journal -Isrc/journal-remote -I../src/journal-remote -Isrc/nspawn -I../src/nspawn -Isrc/resolve -I../src/resolve -Isrc/timesync -I../src/timesync -I../src/time-wait-sync -Isrc/login -I../src/login -Isrc/udev -I../src/udev -Isrc/libudev -I../src/libudev -Isrc/core -I../src/core -I../src/libsystemd/sd-bus -I../src/libsystemd/sd-device -I../src/libsystemd/sd-hwdb -I../src/libsystemd/sd-id128 -I../src/libsystemd/sd-netlink -I../src/libsystemd/sd-network -Isrc/libsystemd-network -I../src/libsystemd-network -I../ -fdiagnostics-color=always -pipe -D_FILE_OFFSET_BITS=64 -std=gnu99 -Wextra -Werror=undef -Wlogical-op -Wmissing-include-dirs -Wold-style-definition -Wpointer-arith -Winit-self -Wfloat-equal -Wsuggest-attribute=noreturn -Werror=missing-prototypes -Werror=implicit-function-declaration -Werror=missing-declarations -Werror=return-type -Werror=incompatible-pointer-types -Werror=format=2 -Wstrict-prototypes -Wredundant-decls -Wmissing-noreturn -Wimplicit-fallthrough=5 -Wshadow -Wendif-labels -Wstrict-aliasing=2 -Wwrite-strings -Werror=overflow -Werror=shift-count-overflow -Werror=shift-overflow=2 -Wdate-time -Wnested-externs -ffast-math -fno-common -fdiagnostics-show-option -fno-strict-aliasing -fvisibility=hidden -fstack-protector -fstack-protector-strong --param=ssp-buffer-size=4 -fPIE -ffunction-sections -fdata-sections -Wno-unused-parameter -Wno-missing-field-initializers -Wno-unused-result -Wno-format-signedness -Wno-error=nonnull -Werror=shadow -include config.h -O2 -fwrapv -Wformat -Werror=format-security -gdwarf-4 -fno-debug-types-section -fvar-tracking-assignments -g2 -Wp,-D_FORTIFY_SOURCE=2 -fstack-protector-strong --param=ssp-buffer-size=4 -fomit-frame-pointer -march=i686 -fasynchronous-unwind-tables -mtune=pentium4 -gdwarf-4 -fno-debug-types-section -fvar-tracking-assignments -g2 -pthread  -MD -MQ 'loginctl@exe/src_login_sysfs-show.c.o' -MF 'loginctl@exe/src_login_sysfs-show.c.o.d' -o 'loginctl@exe/src_login_sysfs-show.c.o' -c ../src/login/sysfs-show.c
[612/1582] i686-pld-linux-gcc -Isystemd-inhibit@exe -I. -I.. -Isrc/basic -I../src/basic -Isrc/shared -I../src/shared -Isrc/systemd -I../src/systemd -Isrc/journal -I../src/journal -Isrc/journal-remote -I../src/journal-remote -Isrc/nspawn -I../src/nspawn -Isrc/resolve -I../src/resolve -Isrc/timesync -I../src/timesync -I../src/time-wait-sync -Isrc/login -I../src/login -Isrc/udev -I../src/udev -Isrc/libudev -I../src/libudev -Isrc/core -I../src/core -I../src/libsystemd/sd-bus -I../src/libsystemd/sd-device -I../src/libsystemd/sd-hwdb -I../src/libsystemd/sd-id128 -I../src/libsystemd/sd-netlink -I../src/libsystemd/sd-network -Isrc/libsystemd-network -I../src/libsystemd-network -I../ -fdiagnostics-color=always -pipe -D_FILE_OFFSET_BITS=64 -std=gnu99 -Wextra -Werror=undef -Wlogical-op -Wmissing-include-dirs -Wold-style-definition -Wpointer-arith -Winit-self -Wfloat-equal -Wsuggest-attribute=noreturn -Werror=missing-prototypes -Werror=implicit-function-declaration -Werror=missing-declarations -Werror=return-type -Werror=incompatible-pointer-types -Werror=format=2 -Wstrict-prototypes -Wredundant-decls -Wmissing-noreturn -Wimplicit-fallthrough=5 -Wshadow -Wendif-labels -Wstrict-aliasing=2 -Wwrite-strings -Werror=overflow -Werror=shift-count-overflow -Werror=shift-overflow=2 -Wdate-time -Wnested-externs -ffast-math -fno-common -fdiagnostics-show-option -fno-strict-aliasing -fvisibility=hidden -fstack-protector -fstack-protector-strong --param=ssp-buffer-size=4 -fPIE -ffunction-sections -fdata-sections -Wno-unused-parameter -Wno-missing-field-initializers -Wno-unused-result -Wno-format-signedness -Wno-error=nonnull -Werror=shadow -include config.h -O2 -fwrapv -Wformat -Werror=format-security -gdwarf-4 -fno-debug-types-section -fvar-tracking-assignments -g2 -Wp,-D_FORTIFY_SOURCE=2 -fstack-protector-strong --param=ssp-buffer-size=4 -fomit-frame-pointer -march=i686 -fasynchronous-unwind-tables -mtune=pentium4 -gdwarf-4 -fno-debug-types-section -fvar-tracking-assignments -g2  -MD -MQ 'systemd-inhibit@exe/src_login_inhibit.c.o' -MF 'systemd-inhibit@exe/src_login_inhibit.c.o.d' -o 'systemd-inhibit@exe/src_login_inhibit.c.o' -c ../src/login/inhibit.c
[613/1582] i686-pld-linux-gcc -Isystemd-user-sessions@exe -I. -I.. -Isrc/basic -I../src/basic -Isrc/shared -I../src/shared -Isrc/systemd -I../src/systemd -Isrc/journal -I../src/journal -Isrc/journal-remote -I../src/journal-remote -Isrc/nspawn -I../src/nspawn -Isrc/resolve -I../src/resolve -Isrc/timesync -I../src/timesync -I../src/time-wait-sync -Isrc/login -I../src/login -Isrc/udev -I../src/udev -Isrc/libudev -I../src/libudev -Isrc/core -I../src/core -I../src/libsystemd/sd-bus -I../src/libsystemd/sd-device -I../src/libsystemd/sd-hwdb -I../src/libsystemd/sd-id128 -I../src/libsystemd/sd-netlink -I../src/libsystemd/sd-network -Isrc/libsystemd-network -I../src/libsystemd-network -I../ -fdiagnostics-color=always -pipe -D_FILE_OFFSET_BITS=64 -std=gnu99 -Wextra -Werror=undef -Wlogical-op -Wmissing-include-dirs -Wold-style-definition -Wpointer-arith -Winit-self -Wfloat-equal -Wsuggest-attribute=noreturn -Werror=missing-prototypes -Werror=implicit-function-declaration -Werror=missing-declarations -Werror=return-type -Werror=incompatible-pointer-types -Werror=format=2 -Wstrict-prototypes -Wredundant-decls -Wmissing-noreturn -Wimplicit-fallthrough=5 -Wshadow -Wendif-labels -Wstrict-aliasing=2 -Wwrite-strings -Werror=overflow -Werror=shift-count-overflow -Werror=shift-overflow=2 -Wdate-time -Wnested-externs -ffast-math -fno-common -fdiagnostics-show-option -fno-strict-aliasing -fvisibility=hidden -fstack-protector -fstack-protector-strong --param=ssp-buffer-size=4 -fPIE -ffunction-sections -fdata-sections -Wno-unused-parameter -Wno-missing-field-initializers -Wno-unused-result -Wno-format-signedness -Wno-error=nonnull -Werror=shadow -include config.h -O2 -fwrapv -Wformat -Werror=format-security -gdwarf-4 -fno-debug-types-section -fvar-tracking-assignments -g2 -Wp,-D_FORTIFY_SOURCE=2 -fstack-protector-strong --param=ssp-buffer-size=4 -fomit-frame-pointer -march=i686 -fasynchronous-unwind-tables -mtune=pentium4 -gdwarf-4 -fno-debug-types-section -fvar-tracking-assignments -g2  -MD -MQ 'systemd-user-sessions@exe/src_user-sessions_user-sessions.c.o' -MF 'systemd-user-sessions@exe/src_user-sessions_user-sessions.c.o.d' -o 'systemd-user-sessions@exe/src_user-sessions_user-sessions.c.o' -c ../src/user-sessions/user-sessions.c
[614/1582] i686-pld-linux-gcc  -o systemd-inhibit 'systemd-inhibit@exe/src_login_inhibit.c.o' -Wl,--no-undefined -Wl,--as-needed -Wl,-z,relro -Wl,-z,now -pie -Wl,--gc-sections -O2 -fwrapv -pipe -Wformat -Werror=format-security -gdwarf-4 -fno-debug-types-section -fvar-tracking-assignments -g2 -Wp,-D_FORTIFY_SOURCE=2 -fstack-protector-strong --param=ssp-buffer-size=4 -fomit-frame-pointer -march=i686 -fasynchronous-unwind-tables -mtune=pentium4 -gdwarf-4 -fno-debug-types-section -fvar-tracking-assignments -g2 -Wl,--as-needed -Wl,--no-copy-dt-needed-entries -Wl,-z,relro -Wl,-z,combreloc -Wl,--start-group src/shared/libsystemd-shared-239.so -Wl,--end-group '-Wl,-rpath,$ORIGIN/src/shared' -Wl,-rpath-link,/tmp/B.JN6jpr/BUILD/systemd-239/build/src/shared  
[615/1582] i686-pld-linux-gcc -Isystemd-user-runtime-dir@exe -I. -I.. -Isrc/basic -I../src/basic -Isrc/shared -I../src/shared -Isrc/systemd -I../src/systemd -Isrc/journal -I../src/journal -Isrc/journal-remote -I../src/journal-remote -Isrc/nspawn -I../src/nspawn -Isrc/resolve -I../src/resolve -Isrc/timesync -I../src/timesync -I../src/time-wait-sync -Isrc/login -I../src/login -Isrc/udev -I../src/udev -Isrc/libudev -I../src/libudev -Isrc/core -I../src/core -I../src/libsystemd/sd-bus -I../src/libsystemd/sd-device -I../src/libsystemd/sd-hwdb -I../src/libsystemd/sd-id128 -I../src/libsystemd/sd-netlink -I../src/libsystemd/sd-network -Isrc/libsystemd-network -I../src/libsystemd-network -I../ -fdiagnostics-color=always -pipe -D_FILE_OFFSET_BITS=64 -std=gnu99 -Wextra -Werror=undef -Wlogical-op -Wmissing-include-dirs -Wold-style-definition -Wpointer-arith -Winit-self -Wfloat-equal -Wsuggest-attribute=noreturn -Werror=missing-prototypes -Werror=implicit-function-declaration -Werror=missing-declarations -Werror=return-type -Werror=incompatible-pointer-types -Werror=format=2 -Wstrict-prototypes -Wredundant-decls -Wmissing-noreturn -Wimplicit-fallthrough=5 -Wshadow -Wendif-labels -Wstrict-aliasing=2 -Wwrite-strings -Werror=overflow -Werror=shift-count-overflow -Werror=shift-overflow=2 -Wdate-time -Wnested-externs -ffast-math -fno-common -fdiagnostics-show-option -fno-strict-aliasing -fvisibility=hidden -fstack-protector -fstack-protector-strong --param=ssp-buffer-size=4 -fPIE -ffunction-sections -fdata-sections -Wno-unused-parameter -Wno-missing-field-initializers -Wno-unused-result -Wno-format-signedness -Wno-error=nonnull -Werror=shadow -include config.h -O2 -fwrapv -Wformat -Werror=format-security -gdwarf-4 -fno-debug-types-section -fvar-tracking-assignments -g2 -Wp,-D_FORTIFY_SOURCE=2 -fstack-protector-strong --param=ssp-buffer-size=4 -fomit-frame-pointer -march=i686 -fasynchronous-unwind-tables -mtune=pentium4 -gdwarf-4 -fno-debug-types-section -fvar-tracking-assignments -g2  -MD -MQ 'systemd-user-runtime-dir@exe/src_login_user-runtime-dir.c.o' -MF 'systemd-user-runtime-dir@exe/src_login_user-runtime-dir.c.o.d' -o 'systemd-user-runtime-dir@exe/src_login_user-runtime-dir.c.o' -c ../src/login/user-runtime-dir.c
[616/1582] i686-pld-linux-gcc -Isystemd-portabled@exe -I. -I.. -Isrc/basic -I../src/basic -Isrc/shared -I../src/shared -Isrc/systemd -I../src/systemd -Isrc/journal -I../src/journal -Isrc/journal-remote -I../src/journal-remote -Isrc/nspawn -I../src/nspawn -Isrc/resolve -I../src/resolve -Isrc/timesync -I../src/timesync -I../src/time-wait-sync -Isrc/login -I../src/login -Isrc/udev -I../src/udev -Isrc/libudev -I../src/libudev -Isrc/core -I../src/core -I../src/libsystemd/sd-bus -I../src/libsystemd/sd-device -I../src/libsystemd/sd-hwdb -I../src/libsystemd/sd-id128 -I../src/libsystemd/sd-netlink -I../src/libsystemd/sd-network -Isrc/libsystemd-network -I../src/libsystemd-network -I../ -fdiagnostics-color=always -pipe -D_FILE_OFFSET_BITS=64 -std=gnu99 -Wextra -Werror=undef -Wlogical-op -Wmissing-include-dirs -Wold-style-definition -Wpointer-arith -Winit-self -Wfloat-equal -Wsuggest-attribute=noreturn -Werror=missing-prototypes -Werror=implicit-function-declaration -Werror=missing-declarations -Werror=return-type -Werror=incompatible-pointer-types -Werror=format=2 -Wstrict-prototypes -Wredundant-decls -Wmissing-noreturn -Wimplicit-fallthrough=5 -Wshadow -Wendif-labels -Wstrict-aliasing=2 -Wwrite-strings -Werror=overflow -Werror=shift-count-overflow -Werror=shift-overflow=2 -Wdate-time -Wnested-externs -ffast-math -fno-common -fdiagnostics-show-option -fno-strict-aliasing -fvisibility=hidden -fstack-protector -fstack-protector-strong --param=ssp-buffer-size=4 -fPIE -ffunction-sections -fdata-sections -Wno-unused-parameter -Wno-missing-field-initializers -Wno-unused-result -Wno-format-signedness -Wno-error=nonnull -Werror=shadow -include config.h -O2 -fwrapv -Wformat -Werror=format-security -gdwarf-4 -fno-debug-types-section -fvar-tracking-assignments -g2 -Wp,-D_FORTIFY_SOURCE=2 -fstack-protector-strong --param=ssp-buffer-size=4 -fomit-frame-pointer -march=i686 -fasynchronous-unwind-tables -mtune=pentium4 -gdwarf-4 -fno-debug-types-section -fvar-tracking-assignments -g2 -pthread  -MD -MQ 'systemd-portabled@exe/src_portable_portabled-operation.c.o' -MF 'systemd-portabled@exe/src_portable_portabled-operation.c.o.d' -o 'systemd-portabled@exe/src_portable_portabled-operation.c.o' -c ../src/portable/portabled-operation.c
[617/1582] i686-pld-linux-gcc -Isystemd-system-update-generator@exe -I. -I.. -Isrc/basic -I../src/basic -Isrc/shared -I../src/shared -Isrc/systemd -I../src/systemd -Isrc/journal -I../src/journal -Isrc/journal-remote -I../src/journal-remote -Isrc/nspawn -I../src/nspawn -Isrc/resolve -I../src/resolve -Isrc/timesync -I../src/timesync -I../src/time-wait-sync -Isrc/login -I../src/login -Isrc/udev -I../src/udev -Isrc/libudev -I../src/libudev -Isrc/core -I../src/core -I../src/libsystemd/sd-bus -I../src/libsystemd/sd-device -I../src/libsystemd/sd-hwdb -I../src/libsystemd/sd-id128 -I../src/libsystemd/sd-netlink -I../src/libsystemd/sd-network -Isrc/libsystemd-network -I../src/libsystemd-network -I../ -fdiagnostics-color=always -pipe -D_FILE_OFFSET_BITS=64 -std=gnu99 -Wextra -Werror=undef -Wlogical-op -Wmissing-include-dirs -Wold-style-definition -Wpointer-arith -Winit-self -Wfloat-equal -Wsuggest-attribute=noreturn -Werror=missing-prototypes -Werror=implicit-function-declaration -Werror=missing-declarations -Werror=return-type -Werror=incompatible-pointer-types -Werror=format=2 -Wstrict-prototypes -Wredundant-decls -Wmissing-noreturn -Wimplicit-fallthrough=5 -Wshadow -Wendif-labels -Wstrict-aliasing=2 -Wwrite-strings -Werror=overflow -Werror=shift-count-overflow -Werror=shift-overflow=2 -Wdate-time -Wnested-externs -ffast-math -fno-common -fdiagnostics-show-option -fno-strict-aliasing -fvisibility=hidden -fstack-protector -fstack-protector-strong --param=ssp-buffer-size=4 -fPIE -ffunction-sections -fdata-sections -Wno-unused-parameter -Wno-missing-field-initializers -Wno-unused-result -Wno-format-signedness -Wno-error=nonnull -Werror=shadow -include config.h -O2 -fwrapv -Wformat -Werror=format-security -gdwarf-4 -fno-debug-types-section -fvar-tracking-assignments -g2 -Wp,-D_FORTIFY_SOURCE=2 -fstack-protector-strong --param=ssp-buffer-size=4 -fomit-frame-pointer -march=i686 -fasynchronous-unwind-tables -mtune=pentium4 -gdwarf-4 -fno-debug-types-section -fvar-tracking-assignments -g2  -MD -MQ 'systemd-system-update-generator@exe/src_system-update-generator_system-update-generator.c.o' -MF 'systemd-system-update-generator@exe/src_system-update-generator_system-update-generator.c.o.d' -o 'systemd-system-update-generator@exe/src_system-update-generator_system-update-generator.c.o' -c ../src/system-update-generator/system-update-generator.c
[618/1582] i686-pld-linux-gcc -Ipam_systemd@sha -I. -I.. -Isrc/basic -I../src/basic -Isrc/shared -I../src/shared -Isrc/systemd -I../src/systemd -Isrc/journal -I../src/journal -Isrc/journal-remote -I../src/journal-remote -Isrc/nspawn -I../src/nspawn -Isrc/resolve -I../src/resolve -Isrc/timesync -I../src/timesync -I../src/time-wait-sync -Isrc/login -I../src/login -Isrc/udev -I../src/udev -Isrc/libudev -I../src/libudev -Isrc/core -I../src/core -I../src/libsystemd/sd-bus -I../src/libsystemd/sd-device -I../src/libsystemd/sd-hwdb -I../src/libsystemd/sd-id128 -I../src/libsystemd/sd-netlink -I../src/libsystemd/sd-network -Isrc/libsystemd-network -I../src/libsystemd-network -I../ -fdiagnostics-color=always -pipe -D_FILE_OFFSET_BITS=64 -std=gnu99 -Wextra -Werror=undef -Wlogical-op -Wmissing-include-dirs -Wold-style-definition -Wpointer-arith -Winit-self -Wfloat-equal -Wsuggest-attribute=noreturn -Werror=missing-prototypes -Werror=implicit-function-declaration -Werror=missing-declarations -Werror=return-type -Werror=incompatible-pointer-types -Werror=format=2 -Wstrict-prototypes -Wredundant-decls -Wmissing-noreturn -Wimplicit-fallthrough=5 -Wshadow -Wendif-labels -Wstrict-aliasing=2 -Wwrite-strings -Werror=overflow -Werror=shift-count-overflow -Werror=shift-overflow=2 -Wdate-time -Wnested-externs -ffast-math -fno-common -fdiagnostics-show-option -fno-strict-aliasing -fvisibility=hidden -fstack-protector -fstack-protector-strong --param=ssp-buffer-size=4 -fPIE -ffunction-sections -fdata-sections -Wno-unused-parameter -Wno-missing-field-initializers -Wno-unused-result -Wno-format-signedness -Wno-error=nonnull -Werror=shadow -include config.h -O2 -fwrapv -Wformat -Werror=format-security -gdwarf-4 -fno-debug-types-section -fvar-tracking-assignments -g2 -Wp,-D_FORTIFY_SOURCE=2 -fstack-protector-strong --param=ssp-buffer-size=4 -fomit-frame-pointer -march=i686 -fasynchronous-unwind-tables -mtune=pentium4 -gdwarf-4 -fno-debug-types-section -fvar-tracking-assignments -g2 -fPIC -pthread  -MD -MQ 'pam_systemd@sha/src_login_pam_systemd.c.o' -MF 'pam_systemd@sha/src_login_pam_systemd.c.o.d' -o 'pam_systemd@sha/src_login_pam_systemd.c.o' -c ../src/login/pam_systemd.c
[619/1582] i686-pld-linux-gcc -Isystemd-portabled@exe -I. -I.. -Isrc/basic -I../src/basic -Isrc/shared -I../src/shared -Isrc/systemd -I../src/systemd -Isrc/journal -I../src/journal -Isrc/journal-remote -I../src/journal-remote -Isrc/nspawn -I../src/nspawn -Isrc/resolve -I../src/resolve -Isrc/timesync -I../src/timesync -I../src/time-wait-sync -Isrc/login -I../src/login -Isrc/udev -I../src/udev -Isrc/libudev -I../src/libudev -Isrc/core -I../src/core -I../src/libsystemd/sd-bus -I../src/libsystemd/sd-device -I../src/libsystemd/sd-hwdb -I../src/libsystemd/sd-id128 -I../src/libsystemd/sd-netlink -I../src/libsystemd/sd-network -Isrc/libsystemd-network -I../src/libsystemd-network -I../ -fdiagnostics-color=always -pipe -D_FILE_OFFSET_BITS=64 -std=gnu99 -Wextra -Werror=undef -Wlogical-op -Wmissing-include-dirs -Wold-style-definition -Wpointer-arith -Winit-self -Wfloat-equal -Wsuggest-attribute=noreturn -Werror=missing-prototypes -Werror=implicit-function-declaration -Werror=missing-declarations -Werror=return-type -Werror=incompatible-pointer-types -Werror=format=2 -Wstrict-prototypes -Wredundant-decls -Wmissing-noreturn -Wimplicit-fallthrough=5 -Wshadow -Wendif-labels -Wstrict-aliasing=2 -Wwrite-strings -Werror=overflow -Werror=shift-count-overflow -Werror=shift-overflow=2 -Wdate-time -Wnested-externs -ffast-math -fno-common -fdiagnostics-show-option -fno-strict-aliasing -fvisibility=hidden -fstack-protector -fstack-protector-strong --param=ssp-buffer-size=4 -fPIE -ffunction-sections -fdata-sections -Wno-unused-parameter -Wno-missing-field-initializers -Wno-unused-result -Wno-format-signedness -Wno-error=nonnull -Werror=shadow -include config.h -O2 -fwrapv -Wformat -Werror=format-security -gdwarf-4 -fno-debug-types-section -fvar-tracking-assignments -g2 -Wp,-D_FORTIFY_SOURCE=2 -fstack-protector-strong --param=ssp-buffer-size=4 -fomit-frame-pointer -march=i686 -fasynchronous-unwind-tables -mtune=pentium4 -gdwarf-4 -fno-debug-types-section -fvar-tracking-assignments -g2 -pthread  -MD -MQ 'systemd-portabled@exe/src_portable_portabled.c.o' -MF 'systemd-portabled@exe/src_portable_portabled.c.o.d' -o 'systemd-portabled@exe/src_portable_portabled.c.o' -c ../src/portable/portabled.c
[620/1582] i686-pld-linux-gcc  -o systemd-user-sessions 'systemd-user-sessions@exe/src_user-sessions_user-sessions.c.o' -Wl,--no-undefined -Wl,--as-needed -Wl,-z,relro -Wl,-z,now -pie -Wl,--gc-sections -O2 -fwrapv -pipe -Wformat -Werror=format-security -gdwarf-4 -fno-debug-types-section -fvar-tracking-assignments -g2 -Wp,-D_FORTIFY_SOURCE=2 -fstack-protector-strong --param=ssp-buffer-size=4 -fomit-frame-pointer -march=i686 -fasynchronous-unwind-tables -mtune=pentium4 -gdwarf-4 -fno-debug-types-section -fvar-tracking-assignments -g2 -Wl,--as-needed -Wl,--no-copy-dt-needed-entries -Wl,-z,relro -Wl,-z,combreloc -Wl,--start-group src/shared/libsystemd-shared-239.so -Wl,--end-group '-Wl,-rpath,$ORIGIN/src/shared' -Wl,-rpath-link,/tmp/B.JN6jpr/BUILD/systemd-239/build/src/shared  
[621/1582] i686-pld-linux-gcc -Isystemd-resolved@exe -I. -I.. -Isrc/basic -I../src/basic -Isrc/shared -I../src/shared -Isrc/systemd -I../src/systemd -Isrc/journal -I../src/journal -Isrc/journal-remote -I../src/journal-remote -Isrc/nspawn -I../src/nspawn -Isrc/resolve -I../src/resolve -Isrc/timesync -I../src/timesync -I../src/time-wait-sync -Isrc/login -I../src/login -Isrc/udev -I../src/udev -Isrc/libudev -I../src/libudev -Isrc/core -I../src/core -I../src/libsystemd/sd-bus -I../src/libsystemd/sd-device -I../src/libsystemd/sd-hwdb -I../src/libsystemd/sd-id128 -I../src/libsystemd/sd-netlink -I../src/libsystemd/sd-network -Isrc/libsystemd-network -I../src/libsystemd-network -I../ -I/usr/include/p11-kit-1 -fdiagnostics-color=always -pipe -D_FILE_OFFSET_BITS=64 -std=gnu99 -Wextra -Werror=undef -Wlogical-op -Wmissing-include-dirs -Wold-style-definition -Wpointer-arith -Winit-self -Wfloat-equal -Wsuggest-attribute=noreturn -Werror=missing-prototypes -Werror=implicit-function-declaration -Werror=missing-declarations -Werror=return-type -Werror=incompatible-pointer-types -Werror=format=2 -Wstrict-prototypes -Wredundant-decls -Wmissing-noreturn -Wimplicit-fallthrough=5 -Wshadow -Wendif-labels -Wstrict-aliasing=2 -Wwrite-strings -Werror=overflow -Werror=shift-count-overflow -Werror=shift-overflow=2 -Wdate-time -Wnested-externs -ffast-math -fno-common -fdiagnostics-show-option -fno-strict-aliasing -fvisibility=hidden -fstack-protector -fstack-protector-strong --param=ssp-buffer-size=4 -fPIE -ffunction-sections -fdata-sections -Wno-unused-parameter -Wno-missing-field-initializers -Wno-unused-result -Wno-format-signedness -Wno-error=nonnull -Werror=shadow -include config.h -O2 -fwrapv -Wformat -Werror=format-security -gdwarf-4 -fno-debug-types-section -fvar-tracking-assignments -g2 -Wp,-D_FORTIFY_SOURCE=2 -fstack-protector-strong --param=ssp-buffer-size=4 -fomit-frame-pointer -march=i686 -fasynchronous-unwind-tables -mtune=pentium4 -gdwarf-4 -fno-debug-types-section -fvar-tracking-assignments -g2 -pthread  -MD -MQ 'systemd-resolved@exe/src_resolve_resolved-dns-transaction.c.o' -MF 'systemd-resolved@exe/src_resolve_resolved-dns-transaction.c.o.d' -o 'systemd-resolved@exe/src_resolve_resolved-dns-transaction.c.o' -c ../src/resolve/resolved-dns-transaction.c
[622/1582] i686-pld-linux-gcc  -o systemd-user-runtime-dir 'systemd-user-runtime-dir@exe/src_login_user-runtime-dir.c.o' -Wl,--no-undefined -Wl,--as-needed -Wl,-z,relro -Wl,-z,now -pie -Wl,--gc-sections -O2 -fwrapv -pipe -Wformat -Werror=format-security -gdwarf-4 -fno-debug-types-section -fvar-tracking-assignments -g2 -Wp,-D_FORTIFY_SOURCE=2 -fstack-protector-strong --param=ssp-buffer-size=4 -fomit-frame-pointer -march=i686 -fasynchronous-unwind-tables -mtune=pentium4 -gdwarf-4 -fno-debug-types-section -fvar-tracking-assignments -g2 -Wl,--as-needed -Wl,--no-copy-dt-needed-entries -Wl,-z,relro -Wl,-z,combreloc -Wl,--start-group src/shared/libsystemd-shared-239.so src/login/liblogind-core.a -lacl -Wl,--end-group '-Wl,-rpath,$ORIGIN/src/shared:$ORIGIN/src/login' -Wl,-rpath-link,/tmp/B.JN6jpr/BUILD/systemd-239/build/src/shared:/tmp/B.JN6jpr/BUILD/systemd-239/build/src/login  
[623/1582] i686-pld-linux-gcc -Isystemd-portabled@exe -I. -I.. -Isrc/basic -I../src/basic -Isrc/shared -I../src/shared -Isrc/systemd -I../src/systemd -Isrc/journal -I../src/journal -Isrc/journal-remote -I../src/journal-remote -Isrc/nspawn -I../src/nspawn -Isrc/resolve -I../src/resolve -Isrc/timesync -I../src/timesync -I../src/time-wait-sync -Isrc/login -I../src/login -Isrc/udev -I../src/udev -Isrc/libudev -I../src/libudev -Isrc/core -I../src/core -I../src/libsystemd/sd-bus -I../src/libsystemd/sd-device -I../src/libsystemd/sd-hwdb -I../src/libsystemd/sd-id128 -I../src/libsystemd/sd-netlink -I../src/libsystemd/sd-network -Isrc/libsystemd-network -I../src/libsystemd-network -I../ -fdiagnostics-color=always -pipe -D_FILE_OFFSET_BITS=64 -std=gnu99 -Wextra -Werror=undef -Wlogical-op -Wmissing-include-dirs -Wold-style-definition -Wpointer-arith -Winit-self -Wfloat-equal -Wsuggest-attribute=noreturn -Werror=missing-prototypes -Werror=implicit-function-declaration -Werror=missing-declarations -Werror=return-type -Werror=incompatible-pointer-types -Werror=format=2 -Wstrict-prototypes -Wredundant-decls -Wmissing-noreturn -Wimplicit-fallthrough=5 -Wshadow -Wendif-labels -Wstrict-aliasing=2 -Wwrite-strings -Werror=overflow -Werror=shift-count-overflow -Werror=shift-overflow=2 -Wdate-time -Wnested-externs -ffast-math -fno-common -fdiagnostics-show-option -fno-strict-aliasing -fvisibility=hidden -fstack-protector -fstack-protector-strong --param=ssp-buffer-size=4 -fPIE -ffunction-sections -fdata-sections -Wno-unused-parameter -Wno-missing-field-initializers -Wno-unused-result -Wno-format-signedness -Wno-error=nonnull -Werror=shadow -include config.h -O2 -fwrapv -Wformat -Werror=format-security -gdwarf-4 -fno-debug-types-section -fvar-tracking-assignments -g2 -Wp,-D_FORTIFY_SOURCE=2 -fstack-protector-strong --param=ssp-buffer-size=4 -fomit-frame-pointer -march=i686 -fasynchronous-unwind-tables -mtune=pentium4 -gdwarf-4 -fno-debug-types-section -fvar-tracking-assignments -g2 -pthread  -MD -MQ 'systemd-portabled@exe/src_portable_portabled-bus.c.o' -MF 'systemd-portabled@exe/src_portable_portabled-bus.c.o.d' -o 'systemd-portabled@exe/src_portable_portabled-bus.c.o' -c ../src/portable/portabled-bus.c
[624/1582] i686-pld-linux-gcc -Iloginctl@exe -I. -I.. -Isrc/basic -I../src/basic -Isrc/shared -I../src/shared -Isrc/systemd -I../src/systemd -Isrc/journal -I../src/journal -Isrc/journal-remote -I../src/journal-remote -Isrc/nspawn -I../src/nspawn -Isrc/resolve -I../src/resolve -Isrc/timesync -I../src/timesync -I../src/time-wait-sync -Isrc/login -I../src/login -Isrc/udev -I../src/udev -Isrc/libudev -I../src/libudev -Isrc/core -I../src/core -I../src/libsystemd/sd-bus -I../src/libsystemd/sd-device -I../src/libsystemd/sd-hwdb -I../src/libsystemd/sd-id128 -I../src/libsystemd/sd-netlink -I../src/libsystemd/sd-network -Isrc/libsystemd-network -I../src/libsystemd-network -I../ -fdiagnostics-color=always -pipe -D_FILE_OFFSET_BITS=64 -std=gnu99 -Wextra -Werror=undef -Wlogical-op -Wmissing-include-dirs -Wold-style-definition -Wpointer-arith -Winit-self -Wfloat-equal -Wsuggest-attribute=noreturn -Werror=missing-prototypes -Werror=implicit-function-declaration -Werror=missing-declarations -Werror=return-type -Werror=incompatible-pointer-types -Werror=format=2 -Wstrict-prototypes -Wredundant-decls -Wmissing-noreturn -Wimplicit-fallthrough=5 -Wshadow -Wendif-labels -Wstrict-aliasing=2 -Wwrite-strings -Werror=overflow -Werror=shift-count-overflow -Werror=shift-overflow=2 -Wdate-time -Wnested-externs -ffast-math -fno-common -fdiagnostics-show-option -fno-strict-aliasing -fvisibility=hidden -fstack-protector -fstack-protector-strong --param=ssp-buffer-size=4 -fPIE -ffunction-sections -fdata-sections -Wno-unused-parameter -Wno-missing-field-initializers -Wno-unused-result -Wno-format-signedness -Wno-error=nonnull -Werror=shadow -include config.h -O2 -fwrapv -Wformat -Werror=format-security -gdwarf-4 -fno-debug-types-section -fvar-tracking-assignments -g2 -Wp,-D_FORTIFY_SOURCE=2 -fstack-protector-strong --param=ssp-buffer-size=4 -fomit-frame-pointer -march=i686 -fasynchronous-unwind-tables -mtune=pentium4 -gdwarf-4 -fno-debug-types-section -fvar-tracking-assignments -g2 -pthread  -MD -MQ 'loginctl@exe/src_login_loginctl.c.o' -MF 'loginctl@exe/src_login_loginctl.c.o.d' -o 'loginctl@exe/src_login_loginctl.c.o' -c ../src/login/loginctl.c
[625/1582] i686-pld-linux-gcc -Isystemd-socket-activate@exe -I. -I.. -Isrc/basic -I../src/basic -Isrc/shared -I../src/shared -Isrc/systemd -I../src/systemd -Isrc/journal -I../src/journal -Isrc/journal-remote -I../src/journal-remote -Isrc/nspawn -I../src/nspawn -Isrc/resolve -I../src/resolve -Isrc/timesync -I../src/timesync -I../src/time-wait-sync -Isrc/login -I../src/login -Isrc/udev -I../src/udev -Isrc/libudev -I../src/libudev -Isrc/core -I../src/core -I../src/libsystemd/sd-bus -I../src/libsystemd/sd-device -I../src/libsystemd/sd-hwdb -I../src/libsystemd/sd-id128 -I../src/libsystemd/sd-netlink -I../src/libsystemd/sd-network -Isrc/libsystemd-network -I../src/libsystemd-network -I../ -fdiagnostics-color=always -pipe -D_FILE_OFFSET_BITS=64 -std=gnu99 -Wextra -Werror=undef -Wlogical-op -Wmissing-include-dirs -Wold-style-definition -Wpointer-arith -Winit-self -Wfloat-equal -Wsuggest-attribute=noreturn -Werror=missing-prototypes -Werror=implicit-function-declaration -Werror=missing-declarations -Werror=return-type -Werror=incompatible-pointer-types -Werror=format=2 -Wstrict-prototypes -Wredundant-decls -Wmissing-noreturn -Wimplicit-fallthrough=5 -Wshadow -Wendif-labels -Wstrict-aliasing=2 -Wwrite-strings -Werror=overflow -Werror=shift-count-overflow -Werror=shift-overflow=2 -Wdate-time -Wnested-externs -ffast-math -fno-common -fdiagnostics-show-option -fno-strict-aliasing -fvisibility=hidden -fstack-protector -fstack-protector-strong --param=ssp-buffer-size=4 -fPIE -ffunction-sections -fdata-sections -Wno-unused-parameter -Wno-missing-field-initializers -Wno-unused-result -Wno-format-signedness -Wno-error=nonnull -Werror=shadow -include config.h -O2 -fwrapv -Wformat -Werror=format-security -gdwarf-4 -fno-debug-types-section -fvar-tracking-assignments -g2 -Wp,-D_FORTIFY_SOURCE=2 -fstack-protector-strong --param=ssp-buffer-size=4 -fomit-frame-pointer -march=i686 -fasynchronous-unwind-tables -mtune=pentium4 -gdwarf-4 -fno-debug-types-section -fvar-tracking-assignments -g2 -pthread  -MD -MQ 'systemd-socket-activate@exe/src_activate_activate.c.o' -MF 'systemd-socket-activate@exe/src_activate_activate.c.o.d' -o 'systemd-socket-activate@exe/src_activate_activate.c.o' -c ../src/activate/activate.c
[626/1582] i686-pld-linux-gcc  -o pam_systemd.so 'pam_systemd@sha/src_login_pam_systemd.c.o' -Wl,--no-undefined -Wl,--as-needed -shared -fPIC -Wl,--start-group -Wl,-soname,pam_systemd.so -Wl,-z,relro -Wl,-z,now -pie -Wl,--gc-sections -O2 -fwrapv -pipe -Wformat -Werror=format-security -gdwarf-4 -fno-debug-types-section -fvar-tracking-assignments -g2 -Wp,-D_FORTIFY_SOURCE=2 -fstack-protector-strong --param=ssp-buffer-size=4 -fomit-frame-pointer -march=i686 -fasynchronous-unwind-tables -mtune=pentium4 -gdwarf-4 -fno-debug-types-section -fvar-tracking-assignments -g2 -Wl,--as-needed -Wl,--no-copy-dt-needed-entries -Wl,-z,relro -Wl,-z,combreloc src/libsystemd/libsystemd_static.a src/basic/libbasic.a src/shared/libsystemd-shared-239.a -shared -Wl,--version-script=/tmp/B.JN6jpr/BUILD/systemd-239/src/login/pam_systemd.sym -lpam -lpam_misc -lrt /usr/lib/libcap.so /usr/lib/libblkid.so /usr/lib/libmount.so /usr/lib/libselinux.so -lrt -lacl /usr/lib/libcryptsetup.so -lgcrypt /usr/lib/libip4tc.so /usr/lib/libip6tc.so /usr/lib/libseccomp.so /usr/lib/libidn2.so /usr/lib/liblzma.so /usr/lib/liblz4.so -Wl,--end-group -pthread '-Wl,-rpath,$ORIGIN/src/libsystemd:$ORIGIN/src/basic:$ORIGIN/src/shared' -Wl,-rpath-link,/tmp/B.JN6jpr/BUILD/systemd-239/build/src/libsystemd:/tmp/B.JN6jpr/BUILD/systemd-239/build/src/basic:/tmp/B.JN6jpr/BUILD/systemd-239/build/src/shared  
[627/1582] i686-pld-linux-gcc  -o systemd-socket-activate 'systemd-socket-activate@exe/src_activate_activate.c.o' -Wl,--no-undefined -Wl,--as-needed -Wl,-z,relro -Wl,-z,now -pie -Wl,--gc-sections -O2 -fwrapv -pipe -Wformat -Werror=format-security -gdwarf-4 -fno-debug-types-section -fvar-tracking-assignments -g2 -Wp,-D_FORTIFY_SOURCE=2 -fstack-protector-strong --param=ssp-buffer-size=4 -fomit-frame-pointer -march=i686 -fasynchronous-unwind-tables -mtune=pentium4 -gdwarf-4 -fno-debug-types-section -fvar-tracking-assignments -g2 -Wl,--as-needed -Wl,--no-copy-dt-needed-entries -Wl,-z,relro -Wl,-z,combreloc -Wl,--start-group src/shared/libsystemd-shared-239.so -Wl,--end-group -pthread '-Wl,-rpath,$ORIGIN/src/shared' -Wl,-rpath-link,/tmp/B.JN6jpr/BUILD/systemd-239/build/src/shared  
[628/1582] i686-pld-linux-gcc -Isystemd-portabled@exe -I. -I.. -Isrc/basic -I../src/basic -Isrc/shared -I../src/shared -Isrc/systemd -I../src/systemd -Isrc/journal -I../src/journal -Isrc/journal-remote -I../src/journal-remote -Isrc/nspawn -I../src/nspawn -Isrc/resolve -I../src/resolve -Isrc/timesync -I../src/timesync -I../src/time-wait-sync -Isrc/login -I../src/login -Isrc/udev -I../src/udev -Isrc/libudev -I../src/libudev -Isrc/core -I../src/core -I../src/libsystemd/sd-bus -I../src/libsystemd/sd-device -I../src/libsystemd/sd-hwdb -I../src/libsystemd/sd-id128 -I../src/libsystemd/sd-netlink -I../src/libsystemd/sd-network -Isrc/libsystemd-network -I../src/libsystemd-network -I../ -fdiagnostics-color=always -pipe -D_FILE_OFFSET_BITS=64 -std=gnu99 -Wextra -Werror=undef -Wlogical-op -Wmissing-include-dirs -Wold-style-definition -Wpointer-arith -Winit-self -Wfloat-equal -Wsuggest-attribute=noreturn -Werror=missing-prototypes -Werror=implicit-function-declaration -Werror=missing-declarations -Werror=return-type -Werror=incompatible-pointer-types -Werror=format=2 -Wstrict-prototypes -Wredundant-decls -Wmissing-noreturn -Wimplicit-fallthrough=5 -Wshadow -Wendif-labels -Wstrict-aliasing=2 -Wwrite-strings -Werror=overflow -Werror=shift-count-overflow -Werror=shift-overflow=2 -Wdate-time -Wnested-externs -ffast-math -fno-common -fdiagnostics-show-option -fno-strict-aliasing -fvisibility=hidden -fstack-protector -fstack-protector-strong --param=ssp-buffer-size=4 -fPIE -ffunction-sections -fdata-sections -Wno-unused-parameter -Wno-missing-field-initializers -Wno-unused-result -Wno-format-signedness -Wno-error=nonnull -Werror=shadow -include config.h -O2 -fwrapv -Wformat -Werror=format-security -gdwarf-4 -fno-debug-types-section -fvar-tracking-assignments -g2 -Wp,-D_FORTIFY_SOURCE=2 -fstack-protector-strong --param=ssp-buffer-size=4 -fomit-frame-pointer -march=i686 -fasynchronous-unwind-tables -mtune=pentium4 -gdwarf-4 -fno-debug-types-section -fvar-tracking-assignments -g2 -pthread  -MD -MQ 'systemd-portabled@exe/src_portable_portabled-image.c.o' -MF 'systemd-portabled@exe/src_portable_portabled-image.c.o.d' -o 'systemd-portabled@exe/src_portable_portabled-image.c.o' -c ../src/portable/portabled-image.c
[629/1582] i686-pld-linux-gcc  -o loginctl 'loginctl@exe/src_login_loginctl.c.o' 'loginctl@exe/src_login_sysfs-show.c.o' -Wl,--no-undefined -Wl,--as-needed -Wl,-z,relro -Wl,-z,now -pie -Wl,--gc-sections -O2 -fwrapv -pipe -Wformat -Werror=format-security -gdwarf-4 -fno-debug-types-section -fvar-tracking-assignments -g2 -Wp,-D_FORTIFY_SOURCE=2 -fstack-protector-strong --param=ssp-buffer-size=4 -fomit-frame-pointer -march=i686 -fasynchronous-unwind-tables -mtune=pentium4 -gdwarf-4 -fno-debug-types-section -fvar-tracking-assignments -g2 -Wl,--as-needed -Wl,--no-copy-dt-needed-entries -Wl,-z,relro -Wl,-z,combreloc -Wl,--start-group src/shared/libsystemd-shared-239.so /usr/lib/liblz4.so /usr/lib/liblzma.so -Wl,--end-group -pthread '-Wl,-rpath,$ORIGIN/src/shared' -Wl,-rpath-link,/tmp/B.JN6jpr/BUILD/systemd-239/build/src/shared  
[630/1582] i686-pld-linux-gcc  -o systemd-resolved 'systemd-resolved@exe/meson-generated_.._src_resolve_resolved-gperf.c.o' 'systemd-resolved@exe/meson-generated_.._src_resolve_resolved-dnssd-gperf.c.o' 'systemd-resolved@exe/src_resolve_resolved.c.o' 'systemd-resolved@exe/src_resolve_resolved-manager.c.o' 'systemd-resolved@exe/src_resolve_resolved-dnssd.c.o' 'systemd-resolved@exe/src_resolve_resolved-dnssd-bus.c.o' 'systemd-resolved@exe/src_resolve_resolved-conf.c.o' 'systemd-resolved@exe/src_resolve_resolved-resolv-conf.c.o' 'systemd-resolved@exe/src_resolve_resolved-bus.c.o' 'systemd-resolved@exe/src_resolve_resolved-link.c.o' 'systemd-resolved@exe/src_resolve_resolved-link-bus.c.o' 'systemd-resolved@exe/src_resolve_resolved-llmnr.c.o' 'systemd-resolved@exe/src_resolve_resolved-mdns.c.o' 'systemd-resolved@exe/src_resolve_resolved-dns-query.c.o' 'systemd-resolved@exe/src_resolve_resolved-dns-synthesize.c.o' 'systemd-resolved@exe/src_resolve_resolved-dns-transaction.c.o' 'systemd-resolved@exe/src_resolve_resolved-dns-scope.c.o' 'systemd-resolved@exe/src_resolve_resolved-dns-server.c.o' 'systemd-resolved@exe/src_resolve_resolved-dns-search-domain.c.o' 'systemd-resolved@exe/src_resolve_resolved-dns-cache.c.o' 'systemd-resolved@exe/src_resolve_resolved-dns-zone.c.o' 'systemd-resolved@exe/src_resolve_resolved-dns-stream.c.o' 'systemd-resolved@exe/src_resolve_resolved-dns-trust-anchor.c.o' 'systemd-resolved@exe/src_resolve_resolved-dns-stub.c.o' 'systemd-resolved@exe/src_resolve_resolved-etc-hosts.c.o' -Wl,--no-undefined -Wl,--as-needed -Wl,-z,relro -Wl,-z,now -pie -Wl,--gc-sections -O2 -fwrapv -pipe -Wformat -Werror=format-security -gdwarf-4 -fno-debug-types-section -fvar-tracking-assignments -g2 -Wp,-D_FORTIFY_SOURCE=2 -fstack-protector-strong --param=ssp-buffer-size=4 -fomit-frame-pointer -march=i686 -fasynchronous-unwind-tables -mtune=pentium4 -gdwarf-4 -fno-debug-types-section -fvar-tracking-assignments -g2 -Wl,--as-needed -Wl,--no-copy-dt-needed-entries -Wl,-z,relro -Wl,-z,combreloc -Wl,--start-group src/shared/libsystemd-shared-239.so src/basic/libbasic-gcrypt.a src/resolve/libsystemd-resolve-core.a -lgpg-error -lm /usr/lib/libidn2.so /usr/lib/libgnutls.so -lgcrypt -Wl,--end-group -pthread '-Wl,-rpath,$ORIGIN/src/shared:$ORIGIN/src/basic:$ORIGIN/src/resolve' -Wl,-rpath-link,/tmp/B.JN6jpr/BUILD/systemd-239/build/src/shared:/tmp/B.JN6jpr/BUILD/systemd-239/build/src/basic:/tmp/B.JN6jpr/BUILD/systemd-239/build/src/resolve  
FAILED: systemd-resolved 
i686-pld-linux-gcc  -o systemd-resolved 'systemd-resolved@exe/meson-generated_.._src_resolve_resolved-gperf.c.o' 'systemd-resolved@exe/meson-generated_.._src_resolve_resolved-dnssd-gperf.c.o' 'systemd-resolved@exe/src_resolve_resolved.c.o' 'systemd-resolved@exe/src_resolve_resolved-manager.c.o' 'systemd-resolved@exe/src_resolve_resolved-dnssd.c.o' 'systemd-resolved@exe/src_resolve_resolved-dnssd-bus.c.o' 'systemd-resolved@exe/src_resolve_resolved-conf.c.o' 'systemd-resolved@exe/src_resolve_resolved-resolv-conf.c.o' 'systemd-resolved@exe/src_resolve_resolved-bus.c.o' 'systemd-resolved@exe/src_resolve_resolved-link.c.o' 'systemd-resolved@exe/src_resolve_resolved-link-bus.c.o' 'systemd-resolved@exe/src_resolve_resolved-llmnr.c.o' 'systemd-resolved@exe/src_resolve_resolved-mdns.c.o' 'systemd-resolved@exe/src_resolve_resolved-dns-query.c.o' 'systemd-resolved@exe/src_resolve_resolved-dns-synthesize.c.o' 'systemd-resolved@exe/src_resolve_resolved-dns-transaction.c.o' 'systemd-resolved@exe/src_resolve_resolved-dns-scope.c.o' 'systemd-resolved@exe/src_resolve_resolved-dns-server.c.o' 'systemd-resolved@exe/src_resolve_resolved-dns-search-domain.c.o' 'systemd-resolved@exe/src_resolve_resolved-dns-cache.c.o' 'systemd-resolved@exe/src_resolve_resolved-dns-zone.c.o' 'systemd-resolved@exe/src_resolve_resolved-dns-stream.c.o' 'systemd-resolved@exe/src_resolve_resolved-dns-trust-anchor.c.o' 'systemd-resolved@exe/src_resolve_resolved-dns-stub.c.o' 'systemd-resolved@exe/src_resolve_resolved-etc-hosts.c.o' -Wl,--no-undefined -Wl,--as-needed -Wl,-z,relro -Wl,-z,now -pie -Wl,--gc-sections -O2 -fwrapv -pipe -Wformat -Werror=format-security -gdwarf-4 -fno-debug-types-section -fvar-tracking-assignments -g2 -Wp,-D_FORTIFY_SOURCE=2 -fstack-protector-strong --param=ssp-buffer-size=4 -fomit-frame-pointer -march=i686 -fasynchronous-unwind-tables -mtune=pentium4 -gdwarf-4 -fno-debug-types-section -fvar-tracking-assignments -g2 -Wl,--as-needed -Wl,--no-copy-dt-needed-entries -Wl,-z,relro -Wl,-z,combreloc -Wl,--start-group src/shared/libsystemd-shared-239.so src/basic/libbasic-gcrypt.a src/resolve/libsystemd-resolve-core.a -lgpg-error -lm /usr/lib/libidn2.so /usr/lib/libgnutls.so -lgcrypt -Wl,--end-group -pthread '-Wl,-rpath,$ORIGIN/src/shared:$ORIGIN/src/basic:$ORIGIN/src/resolve' -Wl,-rpath-link,/tmp/B.JN6jpr/BUILD/systemd-239/build/src/shared:/tmp/B.JN6jpr/BUILD/systemd-239/build/src/basic:/tmp/B.JN6jpr/BUILD/systemd-239/build/src/resolve  
/usr/bin/ld: /usr/lib/libgnutls.so: undefined reference to `_idn2_punycode_decode@IDN2_0.0.0'
collect2: error: ld returned 1 exit status
[631/1582] i686-pld-linux-gcc -Isystemd-portabled@exe -I. -I.. -Isrc/basic -I../src/basic -Isrc/shared -I../src/shared -Isrc/systemd -I../src/systemd -Isrc/journal -I../src/journal -Isrc/journal-remote -I../src/journal-remote -Isrc/nspawn -I../src/nspawn -Isrc/resolve -I../src/resolve -Isrc/timesync -I../src/timesync -I../src/time-wait-sync -Isrc/login -I../src/login -Isrc/udev -I../src/udev -Isrc/libudev -I../src/libudev -Isrc/core -I../src/core -I../src/libsystemd/sd-bus -I../src/libsystemd/sd-device -I../src/libsystemd/sd-hwdb -I../src/libsystemd/sd-id128 -I../src/libsystemd/sd-netlink -I../src/libsystemd/sd-network -Isrc/libsystemd-network -I../src/libsystemd-network -I../ -fdiagnostics-color=always -pipe -D_FILE_OFFSET_BITS=64 -std=gnu99 -Wextra -Werror=undef -Wlogical-op -Wmissing-include-dirs -Wold-style-definition -Wpointer-arith -Winit-self -Wfloat-equal -Wsuggest-attribute=noreturn -Werror=missing-prototypes -Werror=implicit-function-declaration -Werror=missing-declarations -Werror=return-type -Werror=incompatible-pointer-types -Werror=format=2 -Wstrict-prototypes -Wredundant-decls -Wmissing-noreturn -Wimplicit-fallthrough=5 -Wshadow -Wendif-labels -Wstrict-aliasing=2 -Wwrite-strings -Werror=overflow -Werror=shift-count-overflow -Werror=shift-overflow=2 -Wdate-time -Wnested-externs -ffast-math -fno-common -fdiagnostics-show-option -fno-strict-aliasing -fvisibility=hidden -fstack-protector -fstack-protector-strong --param=ssp-buffer-size=4 -fPIE -ffunction-sections -fdata-sections -Wno-unused-parameter -Wno-missing-field-initializers -Wno-unused-result -Wno-format-signedness -Wno-error=nonnull -Werror=shadow -include config.h -O2 -fwrapv -Wformat -Werror=format-security -gdwarf-4 -fno-debug-types-section -fvar-tracking-assignments -g2 -Wp,-D_FORTIFY_SOURCE=2 -fstack-protector-strong --param=ssp-buffer-size=4 -fomit-frame-pointer -march=i686 -fasynchronous-unwind-tables -mtune=pentium4 -gdwarf-4 -fno-debug-types-section -fvar-tracking-assignments -g2 -pthread  -MD -MQ 'systemd-portabled@exe/src_portable_portabled-image-bus.c.o' -MF 'systemd-portabled@exe/src_portable_portabled-image-bus.c.o.d' -o 'systemd-portabled@exe/src_portable_portabled-image-bus.c.o' -c ../src/portable/portabled-image-bus.c
[632/1582] i686-pld-linux-gcc -Isystemd-veritysetup@exe -I. -I.. -Isrc/basic -I../src/basic -Isrc/shared -I../src/shared -Isrc/systemd -I../src/systemd -Isrc/journal -I../src/journal -Isrc/journal-remote -I../src/journal-remote -Isrc/nspawn -I../src/nspawn -Isrc/resolve -I../src/resolve -Isrc/timesync -I../src/timesync -I../src/time-wait-sync -Isrc/login -I../src/login -Isrc/udev -I../src/udev -Isrc/libudev -I../src/libudev -Isrc/core -I../src/core -I../src/libsystemd/sd-bus -I../src/libsystemd/sd-device -I../src/libsystemd/sd-hwdb -I../src/libsystemd/sd-id128 -I../src/libsystemd/sd-netlink -I../src/libsystemd/sd-network -Isrc/libsystemd-network -I../src/libsystemd-network -I../ -fdiagnostics-color=always -pipe -D_FILE_OFFSET_BITS=64 -std=gnu99 -Wextra -Werror=undef -Wlogical-op -Wmissing-include-dirs -Wold-style-definition -Wpointer-arith -Winit-self -Wfloat-equal -Wsuggest-attribute=noreturn -Werror=missing-prototypes -Werror=implicit-function-declaration -Werror=missing-declarations -Werror=return-type -Werror=incompatible-pointer-types -Werror=format=2 -Wstrict-prototypes -Wredundant-decls -Wmissing-noreturn -Wimplicit-fallthrough=5 -Wshadow -Wendif-labels -Wstrict-aliasing=2 -Wwrite-strings -Werror=overflow -Werror=shift-count-overflow -Werror=shift-overflow=2 -Wdate-time -Wnested-externs -ffast-math -fno-common -fdiagnostics-show-option -fno-strict-aliasing -fvisibility=hidden -fstack-protector -fstack-protector-strong --param=ssp-buffer-size=4 -fPIE -ffunction-sections -fdata-sections -Wno-unused-parameter -Wno-missing-field-initializers -Wno-unused-result -Wno-format-signedness -Wno-error=nonnull -Werror=shadow -include config.h -O2 -fwrapv -Wformat -Werror=format-security -gdwarf-4 -fno-debug-types-section -fvar-tracking-assignments -g2 -Wp,-D_FORTIFY_SOURCE=2 -fstack-protector-strong --param=ssp-buffer-size=4 -fomit-frame-pointer -march=i686 -fasynchronous-unwind-tables -mtune=pentium4 -gdwarf-4 -fno-debug-types-section -fvar-tracking-assignments -g2  -MD -MQ 'systemd-veritysetup@exe/src_veritysetup_veritysetup.c.o' -MF 'systemd-veritysetup@exe/src_veritysetup_veritysetup.c.o.d' -o 'systemd-veritysetup@exe/src_veritysetup_veritysetup.c.o' -c ../src/veritysetup/veritysetup.c
[633/1582] i686-pld-linux-gcc -Ibootctl@exe -I. -I.. -Isrc/basic -I../src/basic -Isrc/shared -I../src/shared -Isrc/systemd -I../src/systemd -Isrc/journal -I../src/journal -Isrc/journal-remote -I../src/journal-remote -Isrc/nspawn -I../src/nspawn -Isrc/resolve -I../src/resolve -Isrc/timesync -I../src/timesync -I../src/time-wait-sync -Isrc/login -I../src/login -Isrc/udev -I../src/udev -Isrc/libudev -I../src/libudev -Isrc/core -I../src/core -I../src/libsystemd/sd-bus -I../src/libsystemd/sd-device -I../src/libsystemd/sd-hwdb -I../src/libsystemd/sd-id128 -I../src/libsystemd/sd-netlink -I../src/libsystemd/sd-network -Isrc/libsystemd-network -I../src/libsystemd-network -I../ -I/usr/include/blkid -I/usr/include/uuid -fdiagnostics-color=always -pipe -D_FILE_OFFSET_BITS=64 -std=gnu99 -Wextra -Werror=undef -Wlogical-op -Wmissing-include-dirs -Wold-style-definition -Wpointer-arith -Winit-self -Wfloat-equal -Wsuggest-attribute=noreturn -Werror=missing-prototypes -Werror=implicit-function-declaration -Werror=missing-declarations -Werror=return-type -Werror=incompatible-pointer-types -Werror=format=2 -Wstrict-prototypes -Wredundant-decls -Wmissing-noreturn -Wimplicit-fallthrough=5 -Wshadow -Wendif-labels -Wstrict-aliasing=2 -Wwrite-strings -Werror=overflow -Werror=shift-count-overflow -Werror=shift-overflow=2 -Wdate-time -Wnested-externs -ffast-math -fno-common -fdiagnostics-show-option -fno-strict-aliasing -fvisibility=hidden -fstack-protector -fstack-protector-strong --param=ssp-buffer-size=4 -fPIE -ffunction-sections -fdata-sections -Wno-unused-parameter -Wno-missing-field-initializers -Wno-unused-result -Wno-format-signedness -Wno-error=nonnull -Werror=shadow -include config.h -O2 -fwrapv -Wformat -Werror=format-security -gdwarf-4 -fno-debug-types-section -fvar-tracking-assignments -g2 -Wp,-D_FORTIFY_SOURCE=2 -fstack-protector-strong --param=ssp-buffer-size=4 -fomit-frame-pointer -march=i686 -fasynchronous-unwind-tables -mtune=pentium4 -gdwarf-4 -fno-debug-types-section -fvar-tracking-assignments -g2  -MD -MQ 'bootctl@exe/src_boot_bootctl.c.o' -MF 'bootctl@exe/src_boot_bootctl.c.o.d' -o 'bootctl@exe/src_boot_bootctl.c.o' -c ../src/boot/bootctl.c
[634/1582] i686-pld-linux-gcc -Isystemd-backlight@exe -I. -I.. -Isrc/basic -I../src/basic -Isrc/shared -I../src/shared -Isrc/systemd -I../src/systemd -Isrc/journal -I../src/journal -Isrc/journal-remote -I../src/journal-remote -Isrc/nspawn -I../src/nspawn -Isrc/resolve -I../src/resolve -Isrc/timesync -I../src/timesync -I../src/time-wait-sync -Isrc/login -I../src/login -Isrc/udev -I../src/udev -Isrc/libudev -I../src/libudev -Isrc/core -I../src/core -I../src/libsystemd/sd-bus -I../src/libsystemd/sd-device -I../src/libsystemd/sd-hwdb -I../src/libsystemd/sd-id128 -I../src/libsystemd/sd-netlink -I../src/libsystemd/sd-network -Isrc/libsystemd-network -I../src/libsystemd-network -I../ -fdiagnostics-color=always -pipe -D_FILE_OFFSET_BITS=64 -std=gnu99 -Wextra -Werror=undef -Wlogical-op -Wmissing-include-dirs -Wold-style-definition -Wpointer-arith -Winit-self -Wfloat-equal -Wsuggest-attribute=noreturn -Werror=missing-prototypes -Werror=implicit-function-declaration -Werror=missing-declarations -Werror=return-type -Werror=incompatible-pointer-types -Werror=format=2 -Wstrict-prototypes -Wredundant-decls -Wmissing-noreturn -Wimplicit-fallthrough=5 -Wshadow -Wendif-labels -Wstrict-aliasing=2 -Wwrite-strings -Werror=overflow -Werror=shift-count-overflow -Werror=shift-overflow=2 -Wdate-time -Wnested-externs -ffast-math -fno-common -fdiagnostics-show-option -fno-strict-aliasing -fvisibility=hidden -fstack-protector -fstack-protector-strong --param=ssp-buffer-size=4 -fPIE -ffunction-sections -fdata-sections -Wno-unused-parameter -Wno-missing-field-initializers -Wno-unused-result -Wno-format-signedness -Wno-error=nonnull -Werror=shadow -include config.h -O2 -fwrapv -Wformat -Werror=format-security -gdwarf-4 -fno-debug-types-section -fvar-tracking-assignments -g2 -Wp,-D_FORTIFY_SOURCE=2 -fstack-protector-strong --param=ssp-buffer-size=4 -fomit-frame-pointer -march=i686 -fasynchronous-unwind-tables -mtune=pentium4 -gdwarf-4 -fno-debug-types-section -fvar-tracking-assignments -g2  -MD -MQ 'systemd-backlight@exe/src_backlight_backlight.c.o' -MF 'systemd-backlight@exe/src_backlight_backlight.c.o.d' -o 'systemd-backlight@exe/src_backlight_backlight.c.o' -c ../src/backlight/backlight.c
[635/1582] i686-pld-linux-gcc -Isystemd-rfkill@exe -I. -I.. -Isrc/basic -I../src/basic -Isrc/shared -I../src/shared -Isrc/systemd -I../src/systemd -Isrc/journal -I../src/journal -Isrc/journal-remote -I../src/journal-remote -Isrc/nspawn -I../src/nspawn -Isrc/resolve -I../src/resolve -Isrc/timesync -I../src/timesync -I../src/time-wait-sync -Isrc/login -I../src/login -Isrc/udev -I../src/udev -Isrc/libudev -I../src/libudev -Isrc/core -I../src/core -I../src/libsystemd/sd-bus -I../src/libsystemd/sd-device -I../src/libsystemd/sd-hwdb -I../src/libsystemd/sd-id128 -I../src/libsystemd/sd-netlink -I../src/libsystemd/sd-network -Isrc/libsystemd-network -I../src/libsystemd-network -I../ -fdiagnostics-color=always -pipe -D_FILE_OFFSET_BITS=64 -std=gnu99 -Wextra -Werror=undef -Wlogical-op -Wmissing-include-dirs -Wold-style-definition -Wpointer-arith -Winit-self -Wfloat-equal -Wsuggest-attribute=noreturn -Werror=missing-prototypes -Werror=implicit-function-declaration -Werror=missing-declarations -Werror=return-type -Werror=incompatible-pointer-types -Werror=format=2 -Wstrict-prototypes -Wredundant-decls -Wmissing-noreturn -Wimplicit-fallthrough=5 -Wshadow -Wendif-labels -Wstrict-aliasing=2 -Wwrite-strings -Werror=overflow -Werror=shift-count-overflow -Werror=shift-overflow=2 -Wdate-time -Wnested-externs -ffast-math -fno-common -fdiagnostics-show-option -fno-strict-aliasing -fvisibility=hidden -fstack-protector -fstack-protector-strong --param=ssp-buffer-size=4 -fPIE -ffunction-sections -fdata-sections -Wno-unused-parameter -Wno-missing-field-initializers -Wno-unused-result -Wno-format-signedness -Wno-error=nonnull -Werror=shadow -include config.h -O2 -fwrapv -Wformat -Werror=format-security -gdwarf-4 -fno-debug-types-section -fvar-tracking-assignments -g2 -Wp,-D_FORTIFY_SOURCE=2 -fstack-protector-strong --param=ssp-buffer-size=4 -fomit-frame-pointer -march=i686 -fasynchronous-unwind-tables -mtune=pentium4 -gdwarf-4 -fno-debug-types-section -fvar-tracking-assignments -g2  -MD -MQ 'systemd-rfkill@exe/src_rfkill_rfkill.c.o' -MF 'systemd-rfkill@exe/src_rfkill_rfkill.c.o.d' -o 'systemd-rfkill@exe/src_rfkill_rfkill.c.o' -c ../src/rfkill/rfkill.c
[636/1582] i686-pld-linux-gcc -Iportablectl@exe -I. -I.. -Isrc/basic -I../src/basic -Isrc/shared -I../src/shared -Isrc/systemd -I../src/systemd -Isrc/journal -I../src/journal -Isrc/journal-remote -I../src/journal-remote -Isrc/nspawn -I../src/nspawn -Isrc/resolve -I../src/resolve -Isrc/timesync -I../src/timesync -I../src/time-wait-sync -Isrc/login -I../src/login -Isrc/udev -I../src/udev -Isrc/libudev -I../src/libudev -Isrc/core -I../src/core -I../src/libsystemd/sd-bus -I../src/libsystemd/sd-device -I../src/libsystemd/sd-hwdb -I../src/libsystemd/sd-id128 -I../src/libsystemd/sd-netlink -I../src/libsystemd/sd-network -Isrc/libsystemd-network -I../src/libsystemd-network -I../ -fdiagnostics-color=always -pipe -D_FILE_OFFSET_BITS=64 -std=gnu99 -Wextra -Werror=undef -Wlogical-op -Wmissing-include-dirs -Wold-style-definition -Wpointer-arith -Winit-self -Wfloat-equal -Wsuggest-attribute=noreturn -Werror=missing-prototypes -Werror=implicit-function-declaration -Werror=missing-declarations -Werror=return-type -Werror=incompatible-pointer-types -Werror=format=2 -Wstrict-prototypes -Wredundant-decls -Wmissing-noreturn -Wimplicit-fallthrough=5 -Wshadow -Wendif-labels -Wstrict-aliasing=2 -Wwrite-strings -Werror=overflow -Werror=shift-count-overflow -Werror=shift-overflow=2 -Wdate-time -Wnested-externs -ffast-math -fno-common -fdiagnostics-show-option -fno-strict-aliasing -fvisibility=hidden -fstack-protector -fstack-protector-strong --param=ssp-buffer-size=4 -fPIE -ffunction-sections -fdata-sections -Wno-unused-parameter -Wno-missing-field-initializers -Wno-unused-result -Wno-format-signedness -Wno-error=nonnull -Werror=shadow -include config.h -O2 -fwrapv -Wformat -Werror=format-security -gdwarf-4 -fno-debug-types-section -fvar-tracking-assignments -g2 -Wp,-D_FORTIFY_SOURCE=2 -fstack-protector-strong --param=ssp-buffer-size=4 -fomit-frame-pointer -march=i686 -fasynchronous-unwind-tables -mtune=pentium4 -gdwarf-4 -fno-debug-types-section -fvar-tracking-assignments -g2 -pthread  -MD -MQ 'portablectl@exe/src_portable_portablectl.c.o' -MF 'portablectl@exe/src_portable_portablectl.c.o.d' -o 'portablectl@exe/src_portable_portablectl.c.o' -c ../src/portable/portablectl.c
[637/1582] i686-pld-linux-gcc -Isystemd-portabled@exe -I. -I.. -Isrc/basic -I../src/basic -Isrc/shared -I../src/shared -Isrc/systemd -I../src/systemd -Isrc/journal -I../src/journal -Isrc/journal-remote -I../src/journal-remote -Isrc/nspawn -I../src/nspawn -Isrc/resolve -I../src/resolve -Isrc/timesync -I../src/timesync -I../src/time-wait-sync -Isrc/login -I../src/login -Isrc/udev -I../src/udev -Isrc/libudev -I../src/libudev -Isrc/core -I../src/core -I../src/libsystemd/sd-bus -I../src/libsystemd/sd-device -I../src/libsystemd/sd-hwdb -I../src/libsystemd/sd-id128 -I../src/libsystemd/sd-netlink -I../src/libsystemd/sd-network -Isrc/libsystemd-network -I../src/libsystemd-network -I../ -fdiagnostics-color=always -pipe -D_FILE_OFFSET_BITS=64 -std=gnu99 -Wextra -Werror=undef -Wlogical-op -Wmissing-include-dirs -Wold-style-definition -Wpointer-arith -Winit-self -Wfloat-equal -Wsuggest-attribute=noreturn -Werror=missing-prototypes -Werror=implicit-function-declaration -Werror=missing-declarations -Werror=return-type -Werror=incompatible-pointer-types -Werror=format=2 -Wstrict-prototypes -Wredundant-decls -Wmissing-noreturn -Wimplicit-fallthrough=5 -Wshadow -Wendif-labels -Wstrict-aliasing=2 -Wwrite-strings -Werror=overflow -Werror=shift-count-overflow -Werror=shift-overflow=2 -Wdate-time -Wnested-externs -ffast-math -fno-common -fdiagnostics-show-option -fno-strict-aliasing -fvisibility=hidden -fstack-protector -fstack-protector-strong --param=ssp-buffer-size=4 -fPIE -ffunction-sections -fdata-sections -Wno-unused-parameter -Wno-missing-field-initializers -Wno-unused-result -Wno-format-signedness -Wno-error=nonnull -Werror=shadow -include config.h -O2 -fwrapv -Wformat -Werror=format-security -gdwarf-4 -fno-debug-types-section -fvar-tracking-assignments -g2 -Wp,-D_FORTIFY_SOURCE=2 -fstack-protector-strong --param=ssp-buffer-size=4 -fomit-frame-pointer -march=i686 -fasynchronous-unwind-tables -mtune=pentium4 -gdwarf-4 -fno-debug-types-section -fvar-tracking-assignments -g2 -pthread  -MD -MQ 'systemd-portabled@exe/src_portable_portable.c.o' -MF 'systemd-portabled@exe/src_portable_portable.c.o.d' -o 'systemd-portabled@exe/src_portable_portable.c.o' -c ../src/portable/portable.c
[638/1582] i686-pld-linux-gcc -Isystemctl@exe -I. -I.. -Isrc/basic -I../src/basic -Isrc/shared -I../src/shared -Isrc/systemd -I../src/systemd -Isrc/journal -I../src/journal -Isrc/journal-remote -I../src/journal-remote -Isrc/nspawn -I../src/nspawn -Isrc/resolve -I../src/resolve -Isrc/timesync -I../src/timesync -I../src/time-wait-sync -Isrc/login -I../src/login -Isrc/udev -I../src/udev -Isrc/libudev -I../src/libudev -Isrc/core -I../src/core -I../src/libsystemd/sd-bus -I../src/libsystemd/sd-device -I../src/libsystemd/sd-hwdb -I../src/libsystemd/sd-id128 -I../src/libsystemd/sd-netlink -I../src/libsystemd/sd-network -Isrc/libsystemd-network -I../src/libsystemd-network -I../ -fdiagnostics-color=always -pipe -D_FILE_OFFSET_BITS=64 -std=gnu99 -Wextra -Werror=undef -Wlogical-op -Wmissing-include-dirs -Wold-style-definition -Wpointer-arith -Winit-self -Wfloat-equal -Wsuggest-attribute=noreturn -Werror=missing-prototypes -Werror=implicit-function-declaration -Werror=missing-declarations -Werror=return-type -Werror=incompatible-pointer-types -Werror=format=2 -Wstrict-prototypes -Wredundant-decls -Wmissing-noreturn -Wimplicit-fallthrough=5 -Wshadow -Wendif-labels -Wstrict-aliasing=2 -Wwrite-strings -Werror=overflow -Werror=shift-count-overflow -Werror=shift-overflow=2 -Wdate-time -Wnested-externs -ffast-math -fno-common -fdiagnostics-show-option -fno-strict-aliasing -fvisibility=hidden -fstack-protector -fstack-protector-strong --param=ssp-buffer-size=4 -fPIE -ffunction-sections -fdata-sections -Wno-unused-parameter -Wno-missing-field-initializers -Wno-unused-result -Wno-format-signedness -Wno-error=nonnull -Werror=shadow -include config.h -O2 -fwrapv -Wformat -Werror=format-security -gdwarf-4 -fno-debug-types-section -fvar-tracking-assignments -g2 -Wp,-D_FORTIFY_SOURCE=2 -fstack-protector-strong --param=ssp-buffer-size=4 -fomit-frame-pointer -march=i686 -fasynchronous-unwind-tables -mtune=pentium4 -gdwarf-4 -fno-debug-types-section -fvar-tracking-assignments -g2 -pthread  -MD -MQ 'systemctl@exe/src_systemctl_systemctl.c.o' -MF 'systemctl@exe/src_systemctl_systemctl.c.o.d' -o 'systemctl@exe/src_systemctl_systemctl.c.o' -c ../src/systemctl/systemctl.c
ninja: build stopped: subcommand failed.
error: Bad exit status from /tmp/B.JN6jpr/BUILD/tmp/rpm-tmp.44280 (%build)


RPM build errors:
    Bad exit status from /tmp/B.JN6jpr/BUILD/tmp/rpm-tmp.44280 (%build)
ended at: Fri Feb  8 22:34:41 2019, done in 0:00:40.692073
error: No files produced.
+ chmod -R u+rwX /tmp/B.JN6jpr/BUILD
+ rm -rf /tmp/B.JN6jpr/tmp /tmp/B.JN6jpr/BUILD
+ rm -rf /tmp/B.JN6jpr
Begin-PLD-Builder-Info
Build-Time: user:205.65s sys:25.14s real:45.20s (faults io:0 non-io:3771315)

End-PLD-Builder-Info
[Back to list of logs] [View rpm -qa of builder]