FailedOk

th/SRPMS[OK]
th/x32[OK]
th/i686[OK]
th/x86_64[OK]

ac/SRPMS[OK]
ac/i386[OK]
ac/i586[OK]
ac/i686[OK]
ac/alpha[OK]
ac/amd64[OK]
ac/athlon[OK]
ac/ppc[OK]
ac/sparc[OK]
ac/sparc64[OK]

Advanced Search
main()
Powered by PLD Linux
(c) 2002-2020 PLD Team
$Revision: 1.37 $
Powered by ufo.
Your IP: 18.232.186.117

systemd dbcca160-d113-4180-9516-d03dc9810329

Status:Failed
Source URL:https://buildlogs.pld-linux.org/pld/th/i686/FAIL/systemd,dbcca160-d113-4180-9516-d03dc9810329.bz2
text/plain URL:View!
full text:View!
rpm -qa of builder:View!
Date:2020/06/10 10:53:03
Runtime:0:00:45.942353

Toc:

  • error 1
  • error: No files produced.
  • error 2
  • ../src/libsystemd/sd-bus/bus-error.h:8:10: fatal error: macro.h: No such file or directory
  • error 3
  • compilation terminated.
  • error 4
  • ../src/resolve/resolved-link-bus.c:7:10: fatal error: alloc-util.h: No such file or directory
  • error 5
  • compilation terminated.
  • error 6
  • ../src/login/sysfs-show.c:7:10: fatal error: alloc-util.h: No such file or directory
  • error 7
  • compilation terminated.
  • error 8
  • ../src/resolve/resolved-llmnr.c:6:10: fatal error: errno-util.h: No such file or directory
  • error 9
  • compilation terminated.
  • error 10
  • ../src/resolve/resolved-bus.c:1970:1: fatal error: opening dependency file systemd-resolved@exe/src_resolve_resolved-bus.c.o.d: No such file or directory
  • error 11
  • compilation terminated.

Content:

[577/1881] i686-pld-linux-gcc -Isrc/nspawn/83b75b8@@nspawn-core@sta -Isrc/nspawn -I../src/nspawn -Isrc/basic -I../src/basic -Isrc/boot -I../src/boot -Isrc/shared -I../src/shared -Isrc/systemd -I../src/systemd -Isrc/journal -I../src/journal -Isrc/journal-remote -I../src/journal-remote -Isrc/resolve -I../src/resolve -Isrc/timesync -I../src/timesync -I../src/time-wait-sync -Isrc/login -I../src/login -Isrc/udev -I../src/udev -Isrc/libudev -I../src/libudev -Isrc/core -I../src/core -Isrc/shutdown -I../src/shutdown -I../src/libsystemd/sd-bus -I../src/libsystemd/sd-device -I../src/libsystemd/sd-event -I../src/libsystemd/sd-hwdb -I../src/libsystemd/sd-id128 -I../src/libsystemd/sd-netlink -I../src/libsystemd/sd-network -I../src/libsystemd/sd-resolve -Isrc/libsystemd-network -I../src/libsystemd-network -I. -I.. -fdiagnostics-color=always -pipe -D_FILE_OFFSET_BITS=64 -std=gnu99 -Wno-unused-parameter -Wno-missing-field-initializers -Wno-unused-result -Wno-format-signedness -Werror=undef -Wlogical-op -Wmissing-include-dirs -Wold-style-definition -Wpointer-arith -Winit-self -Wfloat-equal -Wsuggest-attribute=noreturn -Werror=missing-prototypes -Werror=implicit-function-declaration -Werror=missing-declarations -Werror=return-type -Werror=incompatible-pointer-types -Werror=format=2 -Wstrict-prototypes -Wredundant-decls -Wmissing-noreturn -Wimplicit-fallthrough=5 -Wshadow -Wendif-labels -Wstrict-aliasing=2 -Wwrite-strings -Werror=overflow -Werror=shift-count-overflow -Werror=shift-overflow=2 -Wdate-time -Wnested-externs -Wno-error=nonnull -Wno-maybe-uninitialized -ffast-math -fno-common -fdiagnostics-show-option -fno-strict-aliasing -fvisibility=hidden -fstack-protector -fstack-protector-strong --param=ssp-buffer-size=4 -ffunction-sections -fdata-sections -Werror=shadow -include config.h -O2 -fwrapv -Wformat -Werror=format-security -gdwarf-4 -fno-debug-types-section -fvar-tracking-assignments -g2 -Wp,-D_FORTIFY_SOURCE=2 -fstack-protector-strong --param=ssp-buffer-size=4 -Werror=trampolines -fomit-frame-pointer -march=i686 -fasynchronous-unwind-tables -mtune=pentium4 -gdwarf-4 -fno-debug-types-section -fvar-tracking-assignments -g2 -fPIC -MD -MQ 'src/nspawn/83b75b8@@nspawn-core@sta/nspawn-seccomp.c.o' -MF 'src/nspawn/83b75b8@@nspawn-core@sta/nspawn-seccomp.c.o.d' -o 'src/nspawn/83b75b8@@nspawn-core@sta/nspawn-seccomp.c.o' -c ../src/nspawn/nspawn-seccomp.c
[578/1881] i686-pld-linux-gcc -Isrc/nspawn/83b75b8@@nspawn-core@sta -Isrc/nspawn -I../src/nspawn -Isrc/basic -I../src/basic -Isrc/boot -I../src/boot -Isrc/shared -I../src/shared -Isrc/systemd -I../src/systemd -Isrc/journal -I../src/journal -Isrc/journal-remote -I../src/journal-remote -Isrc/resolve -I../src/resolve -Isrc/timesync -I../src/timesync -I../src/time-wait-sync -Isrc/login -I../src/login -Isrc/udev -I../src/udev -Isrc/libudev -I../src/libudev -Isrc/core -I../src/core -Isrc/shutdown -I../src/shutdown -I../src/libsystemd/sd-bus -I../src/libsystemd/sd-device -I../src/libsystemd/sd-event -I../src/libsystemd/sd-hwdb -I../src/libsystemd/sd-id128 -I../src/libsystemd/sd-netlink -I../src/libsystemd/sd-network -I../src/libsystemd/sd-resolve -Isrc/libsystemd-network -I../src/libsystemd-network -I. -I.. -fdiagnostics-color=always -pipe -D_FILE_OFFSET_BITS=64 -std=gnu99 -Wno-unused-parameter -Wno-missing-field-initializers -Wno-unused-result -Wno-format-signedness -Werror=undef -Wlogical-op -Wmissing-include-dirs -Wold-style-definition -Wpointer-arith -Winit-self -Wfloat-equal -Wsuggest-attribute=noreturn -Werror=missing-prototypes -Werror=implicit-function-declaration -Werror=missing-declarations -Werror=return-type -Werror=incompatible-pointer-types -Werror=format=2 -Wstrict-prototypes -Wredundant-decls -Wmissing-noreturn -Wimplicit-fallthrough=5 -Wshadow -Wendif-labels -Wstrict-aliasing=2 -Wwrite-strings -Werror=overflow -Werror=shift-count-overflow -Werror=shift-overflow=2 -Wdate-time -Wnested-externs -Wno-error=nonnull -Wno-maybe-uninitialized -ffast-math -fno-common -fdiagnostics-show-option -fno-strict-aliasing -fvisibility=hidden -fstack-protector -fstack-protector-strong --param=ssp-buffer-size=4 -ffunction-sections -fdata-sections -Werror=shadow -include config.h -O2 -fwrapv -Wformat -Werror=format-security -gdwarf-4 -fno-debug-types-section -fvar-tracking-assignments -g2 -Wp,-D_FORTIFY_SOURCE=2 -fstack-protector-strong --param=ssp-buffer-size=4 -Werror=trampolines -fomit-frame-pointer -march=i686 -fasynchronous-unwind-tables -mtune=pentium4 -gdwarf-4 -fno-debug-types-section -fvar-tracking-assignments -g2 -fPIC -MD -MQ 'src/nspawn/83b75b8@@nspawn-core@sta/nspawn-mount.c.o' -MF 'src/nspawn/83b75b8@@nspawn-core@sta/nspawn-mount.c.o.d' -o 'src/nspawn/83b75b8@@nspawn-core@sta/nspawn-mount.c.o' -c ../src/nspawn/nspawn-mount.c
[579/1881] i686-pld-linux-gcc -Isrc/machine/bdfdaa9@@machine-core@sta -Isrc/machine -I../src/machine -Isrc/basic -I../src/basic -Isrc/boot -I../src/boot -Isrc/shared -I../src/shared -Isrc/systemd -I../src/systemd -Isrc/journal -I../src/journal -Isrc/journal-remote -I../src/journal-remote -Isrc/nspawn -I../src/nspawn -Isrc/resolve -I../src/resolve -Isrc/timesync -I../src/timesync -I../src/time-wait-sync -Isrc/login -I../src/login -Isrc/udev -I../src/udev -Isrc/libudev -I../src/libudev -Isrc/core -I../src/core -Isrc/shutdown -I../src/shutdown -I../src/libsystemd/sd-bus -I../src/libsystemd/sd-device -I../src/libsystemd/sd-event -I../src/libsystemd/sd-hwdb -I../src/libsystemd/sd-id128 -I../src/libsystemd/sd-netlink -I../src/libsystemd/sd-network -I../src/libsystemd/sd-resolve -Isrc/libsystemd-network -I../src/libsystemd-network -I. -I.. -fdiagnostics-color=always -pipe -D_FILE_OFFSET_BITS=64 -std=gnu99 -Wno-unused-parameter -Wno-missing-field-initializers -Wno-unused-result -Wno-format-signedness -Werror=undef -Wlogical-op -Wmissing-include-dirs -Wold-style-definition -Wpointer-arith -Winit-self -Wfloat-equal -Wsuggest-attribute=noreturn -Werror=missing-prototypes -Werror=implicit-function-declaration -Werror=missing-declarations -Werror=return-type -Werror=incompatible-pointer-types -Werror=format=2 -Wstrict-prototypes -Wredundant-decls -Wmissing-noreturn -Wimplicit-fallthrough=5 -Wshadow -Wendif-labels -Wstrict-aliasing=2 -Wwrite-strings -Werror=overflow -Werror=shift-count-overflow -Werror=shift-overflow=2 -Wdate-time -Wnested-externs -Wno-error=nonnull -Wno-maybe-uninitialized -ffast-math -fno-common -fdiagnostics-show-option -fno-strict-aliasing -fvisibility=hidden -fstack-protector -fstack-protector-strong --param=ssp-buffer-size=4 -ffunction-sections -fdata-sections -Werror=shadow -include config.h -O2 -fwrapv -Wformat -Werror=format-security -gdwarf-4 -fno-debug-types-section -fvar-tracking-assignments -g2 -Wp,-D_FORTIFY_SOURCE=2 -fstack-protector-strong --param=ssp-buffer-size=4 -Werror=trampolines -fomit-frame-pointer -march=i686 -fasynchronous-unwind-tables -mtune=pentium4 -gdwarf-4 -fno-debug-types-section -fvar-tracking-assignments -g2 -fPIC -pthread -MD -MQ 'src/machine/bdfdaa9@@machine-core@sta/machine-dbus.c.o' -MF 'src/machine/bdfdaa9@@machine-core@sta/machine-dbus.c.o.d' -o 'src/machine/bdfdaa9@@machine-core@sta/machine-dbus.c.o' -c ../src/machine/machine-dbus.c
[580/1881] /usr/bin/gperf ../src/resolve/resolved-dnssd-gperf.gperf --output-file src/resolve/resolved-dnssd-gperf.c
[581/1881] /usr/bin/gperf ../src/timesync/timesyncd-gperf.gperf --output-file src/timesync/timesyncd-gperf.c
[582/1881] rm -f src/machine/libmachine-core.a && gcc-ar csrD src/machine/libmachine-core.a 'src/machine/bdfdaa9@@machine-core@sta/machine.c.o' 'src/machine/bdfdaa9@@machine-core@sta/machined-dbus.c.o' 'src/machine/bdfdaa9@@machine-core@sta/machined-core.c.o' 'src/machine/bdfdaa9@@machine-core@sta/machine-dbus.c.o' 'src/machine/bdfdaa9@@machine-core@sta/image-dbus.c.o' 'src/machine/bdfdaa9@@machine-core@sta/operation.c.o'
[583/1881] i686-pld-linux-gcc -Itest-dlopen@exe -I. -I.. -Isrc/basic -I../src/basic -Isrc/boot -I../src/boot -Isrc/shared -I../src/shared -Isrc/systemd -I../src/systemd -Isrc/journal -I../src/journal -Isrc/journal-remote -I../src/journal-remote -Isrc/nspawn -I../src/nspawn -Isrc/resolve -I../src/resolve -Isrc/timesync -I../src/timesync -I../src/time-wait-sync -Isrc/login -I../src/login -Isrc/udev -I../src/udev -Isrc/libudev -I../src/libudev -Isrc/core -I../src/core -Isrc/shutdown -I../src/shutdown -I../src/libsystemd/sd-bus -I../src/libsystemd/sd-device -I../src/libsystemd/sd-event -I../src/libsystemd/sd-hwdb -I../src/libsystemd/sd-id128 -I../src/libsystemd/sd-netlink -I../src/libsystemd/sd-network -I../src/libsystemd/sd-resolve -Isrc/libsystemd-network -I../src/libsystemd-network -fdiagnostics-color=always -pipe -D_FILE_OFFSET_BITS=64 -std=gnu99 -Wno-unused-parameter -Wno-missing-field-initializers -Wno-unused-result -Wno-format-signedness -Werror=undef -Wlogical-op -Wmissing-include-dirs -Wold-style-definition -Wpointer-arith -Winit-self -Wfloat-equal -Wsuggest-attribute=noreturn -Werror=missing-prototypes -Werror=implicit-function-declaration -Werror=missing-declarations -Werror=return-type -Werror=incompatible-pointer-types -Werror=format=2 -Wstrict-prototypes -Wredundant-decls -Wmissing-noreturn -Wimplicit-fallthrough=5 -Wshadow -Wendif-labels -Wstrict-aliasing=2 -Wwrite-strings -Werror=overflow -Werror=shift-count-overflow -Werror=shift-overflow=2 -Wdate-time -Wnested-externs -Wno-error=nonnull -Wno-maybe-uninitialized -ffast-math -fno-common -fdiagnostics-show-option -fno-strict-aliasing -fvisibility=hidden -fstack-protector -fstack-protector-strong --param=ssp-buffer-size=4 -ffunction-sections -fdata-sections -Werror=shadow -include config.h -O2 -fwrapv -Wformat -Werror=format-security -gdwarf-4 -fno-debug-types-section -fvar-tracking-assignments -g2 -Wp,-D_FORTIFY_SOURCE=2 -fstack-protector-strong --param=ssp-buffer-size=4 -Werror=trampolines -fomit-frame-pointer -march=i686 -fasynchronous-unwind-tables -mtune=pentium4 -gdwarf-4 -fno-debug-types-section -fvar-tracking-assignments -g2 -MD -MQ 'test-dlopen@exe/src_libsystemd_disable-mempool.c.o' -MF 'test-dlopen@exe/src_libsystemd_disable-mempool.c.o.d' -o 'test-dlopen@exe/src_libsystemd_disable-mempool.c.o' -c ../src/libsystemd/disable-mempool.c
[584/1881] i686-pld-linux-gcc -Isrc/nspawn/83b75b8@@nspawn-core@sta -Isrc/nspawn -I../src/nspawn -Isrc/basic -I../src/basic -Isrc/boot -I../src/boot -Isrc/shared -I../src/shared -Isrc/systemd -I../src/systemd -Isrc/journal -I../src/journal -Isrc/journal-remote -I../src/journal-remote -Isrc/resolve -I../src/resolve -Isrc/timesync -I../src/timesync -I../src/time-wait-sync -Isrc/login -I../src/login -Isrc/udev -I../src/udev -Isrc/libudev -I../src/libudev -Isrc/core -I../src/core -Isrc/shutdown -I../src/shutdown -I../src/libsystemd/sd-bus -I../src/libsystemd/sd-device -I../src/libsystemd/sd-event -I../src/libsystemd/sd-hwdb -I../src/libsystemd/sd-id128 -I../src/libsystemd/sd-netlink -I../src/libsystemd/sd-network -I../src/libsystemd/sd-resolve -Isrc/libsystemd-network -I../src/libsystemd-network -I. -I.. -fdiagnostics-color=always -pipe -D_FILE_OFFSET_BITS=64 -std=gnu99 -Wno-unused-parameter -Wno-missing-field-initializers -Wno-unused-result -Wno-format-signedness -Werror=undef -Wlogical-op -Wmissing-include-dirs -Wold-style-definition -Wpointer-arith -Winit-self -Wfloat-equal -Wsuggest-attribute=noreturn -Werror=missing-prototypes -Werror=implicit-function-declaration -Werror=missing-declarations -Werror=return-type -Werror=incompatible-pointer-types -Werror=format=2 -Wstrict-prototypes -Wredundant-decls -Wmissing-noreturn -Wimplicit-fallthrough=5 -Wshadow -Wendif-labels -Wstrict-aliasing=2 -Wwrite-strings -Werror=overflow -Werror=shift-count-overflow -Werror=shift-overflow=2 -Wdate-time -Wnested-externs -Wno-error=nonnull -Wno-maybe-uninitialized -ffast-math -fno-common -fdiagnostics-show-option -fno-strict-aliasing -fvisibility=hidden -fstack-protector -fstack-protector-strong --param=ssp-buffer-size=4 -ffunction-sections -fdata-sections -Werror=shadow -include config.h -O2 -fwrapv -Wformat -Werror=format-security -gdwarf-4 -fno-debug-types-section -fvar-tracking-assignments -g2 -Wp,-D_FORTIFY_SOURCE=2 -fstack-protector-strong --param=ssp-buffer-size=4 -Werror=trampolines -fomit-frame-pointer -march=i686 -fasynchronous-unwind-tables -mtune=pentium4 -gdwarf-4 -fno-debug-types-section -fvar-tracking-assignments -g2 -fPIC -MD -MQ 'src/nspawn/83b75b8@@nspawn-core@sta/nspawn-register.c.o' -MF 'src/nspawn/83b75b8@@nspawn-core@sta/nspawn-register.c.o.d' -o 'src/nspawn/83b75b8@@nspawn-core@sta/nspawn-register.c.o' -c ../src/nspawn/nspawn-register.c
[585/1881] i686-pld-linux-gcc -c ../src/boot/efi/disk.c -o src/boot/efi/disk.c.o -Wall -Wextra -std=gnu90 -nostdinc -fpic -fshort-wchar -ffreestanding -fno-strict-aliasing -fno-stack-protector -Wsign-compare -Wno-missing-field-initializers -isystem /usr/include/efi -isystem /usr/include/efi/ia32 -include src/boot/efi/efi_config.h -include version.h -O2
[586/1881] i686-pld-linux-gcc -Isrc/nspawn/83b75b8@@nspawn-core@sta -Isrc/nspawn -I../src/nspawn -Isrc/basic -I../src/basic -Isrc/boot -I../src/boot -Isrc/shared -I../src/shared -Isrc/systemd -I../src/systemd -Isrc/journal -I../src/journal -Isrc/journal-remote -I../src/journal-remote -Isrc/resolve -I../src/resolve -Isrc/timesync -I../src/timesync -I../src/time-wait-sync -Isrc/login -I../src/login -Isrc/udev -I../src/udev -Isrc/libudev -I../src/libudev -Isrc/core -I../src/core -Isrc/shutdown -I../src/shutdown -I../src/libsystemd/sd-bus -I../src/libsystemd/sd-device -I../src/libsystemd/sd-event -I../src/libsystemd/sd-hwdb -I../src/libsystemd/sd-id128 -I../src/libsystemd/sd-netlink -I../src/libsystemd/sd-network -I../src/libsystemd/sd-resolve -Isrc/libsystemd-network -I../src/libsystemd-network -I. -I.. -fdiagnostics-color=always -pipe -D_FILE_OFFSET_BITS=64 -std=gnu99 -Wno-unused-parameter -Wno-missing-field-initializers -Wno-unused-result -Wno-format-signedness -Werror=undef -Wlogical-op -Wmissing-include-dirs -Wold-style-definition -Wpointer-arith -Winit-self -Wfloat-equal -Wsuggest-attribute=noreturn -Werror=missing-prototypes -Werror=implicit-function-declaration -Werror=missing-declarations -Werror=return-type -Werror=incompatible-pointer-types -Werror=format=2 -Wstrict-prototypes -Wredundant-decls -Wmissing-noreturn -Wimplicit-fallthrough=5 -Wshadow -Wendif-labels -Wstrict-aliasing=2 -Wwrite-strings -Werror=overflow -Werror=shift-count-overflow -Werror=shift-overflow=2 -Wdate-time -Wnested-externs -Wno-error=nonnull -Wno-maybe-uninitialized -ffast-math -fno-common -fdiagnostics-show-option -fno-strict-aliasing -fvisibility=hidden -fstack-protector -fstack-protector-strong --param=ssp-buffer-size=4 -ffunction-sections -fdata-sections -Werror=shadow -include config.h -O2 -fwrapv -Wformat -Werror=format-security -gdwarf-4 -fno-debug-types-section -fvar-tracking-assignments -g2 -Wp,-D_FORTIFY_SOURCE=2 -fstack-protector-strong --param=ssp-buffer-size=4 -Werror=trampolines -fomit-frame-pointer -march=i686 -fasynchronous-unwind-tables -mtune=pentium4 -gdwarf-4 -fno-debug-types-section -fvar-tracking-assignments -g2 -fPIC -MD -MQ 'src/nspawn/83b75b8@@nspawn-core@sta/nspawn-cgroup.c.o' -MF 'src/nspawn/83b75b8@@nspawn-core@sta/nspawn-cgroup.c.o.d' -o 'src/nspawn/83b75b8@@nspawn-core@sta/nspawn-cgroup.c.o' -c ../src/nspawn/nspawn-cgroup.c
[587/1881] i686-pld-linux-gcc -Isrc/nspawn/83b75b8@@nspawn-core@sta -Isrc/nspawn -I../src/nspawn -Isrc/basic -I../src/basic -Isrc/boot -I../src/boot -Isrc/shared -I../src/shared -Isrc/systemd -I../src/systemd -Isrc/journal -I../src/journal -Isrc/journal-remote -I../src/journal-remote -Isrc/resolve -I../src/resolve -Isrc/timesync -I../src/timesync -I../src/time-wait-sync -Isrc/login -I../src/login -Isrc/udev -I../src/udev -Isrc/libudev -I../src/libudev -Isrc/core -I../src/core -Isrc/shutdown -I../src/shutdown -I../src/libsystemd/sd-bus -I../src/libsystemd/sd-device -I../src/libsystemd/sd-event -I../src/libsystemd/sd-hwdb -I../src/libsystemd/sd-id128 -I../src/libsystemd/sd-netlink -I../src/libsystemd/sd-network -I../src/libsystemd/sd-resolve -Isrc/libsystemd-network -I../src/libsystemd-network -I. -I.. -fdiagnostics-color=always -pipe -D_FILE_OFFSET_BITS=64 -std=gnu99 -Wno-unused-parameter -Wno-missing-field-initializers -Wno-unused-result -Wno-format-signedness -Werror=undef -Wlogical-op -Wmissing-include-dirs -Wold-style-definition -Wpointer-arith -Winit-self -Wfloat-equal -Wsuggest-attribute=noreturn -Werror=missing-prototypes -Werror=implicit-function-declaration -Werror=missing-declarations -Werror=return-type -Werror=incompatible-pointer-types -Werror=format=2 -Wstrict-prototypes -Wredundant-decls -Wmissing-noreturn -Wimplicit-fallthrough=5 -Wshadow -Wendif-labels -Wstrict-aliasing=2 -Wwrite-strings -Werror=overflow -Werror=shift-count-overflow -Werror=shift-overflow=2 -Wdate-time -Wnested-externs -Wno-error=nonnull -Wno-maybe-uninitialized -ffast-math -fno-common -fdiagnostics-show-option -fno-strict-aliasing -fvisibility=hidden -fstack-protector -fstack-protector-strong --param=ssp-buffer-size=4 -ffunction-sections -fdata-sections -Werror=shadow -include config.h -O2 -fwrapv -Wformat -Werror=format-security -gdwarf-4 -fno-debug-types-section -fvar-tracking-assignments -g2 -Wp,-D_FORTIFY_SOURCE=2 -fstack-protector-strong --param=ssp-buffer-size=4 -Werror=trampolines -fomit-frame-pointer -march=i686 -fasynchronous-unwind-tables -mtune=pentium4 -gdwarf-4 -fno-debug-types-section -fvar-tracking-assignments -g2 -fPIC -MD -MQ 'src/nspawn/83b75b8@@nspawn-core@sta/nspawn-stub-pid1.c.o' -MF 'src/nspawn/83b75b8@@nspawn-core@sta/nspawn-stub-pid1.c.o.d' -o 'src/nspawn/83b75b8@@nspawn-core@sta/nspawn-stub-pid1.c.o' -c ../src/nspawn/nspawn-stub-pid1.c
[588/1881] i686-pld-linux-gcc -c ../src/boot/efi/measure.c -o src/boot/efi/measure.c.o -Wall -Wextra -std=gnu90 -nostdinc -fpic -fshort-wchar -ffreestanding -fno-strict-aliasing -fno-stack-protector -Wsign-compare -Wno-missing-field-initializers -isystem /usr/include/efi -isystem /usr/include/efi/ia32 -include src/boot/efi/efi_config.h -include version.h -O2
[589/1881] i686-pld-linux-gcc -c ../src/boot/efi/graphics.c -o src/boot/efi/graphics.c.o -Wall -Wextra -std=gnu90 -nostdinc -fpic -fshort-wchar -ffreestanding -fno-strict-aliasing -fno-stack-protector -Wsign-compare -Wno-missing-field-initializers -isystem /usr/include/efi -isystem /usr/include/efi/ia32 -include src/boot/efi/efi_config.h -include version.h -O2
[590/1881] i686-pld-linux-gcc -c ../src/boot/efi/pe.c -o src/boot/efi/pe.c.o -Wall -Wextra -std=gnu90 -nostdinc -fpic -fshort-wchar -ffreestanding -fno-strict-aliasing -fno-stack-protector -Wsign-compare -Wno-missing-field-initializers -isystem /usr/include/efi -isystem /usr/include/efi/ia32 -include src/boot/efi/efi_config.h -include version.h -O2
[591/1881] i686-pld-linux-gcc -c ../src/boot/efi/crc32.c -o src/boot/efi/crc32.c.o -Wall -Wextra -std=gnu90 -nostdinc -fpic -fshort-wchar -ffreestanding -fno-strict-aliasing -fno-stack-protector -Wsign-compare -Wno-missing-field-initializers -isystem /usr/include/efi -isystem /usr/include/efi/ia32 -include src/boot/efi/efi_config.h -include version.h -O2
[592/1881] i686-pld-linux-gcc -Isrc/nspawn/83b75b8@@nspawn-core@sta -Isrc/nspawn -I../src/nspawn -Isrc/basic -I../src/basic -Isrc/boot -I../src/boot -Isrc/shared -I../src/shared -Isrc/systemd -I../src/systemd -Isrc/journal -I../src/journal -Isrc/journal-remote -I../src/journal-remote -Isrc/resolve -I../src/resolve -Isrc/timesync -I../src/timesync -I../src/time-wait-sync -Isrc/login -I../src/login -Isrc/udev -I../src/udev -Isrc/libudev -I../src/libudev -Isrc/core -I../src/core -Isrc/shutdown -I../src/shutdown -I../src/libsystemd/sd-bus -I../src/libsystemd/sd-device -I../src/libsystemd/sd-event -I../src/libsystemd/sd-hwdb -I../src/libsystemd/sd-id128 -I../src/libsystemd/sd-netlink -I../src/libsystemd/sd-network -I../src/libsystemd/sd-resolve -Isrc/libsystemd-network -I../src/libsystemd-network -I. -I.. -fdiagnostics-color=always -pipe -D_FILE_OFFSET_BITS=64 -std=gnu99 -Wno-unused-parameter -Wno-missing-field-initializers -Wno-unused-result -Wno-format-signedness -Werror=undef -Wlogical-op -Wmissing-include-dirs -Wold-style-definition -Wpointer-arith -Winit-self -Wfloat-equal -Wsuggest-attribute=noreturn -Werror=missing-prototypes -Werror=implicit-function-declaration -Werror=missing-declarations -Werror=return-type -Werror=incompatible-pointer-types -Werror=format=2 -Wstrict-prototypes -Wredundant-decls -Wmissing-noreturn -Wimplicit-fallthrough=5 -Wshadow -Wendif-labels -Wstrict-aliasing=2 -Wwrite-strings -Werror=overflow -Werror=shift-count-overflow -Werror=shift-overflow=2 -Wdate-time -Wnested-externs -Wno-error=nonnull -Wno-maybe-uninitialized -ffast-math -fno-common -fdiagnostics-show-option -fno-strict-aliasing -fvisibility=hidden -fstack-protector -fstack-protector-strong --param=ssp-buffer-size=4 -ffunction-sections -fdata-sections -Werror=shadow -include config.h -O2 -fwrapv -Wformat -Werror=format-security -gdwarf-4 -fno-debug-types-section -fvar-tracking-assignments -g2 -Wp,-D_FORTIFY_SOURCE=2 -fstack-protector-strong --param=ssp-buffer-size=4 -Werror=trampolines -fomit-frame-pointer -march=i686 -fasynchronous-unwind-tables -mtune=pentium4 -gdwarf-4 -fno-debug-types-section -fvar-tracking-assignments -g2 -fPIC -MD -MQ 'src/nspawn/83b75b8@@nspawn-core@sta/nspawn-setuid.c.o' -MF 'src/nspawn/83b75b8@@nspawn-core@sta/nspawn-setuid.c.o.d' -o 'src/nspawn/83b75b8@@nspawn-core@sta/nspawn-setuid.c.o' -c ../src/nspawn/nspawn-setuid.c
[593/1881] i686-pld-linux-gcc -c ../src/boot/efi/util.c -o src/boot/efi/util.c.o -Wall -Wextra -std=gnu90 -nostdinc -fpic -fshort-wchar -ffreestanding -fno-strict-aliasing -fno-stack-protector -Wsign-compare -Wno-missing-field-initializers -isystem /usr/include/efi -isystem /usr/include/efi/ia32 -include src/boot/efi/efi_config.h -include version.h -O2
[594/1881] i686-pld-linux-gcc -c ../src/boot/efi/console.c -o src/boot/efi/console.c.o -Wall -Wextra -std=gnu90 -nostdinc -fpic -fshort-wchar -ffreestanding -fno-strict-aliasing -fno-stack-protector -Wsign-compare -Wno-missing-field-initializers -isystem /usr/include/efi -isystem /usr/include/efi/ia32 -include src/boot/efi/efi_config.h -include version.h -O2
[595/1881] i686-pld-linux-gcc -c ../src/boot/efi/sha256.c -o src/boot/efi/sha256.c.o -Wall -Wextra -std=gnu90 -nostdinc -fpic -fshort-wchar -ffreestanding -fno-strict-aliasing -fno-stack-protector -Wsign-compare -Wno-missing-field-initializers -isystem /usr/include/efi -isystem /usr/include/efi/ia32 -include src/boot/efi/efi_config.h -include version.h -O2
[596/1881] i686-pld-linux-gcc -c ../src/boot/efi/random-seed.c -o src/boot/efi/random-seed.c.o -Wall -Wextra -std=gnu90 -nostdinc -fpic -fshort-wchar -ffreestanding -fno-strict-aliasing -fno-stack-protector -Wsign-compare -Wno-missing-field-initializers -isystem /usr/include/efi -isystem /usr/include/efi/ia32 -include src/boot/efi/efi_config.h -include version.h -O2
[597/1881] i686-pld-linux-gcc -c ../src/boot/efi/linux.c -o src/boot/efi/linux.c.o -Wall -Wextra -std=gnu90 -nostdinc -fpic -fshort-wchar -ffreestanding -fno-strict-aliasing -fno-stack-protector -Wsign-compare -Wno-missing-field-initializers -isystem /usr/include/efi -isystem /usr/include/efi/ia32 -include src/boot/efi/efi_config.h -include version.h -O2
[598/1881] i686-pld-linux-gcc -c ../src/boot/efi/shim.c -o src/boot/efi/shim.c.o -Wall -Wextra -std=gnu90 -nostdinc -fpic -fshort-wchar -ffreestanding -fno-strict-aliasing -fno-stack-protector -Wsign-compare -Wno-missing-field-initializers -isystem /usr/include/efi -isystem /usr/include/efi/ia32 -include src/boot/efi/efi_config.h -include version.h -O2
[599/1881] i686-pld-linux-gcc -c ../src/boot/efi/stub.c -o src/boot/efi/stub.c.o -Wall -Wextra -std=gnu90 -nostdinc -fpic -fshort-wchar -ffreestanding -fno-strict-aliasing -fno-stack-protector -Wsign-compare -Wno-missing-field-initializers -isystem /usr/include/efi -isystem /usr/include/efi/ia32 -include src/boot/efi/efi_config.h -include version.h -O2
[600/1881] i686-pld-linux-gcc -c ../src/boot/efi/splash.c -o src/boot/efi/splash.c.o -Wall -Wextra -std=gnu90 -nostdinc -fpic -fshort-wchar -ffreestanding -fno-strict-aliasing -fno-stack-protector -Wsign-compare -Wno-missing-field-initializers -isystem /usr/include/efi -isystem /usr/include/efi/ia32 -include src/boot/efi/efi_config.h -include version.h -O2
[601/1881] /usr/bin/ld -o src/boot/efi/stub.so -T /usr/lib/elf_ia32_efi.lds -shared -Bsymbolic -nostdlib -znocombreloc -L /usr/lib /usr/lib/crt0-efi-ia32.o src/boot/efi/disk.c.o src/boot/efi/graphics.c.o src/boot/efi/measure.c.o src/boot/efi/pe.c.o src/boot/efi/util.c.o src/boot/efi/linux.c.o src/boot/efi/splash.c.o src/boot/efi/stub.c.o -lefi -lgnuefi /usr/lib/gcc/i686-pld-linux/10.1.0/libgcc.a
[602/1881] i686-pld-linux-gcc -Isrc/nspawn/83b75b8@@nspawn-core@sta -Isrc/nspawn -I../src/nspawn -Isrc/basic -I../src/basic -Isrc/boot -I../src/boot -Isrc/shared -I../src/shared -Isrc/systemd -I../src/systemd -Isrc/journal -I../src/journal -Isrc/journal-remote -I../src/journal-remote -Isrc/resolve -I../src/resolve -Isrc/timesync -I../src/timesync -I../src/time-wait-sync -Isrc/login -I../src/login -Isrc/udev -I../src/udev -Isrc/libudev -I../src/libudev -Isrc/core -I../src/core -Isrc/shutdown -I../src/shutdown -I../src/libsystemd/sd-bus -I../src/libsystemd/sd-device -I../src/libsystemd/sd-event -I../src/libsystemd/sd-hwdb -I../src/libsystemd/sd-id128 -I../src/libsystemd/sd-netlink -I../src/libsystemd/sd-network -I../src/libsystemd/sd-resolve -Isrc/libsystemd-network -I../src/libsystemd-network -I. -I.. -fdiagnostics-color=always -pipe -D_FILE_OFFSET_BITS=64 -std=gnu99 -Wno-unused-parameter -Wno-missing-field-initializers -Wno-unused-result -Wno-format-signedness -Werror=undef -Wlogical-op -Wmissing-include-dirs -Wold-style-definition -Wpointer-arith -Winit-self -Wfloat-equal -Wsuggest-attribute=noreturn -Werror=missing-prototypes -Werror=implicit-function-declaration -Werror=missing-declarations -Werror=return-type -Werror=incompatible-pointer-types -Werror=format=2 -Wstrict-prototypes -Wredundant-decls -Wmissing-noreturn -Wimplicit-fallthrough=5 -Wshadow -Wendif-labels -Wstrict-aliasing=2 -Wwrite-strings -Werror=overflow -Werror=shift-count-overflow -Werror=shift-overflow=2 -Wdate-time -Wnested-externs -Wno-error=nonnull -Wno-maybe-uninitialized -ffast-math -fno-common -fdiagnostics-show-option -fno-strict-aliasing -fvisibility=hidden -fstack-protector -fstack-protector-strong --param=ssp-buffer-size=4 -ffunction-sections -fdata-sections -Werror=shadow -include config.h -O2 -fwrapv -Wformat -Werror=format-security -gdwarf-4 -fno-debug-types-section -fvar-tracking-assignments -g2 -Wp,-D_FORTIFY_SOURCE=2 -fstack-protector-strong --param=ssp-buffer-size=4 -Werror=trampolines -fomit-frame-pointer -march=i686 -fasynchronous-unwind-tables -mtune=pentium4 -gdwarf-4 -fno-debug-types-section -fvar-tracking-assignments -g2 -fPIC -MD -MQ 'src/nspawn/83b75b8@@nspawn-core@sta/nspawn-settings.c.o' -MF 'src/nspawn/83b75b8@@nspawn-core@sta/nspawn-settings.c.o.d' -o 'src/nspawn/83b75b8@@nspawn-core@sta/nspawn-settings.c.o' -c ../src/nspawn/nspawn-settings.c
[603/1881] /usr/bin/objcopy -j .text -j .sdata -j .data -j .dynamic -j .dynsym -j '.rel*' --target=efi-app-ia32 src/boot/efi/stub.so src/boot/efi/linuxia32.efi.stub
[604/1881] /usr/bin/xsltproc -o man/kernel-command-line.7 --nonet --xinclude --maxdepth 9000 --stringparam man.output.quietly 1 --stringparam funcsynopsis.style ansi --stringparam man.authors.section.enabled 0 --stringparam man.copyright.section.enabled 0 --stringparam systemd.version 245 --path /tmp/B.clK9HG/BUILD/systemd-245/build/man:/tmp/B.clK9HG/BUILD/systemd-245/man ../man/custom-man.xsl ../man/kernel-command-line.xml
[605/1881] /usr/bin/xsltproc -o man/kernel-install.8 --nonet --xinclude --maxdepth 9000 --stringparam man.output.quietly 1 --stringparam funcsynopsis.style ansi --stringparam man.authors.section.enabled 0 --stringparam man.copyright.section.enabled 0 --stringparam systemd.version 245 --path /tmp/B.clK9HG/BUILD/systemd-245/build/man:/tmp/B.clK9HG/BUILD/systemd-245/man ../man/custom-man.xsl ../man/kernel-install.xml
[606/1881] /usr/bin/xsltproc -o man/loader.conf.5 --nonet --xinclude --maxdepth 9000 --stringparam man.output.quietly 1 --stringparam funcsynopsis.style ansi --stringparam man.authors.section.enabled 0 --stringparam man.copyright.section.enabled 0 --stringparam systemd.version 245 --path /tmp/B.clK9HG/BUILD/systemd-245/build/man:/tmp/B.clK9HG/BUILD/systemd-245/man ../man/custom-man.xsl ../man/loader.conf.xml
[607/1881] /usr/bin/xsltproc -o man/libudev.3 --nonet --xinclude --maxdepth 9000 --stringparam man.output.quietly 1 --stringparam funcsynopsis.style ansi --stringparam man.authors.section.enabled 0 --stringparam man.copyright.section.enabled 0 --stringparam systemd.version 245 --path /tmp/B.clK9HG/BUILD/systemd-245/build/man:/tmp/B.clK9HG/BUILD/systemd-245/man ../man/custom-man.xsl ../man/libudev.xml
[608/1881] /usr/bin/meson --internal exe --capture src/resolve/dns_type-list.txt -- /bin/sed -n -r -f ../src/resolve/generate-dns_type-list.sed ../src/resolve/dns-type.h
[609/1881] i686-pld-linux-gcc -Itest-dlopen@exe -I. -I.. -Isrc/basic -I../src/basic -Isrc/boot -I../src/boot -Isrc/shared -I../src/shared -Isrc/systemd -I../src/systemd -Isrc/journal -I../src/journal -Isrc/journal-remote -I../src/journal-remote -Isrc/nspawn -I../src/nspawn -Isrc/resolve -I../src/resolve -Isrc/timesync -I../src/timesync -I../src/time-wait-sync -Isrc/login -I../src/login -Isrc/udev -I../src/udev -Isrc/libudev -I../src/libudev -Isrc/core -I../src/core -Isrc/shutdown -I../src/shutdown -I../src/libsystemd/sd-bus -I../src/libsystemd/sd-device -I../src/libsystemd/sd-event -I../src/libsystemd/sd-hwdb -I../src/libsystemd/sd-id128 -I../src/libsystemd/sd-netlink -I../src/libsystemd/sd-network -I../src/libsystemd/sd-resolve -Isrc/libsystemd-network -I../src/libsystemd-network -fdiagnostics-color=always -pipe -D_FILE_OFFSET_BITS=64 -std=gnu99 -Wno-unused-parameter -Wno-missing-field-initializers -Wno-unused-result -Wno-format-signedness -Werror=undef -Wlogical-op -Wmissing-include-dirs -Wold-style-definition -Wpointer-arith -Winit-self -Wfloat-equal -Wsuggest-attribute=noreturn -Werror=missing-prototypes -Werror=implicit-function-declaration -Werror=missing-declarations -Werror=return-type -Werror=incompatible-pointer-types -Werror=format=2 -Wstrict-prototypes -Wredundant-decls -Wmissing-noreturn -Wimplicit-fallthrough=5 -Wshadow -Wendif-labels -Wstrict-aliasing=2 -Wwrite-strings -Werror=overflow -Werror=shift-count-overflow -Werror=shift-overflow=2 -Wdate-time -Wnested-externs -Wno-error=nonnull -Wno-maybe-uninitialized -ffast-math -fno-common -fdiagnostics-show-option -fno-strict-aliasing -fvisibility=hidden -fstack-protector -fstack-protector-strong --param=ssp-buffer-size=4 -ffunction-sections -fdata-sections -Werror=shadow -include config.h -O2 -fwrapv -Wformat -Werror=format-security -gdwarf-4 -fno-debug-types-section -fvar-tracking-assignments -g2 -Wp,-D_FORTIFY_SOURCE=2 -fstack-protector-strong --param=ssp-buffer-size=4 -Werror=trampolines -fomit-frame-pointer -march=i686 -fasynchronous-unwind-tables -mtune=pentium4 -gdwarf-4 -fno-debug-types-section -fvar-tracking-assignments -g2 -MD -MQ 'test-dlopen@exe/src_test_test-dlopen.c.o' -MF 'test-dlopen@exe/src_test_test-dlopen.c.o.d' -o 'test-dlopen@exe/src_test_test-dlopen.c.o' -c ../src/test/test-dlopen.c
[610/1881] i686-pld-linux-gcc -Isrc/nspawn/83b75b8@@nspawn-core@sta -Isrc/nspawn -I../src/nspawn -Isrc/basic -I../src/basic -Isrc/boot -I../src/boot -Isrc/shared -I../src/shared -Isrc/systemd -I../src/systemd -Isrc/journal -I../src/journal -Isrc/journal-remote -I../src/journal-remote -Isrc/resolve -I../src/resolve -Isrc/timesync -I../src/timesync -I../src/time-wait-sync -Isrc/login -I../src/login -Isrc/udev -I../src/udev -Isrc/libudev -I../src/libudev -Isrc/core -I../src/core -Isrc/shutdown -I../src/shutdown -I../src/libsystemd/sd-bus -I../src/libsystemd/sd-device -I../src/libsystemd/sd-event -I../src/libsystemd/sd-hwdb -I../src/libsystemd/sd-id128 -I../src/libsystemd/sd-netlink -I../src/libsystemd/sd-network -I../src/libsystemd/sd-resolve -Isrc/libsystemd-network -I../src/libsystemd-network -I. -I.. -fdiagnostics-color=always -pipe -D_FILE_OFFSET_BITS=64 -std=gnu99 -Wno-unused-parameter -Wno-missing-field-initializers -Wno-unused-result -Wno-format-signedness -Werror=undef -Wlogical-op -Wmissing-include-dirs -Wold-style-definition -Wpointer-arith -Winit-self -Wfloat-equal -Wsuggest-attribute=noreturn -Werror=missing-prototypes -Werror=implicit-function-declaration -Werror=missing-declarations -Werror=return-type -Werror=incompatible-pointer-types -Werror=format=2 -Wstrict-prototypes -Wredundant-decls -Wmissing-noreturn -Wimplicit-fallthrough=5 -Wshadow -Wendif-labels -Wstrict-aliasing=2 -Wwrite-strings -Werror=overflow -Werror=shift-count-overflow -Werror=shift-overflow=2 -Wdate-time -Wnested-externs -Wno-error=nonnull -Wno-maybe-uninitialized -ffast-math -fno-common -fdiagnostics-show-option -fno-strict-aliasing -fvisibility=hidden -fstack-protector -fstack-protector-strong --param=ssp-buffer-size=4 -ffunction-sections -fdata-sections -Werror=shadow -include config.h -O2 -fwrapv -Wformat -Werror=format-security -gdwarf-4 -fno-debug-types-section -fvar-tracking-assignments -g2 -Wp,-D_FORTIFY_SOURCE=2 -fstack-protector-strong --param=ssp-buffer-size=4 -Werror=trampolines -fomit-frame-pointer -march=i686 -fasynchronous-unwind-tables -mtune=pentium4 -gdwarf-4 -fno-debug-types-section -fvar-tracking-assignments -g2 -fPIC -MD -MQ 'src/nspawn/83b75b8@@nspawn-core@sta/nspawn-oci.c.o' -MF 'src/nspawn/83b75b8@@nspawn-core@sta/nspawn-oci.c.o.d' -o 'src/nspawn/83b75b8@@nspawn-core@sta/nspawn-oci.c.o' -c ../src/nspawn/nspawn-oci.c
[611/1881] rm -f src/nspawn/libnspawn-core.a && gcc-ar csrD src/nspawn/libnspawn-core.a 'src/nspawn/83b75b8@@nspawn-core@sta/meson-generated_.._nspawn-gperf.c.o' 'src/nspawn/83b75b8@@nspawn-core@sta/nspawn-cgroup.c.o' 'src/nspawn/83b75b8@@nspawn-core@sta/nspawn-expose-ports.c.o' 'src/nspawn/83b75b8@@nspawn-core@sta/nspawn-mount.c.o' 'src/nspawn/83b75b8@@nspawn-core@sta/nspawn-network.c.o' 'src/nspawn/83b75b8@@nspawn-core@sta/nspawn-oci.c.o' 'src/nspawn/83b75b8@@nspawn-core@sta/nspawn-patch-uid.c.o' 'src/nspawn/83b75b8@@nspawn-core@sta/nspawn-register.c.o' 'src/nspawn/83b75b8@@nspawn-core@sta/nspawn-seccomp.c.o' 'src/nspawn/83b75b8@@nspawn-core@sta/nspawn-settings.c.o' 'src/nspawn/83b75b8@@nspawn-core@sta/nspawn-setuid.c.o' 'src/nspawn/83b75b8@@nspawn-core@sta/nspawn-stub-pid1.c.o'
[612/1881] i686-pld-linux-gcc -Inss_myhostname@sha -I. -I.. -Isrc/basic -I../src/basic -Isrc/boot -I../src/boot -Isrc/shared -I../src/shared -Isrc/systemd -I../src/systemd -Isrc/journal -I../src/journal -Isrc/journal-remote -I../src/journal-remote -Isrc/nspawn -I../src/nspawn -Isrc/resolve -I../src/resolve -Isrc/timesync -I../src/timesync -I../src/time-wait-sync -Isrc/login -I../src/login -Isrc/udev -I../src/udev -Isrc/libudev -I../src/libudev -Isrc/core -I../src/core -Isrc/shutdown -I../src/shutdown -I../src/libsystemd/sd-bus -I../src/libsystemd/sd-device -I../src/libsystemd/sd-event -I../src/libsystemd/sd-hwdb -I../src/libsystemd/sd-id128 -I../src/libsystemd/sd-netlink -I../src/libsystemd/sd-network -I../src/libsystemd/sd-resolve -Isrc/libsystemd-network -I../src/libsystemd-network -fdiagnostics-color=always -pipe -D_FILE_OFFSET_BITS=64 -std=gnu99 -Wno-unused-parameter -Wno-missing-field-initializers -Wno-unused-result -Wno-format-signedness -Werror=undef -Wlogical-op -Wmissing-include-dirs -Wold-style-definition -Wpointer-arith -Winit-self -Wfloat-equal -Wsuggest-attribute=noreturn -Werror=missing-prototypes -Werror=implicit-function-declaration -Werror=missing-declarations -Werror=return-type -Werror=incompatible-pointer-types -Werror=format=2 -Wstrict-prototypes -Wredundant-decls -Wmissing-noreturn -Wimplicit-fallthrough=5 -Wshadow -Wendif-labels -Wstrict-aliasing=2 -Wwrite-strings -Werror=overflow -Werror=shift-count-overflow -Werror=shift-overflow=2 -Wdate-time -Wnested-externs -Wno-error=nonnull -Wno-maybe-uninitialized -ffast-math -fno-common -fdiagnostics-show-option -fno-strict-aliasing -fvisibility=hidden -fstack-protector -fstack-protector-strong --param=ssp-buffer-size=4 -ffunction-sections -fdata-sections -Werror=shadow -include config.h -O2 -fwrapv -Wformat -Werror=format-security -gdwarf-4 -fno-debug-types-section -fvar-tracking-assignments -g2 -Wp,-D_FORTIFY_SOURCE=2 -fstack-protector-strong --param=ssp-buffer-size=4 -Werror=trampolines -fomit-frame-pointer -march=i686 -fasynchronous-unwind-tables -mtune=pentium4 -gdwarf-4 -fno-debug-types-section -fvar-tracking-assignments -g2 -fPIC -pthread -MD -MQ 'nss_myhostname@sha/src_nss-myhostname_nss-myhostname.c.o' -MF 'nss_myhostname@sha/src_nss-myhostname_nss-myhostname.c.o.d' -o 'nss_myhostname@sha/src_nss-myhostname_nss-myhostname.c.o' -c ../src/nss-myhostname/nss-myhostname.c
[613/1881] /usr/bin/meson --internal exe --capture src/test/test-libsystemd-sym.c -- /tmp/B.clK9HG/BUILD/systemd-245/src/test/generate-sym-test.py /tmp/B.clK9HG/BUILD/systemd-245/src/libsystemd/libsystemd.sym ../src/systemd/sd-bus.h ../src/systemd/sd-bus-protocol.h ../src/systemd/sd-bus-vtable.h ../src/systemd/sd-daemon.h ../src/systemd/sd-device.h ../src/systemd/sd-event.h ../src/systemd/sd-hwdb.h ../src/systemd/sd-id128.h ../src/systemd/sd-journal.h ../src/systemd/sd-login.h ../src/systemd/sd-messages.h
[614/1881] i686-pld-linux-gcc -c ../src/boot/efi/boot.c -o src/boot/efi/boot.c.o -Wall -Wextra -std=gnu90 -nostdinc -fpic -fshort-wchar -ffreestanding -fno-strict-aliasing -fno-stack-protector -Wsign-compare -Wno-missing-field-initializers -isystem /usr/include/efi -isystem /usr/include/efi/ia32 -include src/boot/efi/efi_config.h -include version.h -O2
[615/1881] /usr/bin/ld -o src/boot/efi/systemd_boot.so -T /usr/lib/elf_ia32_efi.lds -shared -Bsymbolic -nostdlib -znocombreloc -L /usr/lib /usr/lib/crt0-efi-ia32.o src/boot/efi/disk.c.o src/boot/efi/graphics.c.o src/boot/efi/measure.c.o src/boot/efi/pe.c.o src/boot/efi/util.c.o src/boot/efi/boot.c.o src/boot/efi/console.c.o src/boot/efi/crc32.c.o src/boot/efi/random-seed.c.o src/boot/efi/sha256.c.o src/boot/efi/shim.c.o -lefi -lgnuefi /usr/lib/gcc/i686-pld-linux/10.1.0/libgcc.a
[616/1881] i686-pld-linux-gcc  -o test-dlopen 'test-dlopen@exe/src_test_test-dlopen.c.o' 'test-dlopen@exe/src_libsystemd_disable-mempool.c.o' -Wl,--as-needed -Wl,--no-undefined -Wl,-z,relro -Wl,-z,now -fstack-protector -Wl,--gc-sections -O2 -fwrapv -pipe -Wformat -Werror=format-security -gdwarf-4 -fno-debug-types-section -fvar-tracking-assignments -g2 -Wp,-D_FORTIFY_SOURCE=2 -fstack-protector-strong --param=ssp-buffer-size=4 -Werror=trampolines -fomit-frame-pointer -march=i686 -fasynchronous-unwind-tables -mtune=pentium4 -gdwarf-4 -fno-debug-types-section -fvar-tracking-assignments -g2 -Wl,--as-needed -Wl,--no-copy-dt-needed-entries -Wl,-z,relro -Wl,-z,combreloc -Wl,--start-group src/basic/libbasic.a -ldl -pthread /usr/lib/gcc/i686-pld-linux/10.1.0/../../../libcap.so /usr/lib/libselinux.so -lm -Wl,--end-group '-Wl,-rpath,$ORIGIN/src/basic' -Wl,-rpath-link,/tmp/B.clK9HG/BUILD/systemd-245/build/src/basic
[617/1881] /usr/bin/objcopy -j .text -j .sdata -j .data -j .dynamic -j .dynsym -j '.rel*' --target=efi-app-ia32 src/boot/efi/systemd_boot.so src/boot/efi/systemd-bootia32.efi
[618/1881] /usr/bin/meson --internal exe --capture rules.d/60-autosuspend-chromiumos.rules -- /tmp/B.clK9HG/BUILD/systemd-245/tools/make-autosuspend-rules.py
[619/1881] i686-pld-linux-gcc -Inss_myhostname@sha -I. -I.. -Isrc/basic -I../src/basic -Isrc/boot -I../src/boot -Isrc/shared -I../src/shared -Isrc/systemd -I../src/systemd -Isrc/journal -I../src/journal -Isrc/journal-remote -I../src/journal-remote -Isrc/nspawn -I../src/nspawn -Isrc/resolve -I../src/resolve -Isrc/timesync -I../src/timesync -I../src/time-wait-sync -Isrc/login -I../src/login -Isrc/udev -I../src/udev -Isrc/libudev -I../src/libudev -Isrc/core -I../src/core -Isrc/shutdown -I../src/shutdown -I../src/libsystemd/sd-bus -I../src/libsystemd/sd-device -I../src/libsystemd/sd-event -I../src/libsystemd/sd-hwdb -I../src/libsystemd/sd-id128 -I../src/libsystemd/sd-netlink -I../src/libsystemd/sd-network -I../src/libsystemd/sd-resolve -Isrc/libsystemd-network -I../src/libsystemd-network -fdiagnostics-color=always -pipe -D_FILE_OFFSET_BITS=64 -std=gnu99 -Wno-unused-parameter -Wno-missing-field-initializers -Wno-unused-result -Wno-format-signedness -Werror=undef -Wlogical-op -Wmissing-include-dirs -Wold-style-definition -Wpointer-arith -Winit-self -Wfloat-equal -Wsuggest-attribute=noreturn -Werror=missing-prototypes -Werror=implicit-function-declaration -Werror=missing-declarations -Werror=return-type -Werror=incompatible-pointer-types -Werror=format=2 -Wstrict-prototypes -Wredundant-decls -Wmissing-noreturn -Wimplicit-fallthrough=5 -Wshadow -Wendif-labels -Wstrict-aliasing=2 -Wwrite-strings -Werror=overflow -Werror=shift-count-overflow -Werror=shift-overflow=2 -Wdate-time -Wnested-externs -Wno-error=nonnull -Wno-maybe-uninitialized -ffast-math -fno-common -fdiagnostics-show-option -fno-strict-aliasing -fvisibility=hidden -fstack-protector -fstack-protector-strong --param=ssp-buffer-size=4 -ffunction-sections -fdata-sections -Werror=shadow -include config.h -O2 -fwrapv -Wformat -Werror=format-security -gdwarf-4 -fno-debug-types-section -fvar-tracking-assignments -g2 -Wp,-D_FORTIFY_SOURCE=2 -fstack-protector-strong --param=ssp-buffer-size=4 -Werror=trampolines -fomit-frame-pointer -march=i686 -fasynchronous-unwind-tables -mtune=pentium4 -gdwarf-4 -fno-debug-types-section -fvar-tracking-assignments -g2 -fPIC -pthread -MD -MQ 'nss_myhostname@sha/src_libsystemd_disable-mempool.c.o' -MF 'nss_myhostname@sha/src_libsystemd_disable-mempool.c.o.d' -o 'nss_myhostname@sha/src_libsystemd_disable-mempool.c.o' -c ../src/libsystemd/disable-mempool.c
[620/1881] /usr/bin/meson --internal exe --capture src/test/test-libudev-sym.c -- /tmp/B.clK9HG/BUILD/systemd-245/src/test/generate-sym-test.py /tmp/B.clK9HG/BUILD/systemd-245/src/libudev/libudev.sym /tmp/B.clK9HG/BUILD/systemd-245/src/libudev/libudev.h
[621/1881] i686-pld-linux-gcc -Isystemd-cat@exe -I. -I.. -Isrc/basic -I../src/basic -Isrc/boot -I../src/boot -Isrc/shared -I../src/shared -Isrc/systemd -I../src/systemd -Isrc/journal -I../src/journal -Isrc/journal-remote -I../src/journal-remote -Isrc/nspawn -I../src/nspawn -Isrc/resolve -I../src/resolve -Isrc/timesync -I../src/timesync -I../src/time-wait-sync -Isrc/login -I../src/login -Isrc/udev -I../src/udev -Isrc/libudev -I../src/libudev -Isrc/core -I../src/core -Isrc/shutdown -I../src/shutdown -I../src/libsystemd/sd-bus -I../src/libsystemd/sd-device -I../src/libsystemd/sd-event -I../src/libsystemd/sd-hwdb -I../src/libsystemd/sd-id128 -I../src/libsystemd/sd-netlink -I../src/libsystemd/sd-network -I../src/libsystemd/sd-resolve -Isrc/libsystemd-network -I../src/libsystemd-network -fdiagnostics-color=always -pipe -D_FILE_OFFSET_BITS=64 -std=gnu99 -Wno-unused-parameter -Wno-missing-field-initializers -Wno-unused-result -Wno-format-signedness -Werror=undef -Wlogical-op -Wmissing-include-dirs -Wold-style-definition -Wpointer-arith -Winit-self -Wfloat-equal -Wsuggest-attribute=noreturn -Werror=missing-prototypes -Werror=implicit-function-declaration -Werror=missing-declarations -Werror=return-type -Werror=incompatible-pointer-types -Werror=format=2 -Wstrict-prototypes -Wredundant-decls -Wmissing-noreturn -Wimplicit-fallthrough=5 -Wshadow -Wendif-labels -Wstrict-aliasing=2 -Wwrite-strings -Werror=overflow -Werror=shift-count-overflow -Werror=shift-overflow=2 -Wdate-time -Wnested-externs -Wno-error=nonnull -Wno-maybe-uninitialized -ffast-math -fno-common -fdiagnostics-show-option -fno-strict-aliasing -fvisibility=hidden -fstack-protector -fstack-protector-strong --param=ssp-buffer-size=4 -ffunction-sections -fdata-sections -Werror=shadow -include config.h -O2 -fwrapv -Wformat -Werror=format-security -gdwarf-4 -fno-debug-types-section -fvar-tracking-assignments -g2 -Wp,-D_FORTIFY_SOURCE=2 -fstack-protector-strong --param=ssp-buffer-size=4 -Werror=trampolines -fomit-frame-pointer -march=i686 -fasynchronous-unwind-tables -mtune=pentium4 -gdwarf-4 -fno-debug-types-section -fvar-tracking-assignments -g2 -pthread -MD -MQ 'systemd-cat@exe/src_journal_cat.c.o' -MF 'systemd-cat@exe/src_journal_cat.c.o.d' -o 'systemd-cat@exe/src_journal_cat.c.o' -c ../src/journal/cat.c
[622/1881] i686-pld-linux-gcc -Inss_systemd@sha -I. -I.. -Isrc/basic -I../src/basic -Isrc/boot -I../src/boot -Isrc/shared -I../src/shared -Isrc/systemd -I../src/systemd -Isrc/journal -I../src/journal -Isrc/journal-remote -I../src/journal-remote -Isrc/nspawn -I../src/nspawn -Isrc/resolve -I../src/resolve -Isrc/timesync -I../src/timesync -I../src/time-wait-sync -Isrc/login -I../src/login -Isrc/udev -I../src/udev -Isrc/libudev -I../src/libudev -Isrc/core -I../src/core -Isrc/shutdown -I../src/shutdown -I../src/libsystemd/sd-bus -I../src/libsystemd/sd-device -I../src/libsystemd/sd-event -I../src/libsystemd/sd-hwdb -I../src/libsystemd/sd-id128 -I../src/libsystemd/sd-netlink -I../src/libsystemd/sd-network -I../src/libsystemd/sd-resolve -Isrc/libsystemd-network -I../src/libsystemd-network -fdiagnostics-color=always -pipe -D_FILE_OFFSET_BITS=64 -std=gnu99 -Wno-unused-parameter -Wno-missing-field-initializers -Wno-unused-result -Wno-format-signedness -Werror=undef -Wlogical-op -Wmissing-include-dirs -Wold-style-definition -Wpointer-arith -Winit-self -Wfloat-equal -Wsuggest-attribute=noreturn -Werror=missing-prototypes -Werror=implicit-function-declaration -Werror=missing-declarations -Werror=return-type -Werror=incompatible-pointer-types -Werror=format=2 -Wstrict-prototypes -Wredundant-decls -Wmissing-noreturn -Wimplicit-fallthrough=5 -Wshadow -Wendif-labels -Wstrict-aliasing=2 -Wwrite-strings -Werror=overflow -Werror=shift-count-overflow -Werror=shift-overflow=2 -Wdate-time -Wnested-externs -Wno-error=nonnull -Wno-maybe-uninitialized -ffast-math -fno-common -fdiagnostics-show-option -fno-strict-aliasing -fvisibility=hidden -fstack-protector -fstack-protector-strong --param=ssp-buffer-size=4 -ffunction-sections -fdata-sections -Werror=shadow -include config.h -O2 -fwrapv -Wformat -Werror=format-security -gdwarf-4 -fno-debug-types-section -fvar-tracking-assignments -g2 -Wp,-D_FORTIFY_SOURCE=2 -fstack-protector-strong --param=ssp-buffer-size=4 -Werror=trampolines -fomit-frame-pointer -march=i686 -fasynchronous-unwind-tables -mtune=pentium4 -gdwarf-4 -fno-debug-types-section -fvar-tracking-assignments -g2 -fPIC -pthread -MD -MQ 'nss_systemd@sha/src_libsystemd_disable-mempool.c.o' -MF 'nss_systemd@sha/src_libsystemd_disable-mempool.c.o.d' -o 'nss_systemd@sha/src_libsystemd_disable-mempool.c.o' -c ../src/libsystemd/disable-mempool.c
[623/1881] /usr/bin/meson --internal exe --capture src/resolve/dns_type-from-name.gperf -- /tmp/B.clK9HG/BUILD/systemd-245/src/resolve/generate-dns_type-gperf.py dns_type DNS_TYPE_ src/resolve/dns_type-list.txt
[624/1881] i686-pld-linux-gcc -Isystemd-analyze@exe -I. -I.. -Isrc/basic -I../src/basic -Isrc/boot -I../src/boot -Isrc/shared -I../src/shared -Isrc/systemd -I../src/systemd -Isrc/journal -I../src/journal -Isrc/journal-remote -I../src/journal-remote -Isrc/nspawn -I../src/nspawn -Isrc/resolve -I../src/resolve -Isrc/timesync -I../src/timesync -I../src/time-wait-sync -Isrc/login -I../src/login -Isrc/udev -I../src/udev -Isrc/libudev -I../src/libudev -Isrc/core -I../src/core -Isrc/shutdown -I../src/shutdown -I../src/libsystemd/sd-bus -I../src/libsystemd/sd-device -I../src/libsystemd/sd-event -I../src/libsystemd/sd-hwdb -I../src/libsystemd/sd-id128 -I../src/libsystemd/sd-netlink -I../src/libsystemd/sd-network -I../src/libsystemd/sd-resolve -Isrc/libsystemd-network -I../src/libsystemd-network -I/usr/include/libmount -I/usr/include/blkid -fdiagnostics-color=always -pipe -D_FILE_OFFSET_BITS=64 -std=gnu99 -Wno-unused-parameter -Wno-missing-field-initializers -Wno-unused-result -Wno-format-signedness -Werror=undef -Wlogical-op -Wmissing-include-dirs -Wold-style-definition -Wpointer-arith -Winit-self -Wfloat-equal -Wsuggest-attribute=noreturn -Werror=missing-prototypes -Werror=implicit-function-declaration -Werror=missing-declarations -Werror=return-type -Werror=incompatible-pointer-types -Werror=format=2 -Wstrict-prototypes -Wredundant-decls -Wmissing-noreturn -Wimplicit-fallthrough=5 -Wshadow -Wendif-labels -Wstrict-aliasing=2 -Wwrite-strings -Werror=overflow -Werror=shift-count-overflow -Werror=shift-overflow=2 -Wdate-time -Wnested-externs -Wno-error=nonnull -Wno-maybe-uninitialized -ffast-math -fno-common -fdiagnostics-show-option -fno-strict-aliasing -fvisibility=hidden -fstack-protector -fstack-protector-strong --param=ssp-buffer-size=4 -ffunction-sections -fdata-sections -Werror=shadow -include config.h -O2 -fwrapv -Wformat -Werror=format-security -gdwarf-4 -fno-debug-types-section -fvar-tracking-assignments -g2 -Wp,-D_FORTIFY_SOURCE=2 -fstack-protector-strong --param=ssp-buffer-size=4 -Werror=trampolines -fomit-frame-pointer -march=i686 -fasynchronous-unwind-tables -mtune=pentium4 -gdwarf-4 -fno-debug-types-section -fvar-tracking-assignments -g2 -pthread -MD -MQ 'systemd-analyze@exe/src_analyze_analyze-verify.c.o' -MF 'systemd-analyze@exe/src_analyze_analyze-verify.c.o.d' -o 'systemd-analyze@exe/src_analyze_analyze-verify.c.o' -c ../src/analyze/analyze-verify.c
[625/1881] i686-pld-linux-gcc -Inss_systemd@sha -I. -I.. -Isrc/basic -I../src/basic -Isrc/boot -I../src/boot -Isrc/shared -I../src/shared -Isrc/systemd -I../src/systemd -Isrc/journal -I../src/journal -Isrc/journal-remote -I../src/journal-remote -Isrc/nspawn -I../src/nspawn -Isrc/resolve -I../src/resolve -Isrc/timesync -I../src/timesync -I../src/time-wait-sync -Isrc/login -I../src/login -Isrc/udev -I../src/udev -Isrc/libudev -I../src/libudev -Isrc/core -I../src/core -Isrc/shutdown -I../src/shutdown -I../src/libsystemd/sd-bus -I../src/libsystemd/sd-device -I../src/libsystemd/sd-event -I../src/libsystemd/sd-hwdb -I../src/libsystemd/sd-id128 -I../src/libsystemd/sd-netlink -I../src/libsystemd/sd-network -I../src/libsystemd/sd-resolve -Isrc/libsystemd-network -I../src/libsystemd-network -fdiagnostics-color=always -pipe -D_FILE_OFFSET_BITS=64 -std=gnu99 -Wno-unused-parameter -Wno-missing-field-initializers -Wno-unused-result -Wno-format-signedness -Werror=undef -Wlogical-op -Wmissing-include-dirs -Wold-style-definition -Wpointer-arith -Winit-self -Wfloat-equal -Wsuggest-attribute=noreturn -Werror=missing-prototypes -Werror=implicit-function-declaration -Werror=missing-declarations -Werror=return-type -Werror=incompatible-pointer-types -Werror=format=2 -Wstrict-prototypes -Wredundant-decls -Wmissing-noreturn -Wimplicit-fallthrough=5 -Wshadow -Wendif-labels -Wstrict-aliasing=2 -Wwrite-strings -Werror=overflow -Werror=shift-count-overflow -Werror=shift-overflow=2 -Wdate-time -Wnested-externs -Wno-error=nonnull -Wno-maybe-uninitialized -ffast-math -fno-common -fdiagnostics-show-option -fno-strict-aliasing -fvisibility=hidden -fstack-protector -fstack-protector-strong --param=ssp-buffer-size=4 -ffunction-sections -fdata-sections -Werror=shadow -include config.h -O2 -fwrapv -Wformat -Werror=format-security -gdwarf-4 -fno-debug-types-section -fvar-tracking-assignments -g2 -Wp,-D_FORTIFY_SOURCE=2 -fstack-protector-strong --param=ssp-buffer-size=4 -Werror=trampolines -fomit-frame-pointer -march=i686 -fasynchronous-unwind-tables -mtune=pentium4 -gdwarf-4 -fno-debug-types-section -fvar-tracking-assignments -g2 -fPIC -pthread -MD -MQ 'nss_systemd@sha/src_nss-systemd_userdb-glue.c.o' -MF 'nss_systemd@sha/src_nss-systemd_userdb-glue.c.o.d' -o 'nss_systemd@sha/src_nss-systemd_userdb-glue.c.o' -c ../src/nss-systemd/userdb-glue.c
[626/1881] /tmp/B.clK9HG/BUILD/systemd-245/test/sys-script.py /tmp/B.clK9HG/BUILD/systemd-245/build/test
[627/1881] i686-pld-linux-gcc -Inss_resolve@sha -I. -I.. -Isrc/basic -I../src/basic -Isrc/boot -I../src/boot -Isrc/shared -I../src/shared -Isrc/systemd -I../src/systemd -Isrc/journal -I../src/journal -Isrc/journal-remote -I../src/journal-remote -Isrc/nspawn -I../src/nspawn -Isrc/resolve -I../src/resolve -Isrc/timesync -I../src/timesync -I../src/time-wait-sync -Isrc/login -I../src/login -Isrc/udev -I../src/udev -Isrc/libudev -I../src/libudev -Isrc/core -I../src/core -Isrc/shutdown -I../src/shutdown -I../src/libsystemd/sd-bus -I../src/libsystemd/sd-device -I../src/libsystemd/sd-event -I../src/libsystemd/sd-hwdb -I../src/libsystemd/sd-id128 -I../src/libsystemd/sd-netlink -I../src/libsystemd/sd-network -I../src/libsystemd/sd-resolve -Isrc/libsystemd-network -I../src/libsystemd-network -fdiagnostics-color=always -pipe -D_FILE_OFFSET_BITS=64 -std=gnu99 -Wno-unused-parameter -Wno-missing-field-initializers -Wno-unused-result -Wno-format-signedness -Werror=undef -Wlogical-op -Wmissing-include-dirs -Wold-style-definition -Wpointer-arith -Winit-self -Wfloat-equal -Wsuggest-attribute=noreturn -Werror=missing-prototypes -Werror=implicit-function-declaration -Werror=missing-declarations -Werror=return-type -Werror=incompatible-pointer-types -Werror=format=2 -Wstrict-prototypes -Wredundant-decls -Wmissing-noreturn -Wimplicit-fallthrough=5 -Wshadow -Wendif-labels -Wstrict-aliasing=2 -Wwrite-strings -Werror=overflow -Werror=shift-count-overflow -Werror=shift-overflow=2 -Wdate-time -Wnested-externs -Wno-error=nonnull -Wno-maybe-uninitialized -ffast-math -fno-common -fdiagnostics-show-option -fno-strict-aliasing -fvisibility=hidden -fstack-protector -fstack-protector-strong --param=ssp-buffer-size=4 -ffunction-sections -fdata-sections -Werror=shadow -include config.h -O2 -fwrapv -Wformat -Werror=format-security -gdwarf-4 -fno-debug-types-section -fvar-tracking-assignments -g2 -Wp,-D_FORTIFY_SOURCE=2 -fstack-protector-strong --param=ssp-buffer-size=4 -Werror=trampolines -fomit-frame-pointer -march=i686 -fasynchronous-unwind-tables -mtune=pentium4 -gdwarf-4 -fno-debug-types-section -fvar-tracking-assignments -g2 -fPIC -pthread -MD -MQ 'nss_resolve@sha/src_libsystemd_disable-mempool.c.o' -MF 'nss_resolve@sha/src_libsystemd_disable-mempool.c.o.d' -o 'nss_resolve@sha/src_libsystemd_disable-mempool.c.o' -c ../src/libsystemd/disable-mempool.c
[628/1881] i686-pld-linux-gcc -Inss_mymachines@sha -I. -I.. -Isrc/basic -I../src/basic -Isrc/boot -I../src/boot -Isrc/shared -I../src/shared -Isrc/systemd -I../src/systemd -Isrc/journal -I../src/journal -Isrc/journal-remote -I../src/journal-remote -Isrc/nspawn -I../src/nspawn -Isrc/resolve -I../src/resolve -Isrc/timesync -I../src/timesync -I../src/time-wait-sync -Isrc/login -I../src/login -Isrc/udev -I../src/udev -Isrc/libudev -I../src/libudev -Isrc/core -I../src/core -Isrc/shutdown -I../src/shutdown -I../src/libsystemd/sd-bus -I../src/libsystemd/sd-device -I../src/libsystemd/sd-event -I../src/libsystemd/sd-hwdb -I../src/libsystemd/sd-id128 -I../src/libsystemd/sd-netlink -I../src/libsystemd/sd-network -I../src/libsystemd/sd-resolve -Isrc/libsystemd-network -I../src/libsystemd-network -fdiagnostics-color=always -pipe -D_FILE_OFFSET_BITS=64 -std=gnu99 -Wno-unused-parameter -Wno-missing-field-initializers -Wno-unused-result -Wno-format-signedness -Werror=undef -Wlogical-op -Wmissing-include-dirs -Wold-style-definition -Wpointer-arith -Winit-self -Wfloat-equal -Wsuggest-attribute=noreturn -Werror=missing-prototypes -Werror=implicit-function-declaration -Werror=missing-declarations -Werror=return-type -Werror=incompatible-pointer-types -Werror=format=2 -Wstrict-prototypes -Wredundant-decls -Wmissing-noreturn -Wimplicit-fallthrough=5 -Wshadow -Wendif-labels -Wstrict-aliasing=2 -Wwrite-strings -Werror=overflow -Werror=shift-count-overflow -Werror=shift-overflow=2 -Wdate-time -Wnested-externs -Wno-error=nonnull -Wno-maybe-uninitialized -ffast-math -fno-common -fdiagnostics-show-option -fno-strict-aliasing -fvisibility=hidden -fstack-protector -fstack-protector-strong --param=ssp-buffer-size=4 -ffunction-sections -fdata-sections -Werror=shadow -include config.h -O2 -fwrapv -Wformat -Werror=format-security -gdwarf-4 -fno-debug-types-section -fvar-tracking-assignments -g2 -Wp,-D_FORTIFY_SOURCE=2 -fstack-protector-strong --param=ssp-buffer-size=4 -Werror=trampolines -fomit-frame-pointer -march=i686 -fasynchronous-unwind-tables -mtune=pentium4 -gdwarf-4 -fno-debug-types-section -fvar-tracking-assignments -g2 -fPIC -pthread -MD -MQ 'nss_mymachines@sha/src_libsystemd_disable-mempool.c.o' -MF 'nss_mymachines@sha/src_libsystemd_disable-mempool.c.o.d' -o 'nss_mymachines@sha/src_libsystemd_disable-mempool.c.o' -c ../src/libsystemd/disable-mempool.c
[629/1881] i686-pld-linux-gcc  -o libnss_myhostname.so.2 'nss_myhostname@sha/src_nss-myhostname_nss-myhostname.c.o' 'nss_myhostname@sha/src_libsystemd_disable-mempool.c.o' -Wl,--as-needed -Wl,--no-undefined -shared -fPIC -Wl,--start-group -Wl,-soname,libnss_myhostname.so.2 -Wl,-z,relro -Wl,-z,now -fstack-protector -Wl,--gc-sections -O2 -fwrapv -pipe -Wformat -Werror=format-security -gdwarf-4 -fno-debug-types-section -fvar-tracking-assignments -g2 -Wp,-D_FORTIFY_SOURCE=2 -fstack-protector-strong --param=ssp-buffer-size=4 -Werror=trampolines -fomit-frame-pointer -march=i686 -fasynchronous-unwind-tables -mtune=pentium4 -gdwarf-4 -fno-debug-types-section -fvar-tracking-assignments -g2 -Wl,--as-needed -Wl,--no-copy-dt-needed-entries -Wl,-z,relro -Wl,-z,combreloc src/libsystemd/libsystemd_static.a src/basic/libbasic.a src/shared/libsystemd-shared-245.a -Wl,-z,nodelete -shared -Wl,--version-script=/tmp/B.clK9HG/BUILD/systemd-245/src/nss-myhostname/nss-myhostname.sym -pthread -lrt /usr/lib/gcc/i686-pld-linux/10.1.0/../../../libcap.so /usr/lib/libselinux.so -lm -lacl /usr/lib/libblkid.so -lcrypt /usr/lib/libcryptsetup.so -lgcrypt /usr/lib/libidn2.so /usr/lib/libip4tc.so /usr/lib/libip6tc.so /usr/lib/libkmod.so /usr/lib/liblz4.so /usr/lib/libmount.so /usr/lib/libssl.so /usr/lib/libcrypto.so /usr/lib/libp11-kit.so -lpam /usr/lib/libseccomp.so /usr/lib/liblzma.so -Wl,--end-group '-Wl,-rpath,$ORIGIN/src/libsystemd:$ORIGIN/src/basic:$ORIGIN/src/shared' -Wl,-rpath-link,/tmp/B.clK9HG/BUILD/systemd-245/build/src/libsystemd -Wl,-rpath-link,/tmp/B.clK9HG/BUILD/systemd-245/build/src/basic -Wl,-rpath-link,/tmp/B.clK9HG/BUILD/systemd-245/build/src/shared
[630/1881] /usr/bin/meson --internal exe --capture src/resolve/dns_type-to-name.h -- /bin/awk -f ../src/resolve/dns_type-to-name.awk src/resolve/dns_type-list.txt
[631/1881] i686-pld-linux-gcc -Inss_systemd@sha -I. -I.. -Isrc/basic -I../src/basic -Isrc/boot -I../src/boot -Isrc/shared -I../src/shared -Isrc/systemd -I../src/systemd -Isrc/journal -I../src/journal -Isrc/journal-remote -I../src/journal-remote -Isrc/nspawn -I../src/nspawn -Isrc/resolve -I../src/resolve -Isrc/timesync -I../src/timesync -I../src/time-wait-sync -Isrc/login -I../src/login -Isrc/udev -I../src/udev -Isrc/libudev -I../src/libudev -Isrc/core -I../src/core -Isrc/shutdown -I../src/shutdown -I../src/libsystemd/sd-bus -I../src/libsystemd/sd-device -I../src/libsystemd/sd-event -I../src/libsystemd/sd-hwdb -I../src/libsystemd/sd-id128 -I../src/libsystemd/sd-netlink -I../src/libsystemd/sd-network -I../src/libsystemd/sd-resolve -Isrc/libsystemd-network -I../src/libsystemd-network -fdiagnostics-color=always -pipe -D_FILE_OFFSET_BITS=64 -std=gnu99 -Wno-unused-parameter -Wno-missing-field-initializers -Wno-unused-result -Wno-format-signedness -Werror=undef -Wlogical-op -Wmissing-include-dirs -Wold-style-definition -Wpointer-arith -Winit-self -Wfloat-equal -Wsuggest-attribute=noreturn -Werror=missing-prototypes -Werror=implicit-function-declaration -Werror=missing-declarations -Werror=return-type -Werror=incompatible-pointer-types -Werror=format=2 -Wstrict-prototypes -Wredundant-decls -Wmissing-noreturn -Wimplicit-fallthrough=5 -Wshadow -Wendif-labels -Wstrict-aliasing=2 -Wwrite-strings -Werror=overflow -Werror=shift-count-overflow -Werror=shift-overflow=2 -Wdate-time -Wnested-externs -Wno-error=nonnull -Wno-maybe-uninitialized -ffast-math -fno-common -fdiagnostics-show-option -fno-strict-aliasing -fvisibility=hidden -fstack-protector -fstack-protector-strong --param=ssp-buffer-size=4 -ffunction-sections -fdata-sections -Werror=shadow -include config.h -O2 -fwrapv -Wformat -Werror=format-security -gdwarf-4 -fno-debug-types-section -fvar-tracking-assignments -g2 -Wp,-D_FORTIFY_SOURCE=2 -fstack-protector-strong --param=ssp-buffer-size=4 -Werror=trampolines -fomit-frame-pointer -march=i686 -fasynchronous-unwind-tables -mtune=pentium4 -gdwarf-4 -fno-debug-types-section -fvar-tracking-assignments -g2 -fPIC -pthread -MD -MQ 'nss_systemd@sha/src_nss-systemd_nss-systemd.c.o' -MF 'nss_systemd@sha/src_nss-systemd_nss-systemd.c.o.d' -o 'nss_systemd@sha/src_nss-systemd_nss-systemd.c.o' -c ../src/nss-systemd/nss-systemd.c
[632/1881] i686-pld-linux-gcc -Isystemd-analyze@exe -I. -I.. -Isrc/basic -I../src/basic -Isrc/boot -I../src/boot -Isrc/shared -I../src/shared -Isrc/systemd -I../src/systemd -Isrc/journal -I../src/journal -Isrc/journal-remote -I../src/journal-remote -Isrc/nspawn -I../src/nspawn -Isrc/resolve -I../src/resolve -Isrc/timesync -I../src/timesync -I../src/time-wait-sync -Isrc/login -I../src/login -Isrc/udev -I../src/udev -Isrc/libudev -I../src/libudev -Isrc/core -I../src/core -Isrc/shutdown -I../src/shutdown -I../src/libsystemd/sd-bus -I../src/libsystemd/sd-device -I../src/libsystemd/sd-event -I../src/libsystemd/sd-hwdb -I../src/libsystemd/sd-id128 -I../src/libsystemd/sd-netlink -I../src/libsystemd/sd-network -I../src/libsystemd/sd-resolve -Isrc/libsystemd-network -I../src/libsystemd-network -I/usr/include/libmount -I/usr/include/blkid -fdiagnostics-color=always -pipe -D_FILE_OFFSET_BITS=64 -std=gnu99 -Wno-unused-parameter -Wno-missing-field-initializers -Wno-unused-result -Wno-format-signedness -Werror=undef -Wlogical-op -Wmissing-include-dirs -Wold-style-definition -Wpointer-arith -Winit-self -Wfloat-equal -Wsuggest-attribute=noreturn -Werror=missing-prototypes -Werror=implicit-function-declaration -Werror=missing-declarations -Werror=return-type -Werror=incompatible-pointer-types -Werror=format=2 -Wstrict-prototypes -Wredundant-decls -Wmissing-noreturn -Wimplicit-fallthrough=5 -Wshadow -Wendif-labels -Wstrict-aliasing=2 -Wwrite-strings -Werror=overflow -Werror=shift-count-overflow -Werror=shift-overflow=2 -Wdate-time -Wnested-externs -Wno-error=nonnull -Wno-maybe-uninitialized -ffast-math -fno-common -fdiagnostics-show-option -fno-strict-aliasing -fvisibility=hidden -fstack-protector -fstack-protector-strong --param=ssp-buffer-size=4 -ffunction-sections -fdata-sections -Werror=shadow -include config.h -O2 -fwrapv -Wformat -Werror=format-security -gdwarf-4 -fno-debug-types-section -fvar-tracking-assignments -g2 -Wp,-D_FORTIFY_SOURCE=2 -fstack-protector-strong --param=ssp-buffer-size=4 -Werror=trampolines -fomit-frame-pointer -march=i686 -fasynchronous-unwind-tables -mtune=pentium4 -gdwarf-4 -fno-debug-types-section -fvar-tracking-assignments -g2 -pthread -MD -MQ 'systemd-analyze@exe/src_analyze_analyze-condition.c.o' -MF 'systemd-analyze@exe/src_analyze_analyze-condition.c.o.d' -o 'systemd-analyze@exe/src_analyze_analyze-condition.c.o' -c ../src/analyze/analyze-condition.c
[633/1881] i686-pld-linux-gcc -Isystemd-journald@exe -I. -I.. -Isrc/basic -I../src/basic -Isrc/boot -I../src/boot -Isrc/shared -I../src/shared -Isrc/systemd -I../src/systemd -Isrc/journal -I../src/journal -Isrc/journal-remote -I../src/journal-remote -Isrc/nspawn -I../src/nspawn -Isrc/resolve -I../src/resolve -Isrc/timesync -I../src/timesync -I../src/time-wait-sync -Isrc/login -I../src/login -Isrc/udev -I../src/udev -Isrc/libudev -I../src/libudev -Isrc/core -I../src/core -Isrc/shutdown -I../src/shutdown -I../src/libsystemd/sd-bus -I../src/libsystemd/sd-device -I../src/libsystemd/sd-event -I../src/libsystemd/sd-hwdb -I../src/libsystemd/sd-id128 -I../src/libsystemd/sd-netlink -I../src/libsystemd/sd-network -I../src/libsystemd/sd-resolve -Isrc/libsystemd-network -I../src/libsystemd-network -fdiagnostics-color=always -pipe -D_FILE_OFFSET_BITS=64 -std=gnu99 -Wno-unused-parameter -Wno-missing-field-initializers -Wno-unused-result -Wno-format-signedness -Werror=undef -Wlogical-op -Wmissing-include-dirs -Wold-style-definition -Wpointer-arith -Winit-self -Wfloat-equal -Wsuggest-attribute=noreturn -Werror=missing-prototypes -Werror=implicit-function-declaration -Werror=missing-declarations -Werror=return-type -Werror=incompatible-pointer-types -Werror=format=2 -Wstrict-prototypes -Wredundant-decls -Wmissing-noreturn -Wimplicit-fallthrough=5 -Wshadow -Wendif-labels -Wstrict-aliasing=2 -Wwrite-strings -Werror=overflow -Werror=shift-count-overflow -Werror=shift-overflow=2 -Wdate-time -Wnested-externs -Wno-error=nonnull -Wno-maybe-uninitialized -ffast-math -fno-common -fdiagnostics-show-option -fno-strict-aliasing -fvisibility=hidden -fstack-protector -fstack-protector-strong --param=ssp-buffer-size=4 -ffunction-sections -fdata-sections -Werror=shadow -include config.h -O2 -fwrapv -Wformat -Werror=format-security -gdwarf-4 -fno-debug-types-section -fvar-tracking-assignments -g2 -Wp,-D_FORTIFY_SOURCE=2 -fstack-protector-strong --param=ssp-buffer-size=4 -Werror=trampolines -fomit-frame-pointer -march=i686 -fasynchronous-unwind-tables -mtune=pentium4 -gdwarf-4 -fno-debug-types-section -fvar-tracking-assignments -g2 -pthread -MD -MQ 'systemd-journald@exe/src_journal_journald.c.o' -MF 'systemd-journald@exe/src_journal_journald.c.o.d' -o 'systemd-journald@exe/src_journal_journald.c.o' -c ../src/journal/journald.c
[634/1881] i686-pld-linux-gcc -Inss_mymachines@sha -I. -I.. -Isrc/basic -I../src/basic -Isrc/boot -I../src/boot -Isrc/shared -I../src/shared -Isrc/systemd -I../src/systemd -Isrc/journal -I../src/journal -Isrc/journal-remote -I../src/journal-remote -Isrc/nspawn -I../src/nspawn -Isrc/resolve -I../src/resolve -Isrc/timesync -I../src/timesync -I../src/time-wait-sync -Isrc/login -I../src/login -Isrc/udev -I../src/udev -Isrc/libudev -I../src/libudev -Isrc/core -I../src/core -Isrc/shutdown -I../src/shutdown -I../src/libsystemd/sd-bus -I../src/libsystemd/sd-device -I../src/libsystemd/sd-event -I../src/libsystemd/sd-hwdb -I../src/libsystemd/sd-id128 -I../src/libsystemd/sd-netlink -I../src/libsystemd/sd-network -I../src/libsystemd/sd-resolve -Isrc/libsystemd-network -I../src/libsystemd-network -fdiagnostics-color=always -pipe -D_FILE_OFFSET_BITS=64 -std=gnu99 -Wno-unused-parameter -Wno-missing-field-initializers -Wno-unused-result -Wno-format-signedness -Werror=undef -Wlogical-op -Wmissing-include-dirs -Wold-style-definition -Wpointer-arith -Winit-self -Wfloat-equal -Wsuggest-attribute=noreturn -Werror=missing-prototypes -Werror=implicit-function-declaration -Werror=missing-declarations -Werror=return-type -Werror=incompatible-pointer-types -Werror=format=2 -Wstrict-prototypes -Wredundant-decls -Wmissing-noreturn -Wimplicit-fallthrough=5 -Wshadow -Wendif-labels -Wstrict-aliasing=2 -Wwrite-strings -Werror=overflow -Werror=shift-count-overflow -Werror=shift-overflow=2 -Wdate-time -Wnested-externs -Wno-error=nonnull -Wno-maybe-uninitialized -ffast-math -fno-common -fdiagnostics-show-option -fno-strict-aliasing -fvisibility=hidden -fstack-protector -fstack-protector-strong --param=ssp-buffer-size=4 -ffunction-sections -fdata-sections -Werror=shadow -include config.h -O2 -fwrapv -Wformat -Werror=format-security -gdwarf-4 -fno-debug-types-section -fvar-tracking-assignments -g2 -Wp,-D_FORTIFY_SOURCE=2 -fstack-protector-strong --param=ssp-buffer-size=4 -Werror=trampolines -fomit-frame-pointer -march=i686 -fasynchronous-unwind-tables -mtune=pentium4 -gdwarf-4 -fno-debug-types-section -fvar-tracking-assignments -g2 -fPIC -pthread -MD -MQ 'nss_mymachines@sha/src_nss-mymachines_nss-mymachines.c.o' -MF 'nss_mymachines@sha/src_nss-mymachines_nss-mymachines.c.o.d' -o 'nss_mymachines@sha/src_nss-mymachines_nss-mymachines.c.o' -c ../src/nss-mymachines/nss-mymachines.c
[635/1881] i686-pld-linux-gcc -Inss_resolve@sha -I. -I.. -Isrc/basic -I../src/basic -Isrc/boot -I../src/boot -Isrc/shared -I../src/shared -Isrc/systemd -I../src/systemd -Isrc/journal -I../src/journal -Isrc/journal-remote -I../src/journal-remote -Isrc/nspawn -I../src/nspawn -Isrc/resolve -I../src/resolve -Isrc/timesync -I../src/timesync -I../src/time-wait-sync -Isrc/login -I../src/login -Isrc/udev -I../src/udev -Isrc/libudev -I../src/libudev -Isrc/core -I../src/core -Isrc/shutdown -I../src/shutdown -I../src/libsystemd/sd-bus -I../src/libsystemd/sd-device -I../src/libsystemd/sd-event -I../src/libsystemd/sd-hwdb -I../src/libsystemd/sd-id128 -I../src/libsystemd/sd-netlink -I../src/libsystemd/sd-network -I../src/libsystemd/sd-resolve -Isrc/libsystemd-network -I../src/libsystemd-network -fdiagnostics-color=always -pipe -D_FILE_OFFSET_BITS=64 -std=gnu99 -Wno-unused-parameter -Wno-missing-field-initializers -Wno-unused-result -Wno-format-signedness -Werror=undef -Wlogical-op -Wmissing-include-dirs -Wold-style-definition -Wpointer-arith -Winit-self -Wfloat-equal -Wsuggest-attribute=noreturn -Werror=missing-prototypes -Werror=implicit-function-declaration -Werror=missing-declarations -Werror=return-type -Werror=incompatible-pointer-types -Werror=format=2 -Wstrict-prototypes -Wredundant-decls -Wmissing-noreturn -Wimplicit-fallthrough=5 -Wshadow -Wendif-labels -Wstrict-aliasing=2 -Wwrite-strings -Werror=overflow -Werror=shift-count-overflow -Werror=shift-overflow=2 -Wdate-time -Wnested-externs -Wno-error=nonnull -Wno-maybe-uninitialized -ffast-math -fno-common -fdiagnostics-show-option -fno-strict-aliasing -fvisibility=hidden -fstack-protector -fstack-protector-strong --param=ssp-buffer-size=4 -ffunction-sections -fdata-sections -Werror=shadow -include config.h -O2 -fwrapv -Wformat -Werror=format-security -gdwarf-4 -fno-debug-types-section -fvar-tracking-assignments -g2 -Wp,-D_FORTIFY_SOURCE=2 -fstack-protector-strong --param=ssp-buffer-size=4 -Werror=trampolines -fomit-frame-pointer -march=i686 -fasynchronous-unwind-tables -mtune=pentium4 -gdwarf-4 -fno-debug-types-section -fvar-tracking-assignments -g2 -fPIC -pthread -MD -MQ 'nss_resolve@sha/src_nss-resolve_nss-resolve.c.o' -MF 'nss_resolve@sha/src_nss-resolve_nss-resolve.c.o.d' -o 'nss_resolve@sha/src_nss-resolve_nss-resolve.c.o' -c ../src/nss-resolve/nss-resolve.c
[636/1881] i686-pld-linux-gcc  -o systemd-journald 'systemd-journald@exe/src_journal_journald.c.o' -Wl,--as-needed -Wl,--no-undefined -Wl,-z,relro -Wl,-z,now -fstack-protector -Wl,--gc-sections -O2 -fwrapv -pipe -Wformat -Werror=format-security -gdwarf-4 -fno-debug-types-section -fvar-tracking-assignments -g2 -Wp,-D_FORTIFY_SOURCE=2 -fstack-protector-strong --param=ssp-buffer-size=4 -Werror=trampolines -fomit-frame-pointer -march=i686 -fasynchronous-unwind-tables -mtune=pentium4 -gdwarf-4 -fno-debug-types-section -fvar-tracking-assignments -g2 -Wl,--as-needed -Wl,--no-copy-dt-needed-entries -Wl,-z,relro -Wl,-z,combreloc -Wl,--start-group libjournal-core.a src/shared/libsystemd-shared-245.so -pthread /usr/lib/liblzma.so /usr/lib/liblz4.so /usr/lib/libselinux.so -Wl,--end-group '-Wl,-rpath,$ORIGIN/:$ORIGIN/src/shared' -Wl,-rpath-link,/tmp/B.clK9HG/BUILD/systemd-245/build/ -Wl,-rpath-link,/tmp/B.clK9HG/BUILD/systemd-245/build/src/shared
[637/1881] i686-pld-linux-gcc -Ijournalctl@exe -I. -I.. -Isrc/basic -I../src/basic -Isrc/boot -I../src/boot -Isrc/shared -I../src/shared -Isrc/systemd -I../src/systemd -Isrc/journal -I../src/journal -Isrc/journal-remote -I../src/journal-remote -Isrc/nspawn -I../src/nspawn -Isrc/resolve -I../src/resolve -Isrc/timesync -I../src/timesync -I../src/time-wait-sync -Isrc/login -I../src/login -Isrc/udev -I../src/udev -Isrc/libudev -I../src/libudev -Isrc/core -I../src/core -Isrc/shutdown -I../src/shutdown -I../src/libsystemd/sd-bus -I../src/libsystemd/sd-device -I../src/libsystemd/sd-event -I../src/libsystemd/sd-hwdb -I../src/libsystemd/sd-id128 -I../src/libsystemd/sd-netlink -I../src/libsystemd/sd-network -I../src/libsystemd/sd-resolve -Isrc/libsystemd-network -I../src/libsystemd-network -fdiagnostics-color=always -pipe -D_FILE_OFFSET_BITS=64 -std=gnu99 -Wno-unused-parameter -Wno-missing-field-initializers -Wno-unused-result -Wno-format-signedness -Werror=undef -Wlogical-op -Wmissing-include-dirs -Wold-style-definition -Wpointer-arith -Winit-self -Wfloat-equal -Wsuggest-attribute=noreturn -Werror=missing-prototypes -Werror=implicit-function-declaration -Werror=missing-declarations -Werror=return-type -Werror=incompatible-pointer-types -Werror=format=2 -Wstrict-prototypes -Wredundant-decls -Wmissing-noreturn -Wimplicit-fallthrough=5 -Wshadow -Wendif-labels -Wstrict-aliasing=2 -Wwrite-strings -Werror=overflow -Werror=shift-count-overflow -Werror=shift-overflow=2 -Wdate-time -Wnested-externs -Wno-error=nonnull -Wno-maybe-uninitialized -ffast-math -fno-common -fdiagnostics-show-option -fno-strict-aliasing -fvisibility=hidden -fstack-protector -fstack-protector-strong --param=ssp-buffer-size=4 -ffunction-sections -fdata-sections -Werror=shadow -include config.h -O2 -fwrapv -Wformat -Werror=format-security -gdwarf-4 -fno-debug-types-section -fvar-tracking-assignments -g2 -Wp,-D_FORTIFY_SOURCE=2 -fstack-protector-strong --param=ssp-buffer-size=4 -Werror=trampolines -fomit-frame-pointer -march=i686 -fasynchronous-unwind-tables -mtune=pentium4 -gdwarf-4 -fno-debug-types-section -fvar-tracking-assignments -g2 -pthread -MD -MQ 'journalctl@exe/src_journal_journal-qrcode.c.o' -MF 'journalctl@exe/src_journal_journal-qrcode.c.o.d' -o 'journalctl@exe/src_journal_journal-qrcode.c.o' -c ../src/journal/journal-qrcode.c
[638/1881] i686-pld-linux-gcc  -o libnss_mymachines.so.2 'nss_mymachines@sha/src_nss-mymachines_nss-mymachines.c.o' 'nss_mymachines@sha/src_libsystemd_disable-mempool.c.o' -Wl,--as-needed -Wl,--no-undefined -shared -fPIC -Wl,--start-group -Wl,-soname,libnss_mymachines.so.2 -Wl,-z,relro -Wl,-z,now -fstack-protector -Wl,--gc-sections -O2 -fwrapv -pipe -Wformat -Werror=format-security -gdwarf-4 -fno-debug-types-section -fvar-tracking-assignments -g2 -Wp,-D_FORTIFY_SOURCE=2 -fstack-protector-strong --param=ssp-buffer-size=4 -Werror=trampolines -fomit-frame-pointer -march=i686 -fasynchronous-unwind-tables -mtune=pentium4 -gdwarf-4 -fno-debug-types-section -fvar-tracking-assignments -g2 -Wl,--as-needed -Wl,--no-copy-dt-needed-entries -Wl,-z,relro -Wl,-z,combreloc src/libsystemd/libsystemd_static.a src/basic/libbasic.a src/shared/libsystemd-shared-245.a -Wl,-z,nodelete -shared -Wl,--version-script=/tmp/B.clK9HG/BUILD/systemd-245/src/nss-mymachines/nss-mymachines.sym -pthread -lrt /usr/lib/gcc/i686-pld-linux/10.1.0/../../../libcap.so /usr/lib/libselinux.so -lm -lacl /usr/lib/libblkid.so -lcrypt /usr/lib/libcryptsetup.so -lgcrypt /usr/lib/libidn2.so /usr/lib/libip4tc.so /usr/lib/libip6tc.so /usr/lib/libkmod.so /usr/lib/liblz4.so /usr/lib/libmount.so /usr/lib/libssl.so /usr/lib/libcrypto.so /usr/lib/libp11-kit.so -lpam /usr/lib/libseccomp.so /usr/lib/liblzma.so -Wl,--end-group '-Wl,-rpath,$ORIGIN/src/libsystemd:$ORIGIN/src/basic:$ORIGIN/src/shared' -Wl,-rpath-link,/tmp/B.clK9HG/BUILD/systemd-245/build/src/libsystemd -Wl,-rpath-link,/tmp/B.clK9HG/BUILD/systemd-245/build/src/basic -Wl,-rpath-link,/tmp/B.clK9HG/BUILD/systemd-245/build/src/shared
[639/1881] /usr/bin/meson --internal exe --capture src/resolve/dns_type-from-name.h -- /usr/bin/gperf -L ANSI-C -t --ignore-case -N lookup_dns_type -H hash_dns_type_name -p -C src/resolve/dns_type-from-name.gperf
[640/1881] i686-pld-linux-gcc  -o libnss_systemd.so.2 'nss_systemd@sha/src_nss-systemd_nss-systemd.c.o' 'nss_systemd@sha/src_nss-systemd_userdb-glue.c.o' 'nss_systemd@sha/src_libsystemd_disable-mempool.c.o' -Wl,--as-needed -Wl,--no-undefined -shared -fPIC -Wl,--start-group -Wl,-soname,libnss_systemd.so.2 -Wl,-z,relro -Wl,-z,now -fstack-protector -Wl,--gc-sections -O2 -fwrapv -pipe -Wformat -Werror=format-security -gdwarf-4 -fno-debug-types-section -fvar-tracking-assignments -g2 -Wp,-D_FORTIFY_SOURCE=2 -fstack-protector-strong --param=ssp-buffer-size=4 -Werror=trampolines -fomit-frame-pointer -march=i686 -fasynchronous-unwind-tables -mtune=pentium4 -gdwarf-4 -fno-debug-types-section -fvar-tracking-assignments -g2 -Wl,--as-needed -Wl,--no-copy-dt-needed-entries -Wl,-z,relro -Wl,-z,combreloc src/libsystemd/libsystemd_static.a src/basic/libbasic.a src/shared/libsystemd-shared-245.a -Wl,-z,nodelete -shared -Wl,--version-script=/tmp/B.clK9HG/BUILD/systemd-245/src/nss-systemd/nss-systemd.sym -pthread -lrt /usr/lib/gcc/i686-pld-linux/10.1.0/../../../libcap.so /usr/lib/libselinux.so -lm -lacl /usr/lib/libblkid.so -lcrypt /usr/lib/libcryptsetup.so -lgcrypt /usr/lib/libidn2.so /usr/lib/libip4tc.so /usr/lib/libip6tc.so /usr/lib/libkmod.so /usr/lib/liblz4.so /usr/lib/libmount.so /usr/lib/libssl.so /usr/lib/libcrypto.so /usr/lib/libp11-kit.so -lpam /usr/lib/libseccomp.so /usr/lib/liblzma.so -Wl,--end-group '-Wl,-rpath,$ORIGIN/src/libsystemd:$ORIGIN/src/basic:$ORIGIN/src/shared' -Wl,-rpath-link,/tmp/B.clK9HG/BUILD/systemd-245/build/src/libsystemd -Wl,-rpath-link,/tmp/B.clK9HG/BUILD/systemd-245/build/src/basic -Wl,-rpath-link,/tmp/B.clK9HG/BUILD/systemd-245/build/src/shared
[641/1881] i686-pld-linux-gcc  -o libnss_resolve.so.2 'nss_resolve@sha/src_nss-resolve_nss-resolve.c.o' 'nss_resolve@sha/src_libsystemd_disable-mempool.c.o' -Wl,--as-needed -Wl,--no-undefined -shared -fPIC -Wl,--start-group -Wl,-soname,libnss_resolve.so.2 -Wl,-z,relro -Wl,-z,now -fstack-protector -Wl,--gc-sections -O2 -fwrapv -pipe -Wformat -Werror=format-security -gdwarf-4 -fno-debug-types-section -fvar-tracking-assignments -g2 -Wp,-D_FORTIFY_SOURCE=2 -fstack-protector-strong --param=ssp-buffer-size=4 -Werror=trampolines -fomit-frame-pointer -march=i686 -fasynchronous-unwind-tables -mtune=pentium4 -gdwarf-4 -fno-debug-types-section -fvar-tracking-assignments -g2 -Wl,--as-needed -Wl,--no-copy-dt-needed-entries -Wl,-z,relro -Wl,-z,combreloc src/libsystemd/libsystemd_static.a src/basic/libbasic.a src/shared/libsystemd-shared-245.a -Wl,-z,nodelete -shared -Wl,--version-script=/tmp/B.clK9HG/BUILD/systemd-245/src/nss-resolve/nss-resolve.sym -pthread -lrt /usr/lib/gcc/i686-pld-linux/10.1.0/../../../libcap.so /usr/lib/libselinux.so -lm -lacl /usr/lib/libblkid.so -lcrypt /usr/lib/libcryptsetup.so -lgcrypt /usr/lib/libidn2.so /usr/lib/libip4tc.so /usr/lib/libip6tc.so /usr/lib/libkmod.so /usr/lib/liblz4.so /usr/lib/libmount.so /usr/lib/libssl.so /usr/lib/libcrypto.so /usr/lib/libp11-kit.so -lpam /usr/lib/libseccomp.so /usr/lib/liblzma.so -Wl,--end-group '-Wl,-rpath,$ORIGIN/src/libsystemd:$ORIGIN/src/basic:$ORIGIN/src/shared' -Wl,-rpath-link,/tmp/B.clK9HG/BUILD/systemd-245/build/src/libsystemd -Wl,-rpath-link,/tmp/B.clK9HG/BUILD/systemd-245/build/src/basic -Wl,-rpath-link,/tmp/B.clK9HG/BUILD/systemd-245/build/src/shared
[642/1881] i686-pld-linux-gcc -Isystemd-debug-generator@exe -I. -I.. -Isrc/basic -I../src/basic -Isrc/boot -I../src/boot -Isrc/shared -I../src/shared -Isrc/systemd -I../src/systemd -Isrc/journal -I../src/journal -Isrc/journal-remote -I../src/journal-remote -Isrc/nspawn -I../src/nspawn -Isrc/resolve -I../src/resolve -Isrc/timesync -I../src/timesync -I../src/time-wait-sync -Isrc/login -I../src/login -Isrc/udev -I../src/udev -Isrc/libudev -I../src/libudev -Isrc/core -I../src/core -Isrc/shutdown -I../src/shutdown -I../src/libsystemd/sd-bus -I../src/libsystemd/sd-device -I../src/libsystemd/sd-event -I../src/libsystemd/sd-hwdb -I../src/libsystemd/sd-id128 -I../src/libsystemd/sd-netlink -I../src/libsystemd/sd-network -I../src/libsystemd/sd-resolve -Isrc/libsystemd-network -I../src/libsystemd-network -fdiagnostics-color=always -pipe -D_FILE_OFFSET_BITS=64 -std=gnu99 -Wno-unused-parameter -Wno-missing-field-initializers -Wno-unused-result -Wno-format-signedness -Werror=undef -Wlogical-op -Wmissing-include-dirs -Wold-style-definition -Wpointer-arith -Winit-self -Wfloat-equal -Wsuggest-attribute=noreturn -Werror=missing-prototypes -Werror=implicit-function-declaration -Werror=missing-declarations -Werror=return-type -Werror=incompatible-pointer-types -Werror=format=2 -Wstrict-prototypes -Wredundant-decls -Wmissing-noreturn -Wimplicit-fallthrough=5 -Wshadow -Wendif-labels -Wstrict-aliasing=2 -Wwrite-strings -Werror=overflow -Werror=shift-count-overflow -Werror=shift-overflow=2 -Wdate-time -Wnested-externs -Wno-error=nonnull -Wno-maybe-uninitialized -ffast-math -fno-common -fdiagnostics-show-option -fno-strict-aliasing -fvisibility=hidden -fstack-protector -fstack-protector-strong --param=ssp-buffer-size=4 -ffunction-sections -fdata-sections -Werror=shadow -include config.h -O2 -fwrapv -Wformat -Werror=format-security -gdwarf-4 -fno-debug-types-section -fvar-tracking-assignments -g2 -Wp,-D_FORTIFY_SOURCE=2 -fstack-protector-strong --param=ssp-buffer-size=4 -Werror=trampolines -fomit-frame-pointer -march=i686 -fasynchronous-unwind-tables -mtune=pentium4 -gdwarf-4 -fno-debug-types-section -fvar-tracking-assignments -g2 -MD -MQ 'systemd-debug-generator@exe/src_debug-generator_debug-generator.c.o' -MF 'systemd-debug-generator@exe/src_debug-generator_debug-generator.c.o.d' -o 'systemd-debug-generator@exe/src_debug-generator_debug-generator.c.o' -c ../src/debug-generator/debug-generator.c
[643/1881] i686-pld-linux-gcc -Isystemd-analyze@exe -I. -I.. -Isrc/basic -I../src/basic -Isrc/boot -I../src/boot -Isrc/shared -I../src/shared -Isrc/systemd -I../src/systemd -Isrc/journal -I../src/journal -Isrc/journal-remote -I../src/journal-remote -Isrc/nspawn -I../src/nspawn -Isrc/resolve -I../src/resolve -Isrc/timesync -I../src/timesync -I../src/time-wait-sync -Isrc/login -I../src/login -Isrc/udev -I../src/udev -Isrc/libudev -I../src/libudev -Isrc/core -I../src/core -Isrc/shutdown -I../src/shutdown -I../src/libsystemd/sd-bus -I../src/libsystemd/sd-device -I../src/libsystemd/sd-event -I../src/libsystemd/sd-hwdb -I../src/libsystemd/sd-id128 -I../src/libsystemd/sd-netlink -I../src/libsystemd/sd-network -I../src/libsystemd/sd-resolve -Isrc/libsystemd-network -I../src/libsystemd-network -I/usr/include/libmount -I/usr/include/blkid -fdiagnostics-color=always -pipe -D_FILE_OFFSET_BITS=64 -std=gnu99 -Wno-unused-parameter -Wno-missing-field-initializers -Wno-unused-result -Wno-format-signedness -Werror=undef -Wlogical-op -Wmissing-include-dirs -Wold-style-definition -Wpointer-arith -Winit-self -Wfloat-equal -Wsuggest-attribute=noreturn -Werror=missing-prototypes -Werror=implicit-function-declaration -Werror=missing-declarations -Werror=return-type -Werror=incompatible-pointer-types -Werror=format=2 -Wstrict-prototypes -Wredundant-decls -Wmissing-noreturn -Wimplicit-fallthrough=5 -Wshadow -Wendif-labels -Wstrict-aliasing=2 -Wwrite-strings -Werror=overflow -Werror=shift-count-overflow -Werror=shift-overflow=2 -Wdate-time -Wnested-externs -Wno-error=nonnull -Wno-maybe-uninitialized -ffast-math -fno-common -fdiagnostics-show-option -fno-strict-aliasing -fvisibility=hidden -fstack-protector -fstack-protector-strong --param=ssp-buffer-size=4 -ffunction-sections -fdata-sections -Werror=shadow -include config.h -O2 -fwrapv -Wformat -Werror=format-security -gdwarf-4 -fno-debug-types-section -fvar-tracking-assignments -g2 -Wp,-D_FORTIFY_SOURCE=2 -fstack-protector-strong --param=ssp-buffer-size=4 -Werror=trampolines -fomit-frame-pointer -march=i686 -fasynchronous-unwind-tables -mtune=pentium4 -gdwarf-4 -fno-debug-types-section -fvar-tracking-assignments -g2 -pthread -MD -MQ 'systemd-analyze@exe/src_analyze_analyze-security.c.o' -MF 'systemd-analyze@exe/src_analyze_analyze-security.c.o.d' -o 'systemd-analyze@exe/src_analyze_analyze-security.c.o' -c ../src/analyze/analyze-security.c
[644/1881] i686-pld-linux-gcc  -o systemd-cat 'systemd-cat@exe/src_journal_cat.c.o' -Wl,--as-needed -Wl,--no-undefined -Wl,-z,relro -Wl,-z,now -fstack-protector -Wl,--gc-sections -O2 -fwrapv -pipe -Wformat -Werror=format-security -gdwarf-4 -fno-debug-types-section -fvar-tracking-assignments -g2 -Wp,-D_FORTIFY_SOURCE=2 -fstack-protector-strong --param=ssp-buffer-size=4 -Werror=trampolines -fomit-frame-pointer -march=i686 -fasynchronous-unwind-tables -mtune=pentium4 -gdwarf-4 -fno-debug-types-section -fvar-tracking-assignments -g2 -Wl,--as-needed -Wl,--no-copy-dt-needed-entries -Wl,-z,relro -Wl,-z,combreloc -Wl,--start-group libjournal-core.a src/shared/libsystemd-shared-245.so -Wl,--end-group -pthread '-Wl,-rpath,$ORIGIN/:$ORIGIN/src/shared' -Wl,-rpath-link,/tmp/B.clK9HG/BUILD/systemd-245/build/ -Wl,-rpath-link,/tmp/B.clK9HG/BUILD/systemd-245/build/src/shared
[645/1881] i686-pld-linux-gcc -Isrc/resolve/085a0f9@@systemd-resolve-core@sta -Isrc/resolve -I../src/resolve -Isrc/basic -I../src/basic -Isrc/boot -I../src/boot -Isrc/shared -I../src/shared -Isrc/systemd -I../src/systemd -Isrc/journal -I../src/journal -Isrc/journal-remote -I../src/journal-remote -Isrc/nspawn -I../src/nspawn -Isrc/timesync -I../src/timesync -I../src/time-wait-sync -Isrc/login -I../src/login -Isrc/udev -I../src/udev -Isrc/libudev -I../src/libudev -Isrc/core -I../src/core -Isrc/shutdown -I../src/shutdown -I../src/libsystemd/sd-bus -I../src/libsystemd/sd-device -I../src/libsystemd/sd-event -I../src/libsystemd/sd-hwdb -I../src/libsystemd/sd-id128 -I../src/libsystemd/sd-netlink -I../src/libsystemd/sd-network -I../src/libsystemd/sd-resolve -Isrc/libsystemd-network -I../src/libsystemd-network -I. -I.. -fdiagnostics-color=always -pipe -D_FILE_OFFSET_BITS=64 -std=gnu99 -Wno-unused-parameter -Wno-missing-field-initializers -Wno-unused-result -Wno-format-signedness -Werror=undef -Wlogical-op -Wmissing-include-dirs -Wold-style-definition -Wpointer-arith -Winit-self -Wfloat-equal -Wsuggest-attribute=noreturn -Werror=missing-prototypes -Werror=implicit-function-declaration -Werror=missing-declarations -Werror=return-type -Werror=incompatible-pointer-types -Werror=format=2 -Wstrict-prototypes -Wredundant-decls -Wmissing-noreturn -Wimplicit-fallthrough=5 -Wshadow -Wendif-labels -Wstrict-aliasing=2 -Wwrite-strings -Werror=overflow -Werror=shift-count-overflow -Werror=shift-overflow=2 -Wdate-time -Wnested-externs -Wno-error=nonnull -Wno-maybe-uninitialized -ffast-math -fno-common -fdiagnostics-show-option -fno-strict-aliasing -fvisibility=hidden -fstack-protector -fstack-protector-strong --param=ssp-buffer-size=4 -ffunction-sections -fdata-sections -Werror=shadow -include config.h -O2 -fwrapv -Wformat -Werror=format-security -gdwarf-4 -fno-debug-types-section -fvar-tracking-assignments -g2 -Wp,-D_FORTIFY_SOURCE=2 -fstack-protector-strong --param=ssp-buffer-size=4 -Werror=trampolines -fomit-frame-pointer -march=i686 -fasynchronous-unwind-tables -mtune=pentium4 -gdwarf-4 -fno-debug-types-section -fvar-tracking-assignments -g2 -fPIC -MD -MQ 'src/resolve/085a0f9@@systemd-resolve-core@sta/dns-type.c.o' -MF 'src/resolve/085a0f9@@systemd-resolve-core@sta/dns-type.c.o.d' -o 'src/resolve/085a0f9@@systemd-resolve-core@sta/dns-type.c.o' -c ../src/resolve/dns-type.c
[646/1881] i686-pld-linux-gcc -Isrc/resolve/085a0f9@@systemd-resolve-core@sta -Isrc/resolve -I../src/resolve -Isrc/basic -I../src/basic -Isrc/boot -I../src/boot -Isrc/shared -I../src/shared -Isrc/systemd -I../src/systemd -Isrc/journal -I../src/journal -Isrc/journal-remote -I../src/journal-remote -Isrc/nspawn -I../src/nspawn -Isrc/timesync -I../src/timesync -I../src/time-wait-sync -Isrc/login -I../src/login -Isrc/udev -I../src/udev -Isrc/libudev -I../src/libudev -Isrc/core -I../src/core -Isrc/shutdown -I../src/shutdown -I../src/libsystemd/sd-bus -I../src/libsystemd/sd-device -I../src/libsystemd/sd-event -I../src/libsystemd/sd-hwdb -I../src/libsystemd/sd-id128 -I../src/libsystemd/sd-netlink -I../src/libsystemd/sd-network -I../src/libsystemd/sd-resolve -Isrc/libsystemd-network -I../src/libsystemd-network -I. -I.. -fdiagnostics-color=always -pipe -D_FILE_OFFSET_BITS=64 -std=gnu99 -Wno-unused-parameter -Wno-missing-field-initializers -Wno-unused-result -Wno-format-signedness -Werror=undef -Wlogical-op -Wmissing-include-dirs -Wold-style-definition -Wpointer-arith -Winit-self -Wfloat-equal -Wsuggest-attribute=noreturn -Werror=missing-prototypes -Werror=implicit-function-declaration -Werror=missing-declarations -Werror=return-type -Werror=incompatible-pointer-types -Werror=format=2 -Wstrict-prototypes -Wredundant-decls -Wmissing-noreturn -Wimplicit-fallthrough=5 -Wshadow -Wendif-labels -Wstrict-aliasing=2 -Wwrite-strings -Werror=overflow -Werror=shift-count-overflow -Werror=shift-overflow=2 -Wdate-time -Wnested-externs -Wno-error=nonnull -Wno-maybe-uninitialized -ffast-math -fno-common -fdiagnostics-show-option -fno-strict-aliasing -fvisibility=hidden -fstack-protector -fstack-protector-strong --param=ssp-buffer-size=4 -ffunction-sections -fdata-sections -Werror=shadow -include config.h -O2 -fwrapv -Wformat -Werror=format-security -gdwarf-4 -fno-debug-types-section -fvar-tracking-assignments -g2 -Wp,-D_FORTIFY_SOURCE=2 -fstack-protector-strong --param=ssp-buffer-size=4 -Werror=trampolines -fomit-frame-pointer -march=i686 -fasynchronous-unwind-tables -mtune=pentium4 -gdwarf-4 -fno-debug-types-section -fvar-tracking-assignments -g2 -fPIC -MD -MQ 'src/resolve/085a0f9@@systemd-resolve-core@sta/resolved-dns-question.c.o' -MF 'src/resolve/085a0f9@@systemd-resolve-core@sta/resolved-dns-question.c.o.d' -o 'src/resolve/085a0f9@@systemd-resolve-core@sta/resolved-dns-question.c.o' -c ../src/resolve/resolved-dns-question.c
[647/1881] i686-pld-linux-gcc -Isrc/resolve/085a0f9@@systemd-resolve-core@sta -Isrc/resolve -I../src/resolve -Isrc/basic -I../src/basic -Isrc/boot -I../src/boot -Isrc/shared -I../src/shared -Isrc/systemd -I../src/systemd -Isrc/journal -I../src/journal -Isrc/journal-remote -I../src/journal-remote -Isrc/nspawn -I../src/nspawn -Isrc/timesync -I../src/timesync -I../src/time-wait-sync -Isrc/login -I../src/login -Isrc/udev -I../src/udev -Isrc/libudev -I../src/libudev -Isrc/core -I../src/core -Isrc/shutdown -I../src/shutdown -I../src/libsystemd/sd-bus -I../src/libsystemd/sd-device -I../src/libsystemd/sd-event -I../src/libsystemd/sd-hwdb -I../src/libsystemd/sd-id128 -I../src/libsystemd/sd-netlink -I../src/libsystemd/sd-network -I../src/libsystemd/sd-resolve -Isrc/libsystemd-network -I../src/libsystemd-network -I. -I.. -fdiagnostics-color=always -pipe -D_FILE_OFFSET_BITS=64 -std=gnu99 -Wno-unused-parameter -Wno-missing-field-initializers -Wno-unused-result -Wno-format-signedness -Werror=undef -Wlogical-op -Wmissing-include-dirs -Wold-style-definition -Wpointer-arith -Winit-self -Wfloat-equal -Wsuggest-attribute=noreturn -Werror=missing-prototypes -Werror=implicit-function-declaration -Werror=missing-declarations -Werror=return-type -Werror=incompatible-pointer-types -Werror=format=2 -Wstrict-prototypes -Wredundant-decls -Wmissing-noreturn -Wimplicit-fallthrough=5 -Wshadow -Wendif-labels -Wstrict-aliasing=2 -Wwrite-strings -Werror=overflow -Werror=shift-count-overflow -Werror=shift-overflow=2 -Wdate-time -Wnested-externs -Wno-error=nonnull -Wno-maybe-uninitialized -ffast-math -fno-common -fdiagnostics-show-option -fno-strict-aliasing -fvisibility=hidden -fstack-protector -fstack-protector-strong --param=ssp-buffer-size=4 -ffunction-sections -fdata-sections -Werror=shadow -include config.h -O2 -fwrapv -Wformat -Werror=format-security -gdwarf-4 -fno-debug-types-section -fvar-tracking-assignments -g2 -Wp,-D_FORTIFY_SOURCE=2 -fstack-protector-strong --param=ssp-buffer-size=4 -Werror=trampolines -fomit-frame-pointer -march=i686 -fasynchronous-unwind-tables -mtune=pentium4 -gdwarf-4 -fno-debug-types-section -fvar-tracking-assignments -g2 -fPIC -MD -MQ 'src/resolve/085a0f9@@systemd-resolve-core@sta/resolved-dns-answer.c.o' -MF 'src/resolve/085a0f9@@systemd-resolve-core@sta/resolved-dns-answer.c.o.d' -o 'src/resolve/085a0f9@@systemd-resolve-core@sta/resolved-dns-answer.c.o' -c ../src/resolve/resolved-dns-answer.c
[648/1881] i686-pld-linux-gcc -Isystemd-getty-generator@exe -I. -I.. -Isrc/basic -I../src/basic -Isrc/boot -I../src/boot -Isrc/shared -I../src/shared -Isrc/systemd -I../src/systemd -Isrc/journal -I../src/journal -Isrc/journal-remote -I../src/journal-remote -Isrc/nspawn -I../src/nspawn -Isrc/resolve -I../src/resolve -Isrc/timesync -I../src/timesync -I../src/time-wait-sync -Isrc/login -I../src/login -Isrc/udev -I../src/udev -Isrc/libudev -I../src/libudev -Isrc/core -I../src/core -Isrc/shutdown -I../src/shutdown -I../src/libsystemd/sd-bus -I../src/libsystemd/sd-device -I../src/libsystemd/sd-event -I../src/libsystemd/sd-hwdb -I../src/libsystemd/sd-id128 -I../src/libsystemd/sd-netlink -I../src/libsystemd/sd-network -I../src/libsystemd/sd-resolve -Isrc/libsystemd-network -I../src/libsystemd-network -fdiagnostics-color=always -pipe -D_FILE_OFFSET_BITS=64 -std=gnu99 -Wno-unused-parameter -Wno-missing-field-initializers -Wno-unused-result -Wno-format-signedness -Werror=undef -Wlogical-op -Wmissing-include-dirs -Wold-style-definition -Wpointer-arith -Winit-self -Wfloat-equal -Wsuggest-attribute=noreturn -Werror=missing-prototypes -Werror=implicit-function-declaration -Werror=missing-declarations -Werror=return-type -Werror=incompatible-pointer-types -Werror=format=2 -Wstrict-prototypes -Wredundant-decls -Wmissing-noreturn -Wimplicit-fallthrough=5 -Wshadow -Wendif-labels -Wstrict-aliasing=2 -Wwrite-strings -Werror=overflow -Werror=shift-count-overflow -Werror=shift-overflow=2 -Wdate-time -Wnested-externs -Wno-error=nonnull -Wno-maybe-uninitialized -ffast-math -fno-common -fdiagnostics-show-option -fno-strict-aliasing -fvisibility=hidden -fstack-protector -fstack-protector-strong --param=ssp-buffer-size=4 -ffunction-sections -fdata-sections -Werror=shadow -include config.h -O2 -fwrapv -Wformat -Werror=format-security -gdwarf-4 -fno-debug-types-section -fvar-tracking-assignments -g2 -Wp,-D_FORTIFY_SOURCE=2 -fstack-protector-strong --param=ssp-buffer-size=4 -Werror=trampolines -fomit-frame-pointer -march=i686 -fasynchronous-unwind-tables -mtune=pentium4 -gdwarf-4 -fno-debug-types-section -fvar-tracking-assignments -g2 -MD -MQ 'systemd-getty-generator@exe/src_getty-generator_getty-generator.c.o' -MF 'systemd-getty-generator@exe/src_getty-generator_getty-generator.c.o.d' -o 'systemd-getty-generator@exe/src_getty-generator_getty-generator.c.o' -c ../src/getty-generator/getty-generator.c
[649/1881] i686-pld-linux-gcc -Isystemd@exe -I. -I.. -Isrc/basic -I../src/basic -Isrc/boot -I../src/boot -Isrc/shared -I../src/shared -Isrc/systemd -I../src/systemd -Isrc/journal -I../src/journal -Isrc/journal-remote -I../src/journal-remote -Isrc/nspawn -I../src/nspawn -Isrc/resolve -I../src/resolve -Isrc/timesync -I../src/timesync -I../src/time-wait-sync -Isrc/login -I../src/login -Isrc/udev -I../src/udev -Isrc/libudev -I../src/libudev -Isrc/core -I../src/core -Isrc/shutdown -I../src/shutdown -I../src/libsystemd/sd-bus -I../src/libsystemd/sd-device -I../src/libsystemd/sd-event -I../src/libsystemd/sd-hwdb -I../src/libsystemd/sd-id128 -I../src/libsystemd/sd-netlink -I../src/libsystemd/sd-network -I../src/libsystemd/sd-resolve -Isrc/libsystemd-network -I../src/libsystemd-network -I/usr/include/libmount -I/usr/include/blkid -fdiagnostics-color=always -pipe -D_FILE_OFFSET_BITS=64 -std=gnu99 -Wno-unused-parameter -Wno-missing-field-initializers -Wno-unused-result -Wno-format-signedness -Werror=undef -Wlogical-op -Wmissing-include-dirs -Wold-style-definition -Wpointer-arith -Winit-self -Wfloat-equal -Wsuggest-attribute=noreturn -Werror=missing-prototypes -Werror=implicit-function-declaration -Werror=missing-declarations -Werror=return-type -Werror=incompatible-pointer-types -Werror=format=2 -Wstrict-prototypes -Wredundant-decls -Wmissing-noreturn -Wimplicit-fallthrough=5 -Wshadow -Wendif-labels -Wstrict-aliasing=2 -Wwrite-strings -Werror=overflow -Werror=shift-count-overflow -Werror=shift-overflow=2 -Wdate-time -Wnested-externs -Wno-error=nonnull -Wno-maybe-uninitialized -ffast-math -fno-common -fdiagnostics-show-option -fno-strict-aliasing -fvisibility=hidden -fstack-protector -fstack-protector-strong --param=ssp-buffer-size=4 -ffunction-sections -fdata-sections -Werror=shadow -include config.h -O2 -fwrapv -Wformat -Werror=format-security -gdwarf-4 -fno-debug-types-section -fvar-tracking-assignments -g2 -Wp,-D_FORTIFY_SOURCE=2 -fstack-protector-strong --param=ssp-buffer-size=4 -Werror=trampolines -fomit-frame-pointer -march=i686 -fasynchronous-unwind-tables -mtune=pentium4 -gdwarf-4 -fno-debug-types-section -fvar-tracking-assignments -g2 -pthread -MD -MQ 'systemd@exe/src_core_main.c.o' -MF 'systemd@exe/src_core_main.c.o.d' -o 'systemd@exe/src_core_main.c.o' -c ../src/core/main.c
[650/1881] i686-pld-linux-gcc -Isystemd-analyze@exe -I. -I.. -Isrc/basic -I../src/basic -Isrc/boot -I../src/boot -Isrc/shared -I../src/shared -Isrc/systemd -I../src/systemd -Isrc/journal -I../src/journal -Isrc/journal-remote -I../src/journal-remote -Isrc/nspawn -I../src/nspawn -Isrc/resolve -I../src/resolve -Isrc/timesync -I../src/timesync -I../src/time-wait-sync -Isrc/login -I../src/login -Isrc/udev -I../src/udev -Isrc/libudev -I../src/libudev -Isrc/core -I../src/core -Isrc/shutdown -I../src/shutdown -I../src/libsystemd/sd-bus -I../src/libsystemd/sd-device -I../src/libsystemd/sd-event -I../src/libsystemd/sd-hwdb -I../src/libsystemd/sd-id128 -I../src/libsystemd/sd-netlink -I../src/libsystemd/sd-network -I../src/libsystemd/sd-resolve -Isrc/libsystemd-network -I../src/libsystemd-network -I/usr/include/libmount -I/usr/include/blkid -fdiagnostics-color=always -pipe -D_FILE_OFFSET_BITS=64 -std=gnu99 -Wno-unused-parameter -Wno-missing-field-initializers -Wno-unused-result -Wno-format-signedness -Werror=undef -Wlogical-op -Wmissing-include-dirs -Wold-style-definition -Wpointer-arith -Winit-self -Wfloat-equal -Wsuggest-attribute=noreturn -Werror=missing-prototypes -Werror=implicit-function-declaration -Werror=missing-declarations -Werror=return-type -Werror=incompatible-pointer-types -Werror=format=2 -Wstrict-prototypes -Wredundant-decls -Wmissing-noreturn -Wimplicit-fallthrough=5 -Wshadow -Wendif-labels -Wstrict-aliasing=2 -Wwrite-strings -Werror=overflow -Werror=shift-count-overflow -Werror=shift-overflow=2 -Wdate-time -Wnested-externs -Wno-error=nonnull -Wno-maybe-uninitialized -ffast-math -fno-common -fdiagnostics-show-option -fno-strict-aliasing -fvisibility=hidden -fstack-protector -fstack-protector-strong --param=ssp-buffer-size=4 -ffunction-sections -fdata-sections -Werror=shadow -include config.h -O2 -fwrapv -Wformat -Werror=format-security -gdwarf-4 -fno-debug-types-section -fvar-tracking-assignments -g2 -Wp,-D_FORTIFY_SOURCE=2 -fstack-protector-strong --param=ssp-buffer-size=4 -Werror=trampolines -fomit-frame-pointer -march=i686 -fasynchronous-unwind-tables -mtune=pentium4 -gdwarf-4 -fno-debug-types-section -fvar-tracking-assignments -g2 -pthread -MD -MQ 'systemd-analyze@exe/src_analyze_analyze.c.o' -MF 'systemd-analyze@exe/src_analyze_analyze.c.o.d' -o 'systemd-analyze@exe/src_analyze_analyze.c.o' -c ../src/analyze/analyze.c
[651/1881] i686-pld-linux-gcc  -o systemd-getty-generator 'systemd-getty-generator@exe/src_getty-generator_getty-generator.c.o' -Wl,--as-needed -Wl,--no-undefined -Wl,-z,relro -Wl,-z,now -fstack-protector -Wl,--gc-sections -O2 -fwrapv -pipe -Wformat -Werror=format-security -gdwarf-4 -fno-debug-types-section -fvar-tracking-assignments -g2 -Wp,-D_FORTIFY_SOURCE=2 -fstack-protector-strong --param=ssp-buffer-size=4 -Werror=trampolines -fomit-frame-pointer -march=i686 -fasynchronous-unwind-tables -mtune=pentium4 -gdwarf-4 -fno-debug-types-section -fvar-tracking-assignments -g2 -Wl,--as-needed -Wl,--no-copy-dt-needed-entries -Wl,-z,relro -Wl,-z,combreloc -Wl,--start-group src/shared/libsystemd-shared-245.so -Wl,--end-group '-Wl,-rpath,$ORIGIN/src/shared' -Wl,-rpath-link,/tmp/B.clK9HG/BUILD/systemd-245/build/src/shared
[652/1881] i686-pld-linux-gcc -Ijournalctl@exe -I. -I.. -Isrc/basic -I../src/basic -Isrc/boot -I../src/boot -Isrc/shared -I../src/shared -Isrc/systemd -I../src/systemd -Isrc/journal -I../src/journal -Isrc/journal-remote -I../src/journal-remote -Isrc/nspawn -I../src/nspawn -Isrc/resolve -I../src/resolve -Isrc/timesync -I../src/timesync -I../src/time-wait-sync -Isrc/login -I../src/login -Isrc/udev -I../src/udev -Isrc/libudev -I../src/libudev -Isrc/core -I../src/core -Isrc/shutdown -I../src/shutdown -I../src/libsystemd/sd-bus -I../src/libsystemd/sd-device -I../src/libsystemd/sd-event -I../src/libsystemd/sd-hwdb -I../src/libsystemd/sd-id128 -I../src/libsystemd/sd-netlink -I../src/libsystemd/sd-network -I../src/libsystemd/sd-resolve -Isrc/libsystemd-network -I../src/libsystemd-network -fdiagnostics-color=always -pipe -D_FILE_OFFSET_BITS=64 -std=gnu99 -Wno-unused-parameter -Wno-missing-field-initializers -Wno-unused-result -Wno-format-signedness -Werror=undef -Wlogical-op -Wmissing-include-dirs -Wold-style-definition -Wpointer-arith -Winit-self -Wfloat-equal -Wsuggest-attribute=noreturn -Werror=missing-prototypes -Werror=implicit-function-declaration -Werror=missing-declarations -Werror=return-type -Werror=incompatible-pointer-types -Werror=format=2 -Wstrict-prototypes -Wredundant-decls -Wmissing-noreturn -Wimplicit-fallthrough=5 -Wshadow -Wendif-labels -Wstrict-aliasing=2 -Wwrite-strings -Werror=overflow -Werror=shift-count-overflow -Werror=shift-overflow=2 -Wdate-time -Wnested-externs -Wno-error=nonnull -Wno-maybe-uninitialized -ffast-math -fno-common -fdiagnostics-show-option -fno-strict-aliasing -fvisibility=hidden -fstack-protector -fstack-protector-strong --param=ssp-buffer-size=4 -ffunction-sections -fdata-sections -Werror=shadow -include config.h -O2 -fwrapv -Wformat -Werror=format-security -gdwarf-4 -fno-debug-types-section -fvar-tracking-assignments -g2 -Wp,-D_FORTIFY_SOURCE=2 -fstack-protector-strong --param=ssp-buffer-size=4 -Werror=trampolines -fomit-frame-pointer -march=i686 -fasynchronous-unwind-tables -mtune=pentium4 -gdwarf-4 -fno-debug-types-section -fvar-tracking-assignments -g2 -pthread -MD -MQ 'journalctl@exe/src_journal_journalctl.c.o' -MF 'journalctl@exe/src_journal_journalctl.c.o.d' -o 'journalctl@exe/src_journal_journalctl.c.o' -c ../src/journal/journalctl.c
[653/1881] i686-pld-linux-gcc -Isrc/resolve/085a0f9@@systemd-resolve-core@sta -Isrc/resolve -I../src/resolve -Isrc/basic -I../src/basic -Isrc/boot -I../src/boot -Isrc/shared -I../src/shared -Isrc/systemd -I../src/systemd -Isrc/journal -I../src/journal -Isrc/journal-remote -I../src/journal-remote -Isrc/nspawn -I../src/nspawn -Isrc/timesync -I../src/timesync -I../src/time-wait-sync -Isrc/login -I../src/login -Isrc/udev -I../src/udev -Isrc/libudev -I../src/libudev -Isrc/core -I../src/core -Isrc/shutdown -I../src/shutdown -I../src/libsystemd/sd-bus -I../src/libsystemd/sd-device -I../src/libsystemd/sd-event -I../src/libsystemd/sd-hwdb -I../src/libsystemd/sd-id128 -I../src/libsystemd/sd-netlink -I../src/libsystemd/sd-network -I../src/libsystemd/sd-resolve -Isrc/libsystemd-network -I../src/libsystemd-network -I. -I.. -fdiagnostics-color=always -pipe -D_FILE_OFFSET_BITS=64 -std=gnu99 -Wno-unused-parameter -Wno-missing-field-initializers -Wno-unused-result -Wno-format-signedness -Werror=undef -Wlogical-op -Wmissing-include-dirs -Wold-style-definition -Wpointer-arith -Winit-self -Wfloat-equal -Wsuggest-attribute=noreturn -Werror=missing-prototypes -Werror=implicit-function-declaration -Werror=missing-declarations -Werror=return-type -Werror=incompatible-pointer-types -Werror=format=2 -Wstrict-prototypes -Wredundant-decls -Wmissing-noreturn -Wimplicit-fallthrough=5 -Wshadow -Wendif-labels -Wstrict-aliasing=2 -Wwrite-strings -Werror=overflow -Werror=shift-count-overflow -Werror=shift-overflow=2 -Wdate-time -Wnested-externs -Wno-error=nonnull -Wno-maybe-uninitialized -ffast-math -fno-common -fdiagnostics-show-option -fno-strict-aliasing -fvisibility=hidden -fstack-protector -fstack-protector-strong --param=ssp-buffer-size=4 -ffunction-sections -fdata-sections -Werror=shadow -include config.h -O2 -fwrapv -Wformat -Werror=format-security -gdwarf-4 -fno-debug-types-section -fvar-tracking-assignments -g2 -Wp,-D_FORTIFY_SOURCE=2 -fstack-protector-strong --param=ssp-buffer-size=4 -Werror=trampolines -fomit-frame-pointer -march=i686 -fasynchronous-unwind-tables -mtune=pentium4 -gdwarf-4 -fno-debug-types-section -fvar-tracking-assignments -g2 -fPIC -MD -MQ 'src/resolve/085a0f9@@systemd-resolve-core@sta/resolved-dns-dnssec.c.o' -MF 'src/resolve/085a0f9@@systemd-resolve-core@sta/resolved-dns-dnssec.c.o.d' -o 'src/resolve/085a0f9@@systemd-resolve-core@sta/resolved-dns-dnssec.c.o' -c ../src/resolve/resolved-dns-dnssec.c
[654/1881] i686-pld-linux-gcc  -o journalctl 'journalctl@exe/src_journal_journalctl.c.o' 'journalctl@exe/src_journal_journal-qrcode.c.o' -Wl,--as-needed -Wl,--no-undefined -Wl,-z,relro -Wl,-z,now -fstack-protector -Wl,--gc-sections -O2 -fwrapv -pipe -Wformat -Werror=format-security -gdwarf-4 -fno-debug-types-section -fvar-tracking-assignments -g2 -Wp,-D_FORTIFY_SOURCE=2 -fstack-protector-strong --param=ssp-buffer-size=4 -Werror=trampolines -fomit-frame-pointer -march=i686 -fasynchronous-unwind-tables -mtune=pentium4 -gdwarf-4 -fno-debug-types-section -fvar-tracking-assignments -g2 -Wl,--as-needed -Wl,--no-copy-dt-needed-entries -Wl,-z,relro -Wl,-z,combreloc -Wl,--start-group src/shared/libsystemd-shared-245.so -pthread /usr/lib/libqrencode.so /usr/lib/liblzma.so /usr/lib/liblz4.so /usr/lib/libpcre2-8.so -Wl,--end-group '-Wl,-rpath,$ORIGIN/src/shared' -Wl,-rpath-link,/tmp/B.clK9HG/BUILD/systemd-245/build/src/shared
[655/1881] i686-pld-linux-gcc -Isrc/resolve/085a0f9@@systemd-resolve-core@sta -Isrc/resolve -I../src/resolve -Isrc/basic -I../src/basic -Isrc/boot -I../src/boot -Isrc/shared -I../src/shared -Isrc/systemd -I../src/systemd -Isrc/journal -I../src/journal -Isrc/journal-remote -I../src/journal-remote -Isrc/nspawn -I../src/nspawn -Isrc/timesync -I../src/timesync -I../src/time-wait-sync -Isrc/login -I../src/login -Isrc/udev -I../src/udev -Isrc/libudev -I../src/libudev -Isrc/core -I../src/core -Isrc/shutdown -I../src/shutdown -I../src/libsystemd/sd-bus -I../src/libsystemd/sd-device -I../src/libsystemd/sd-event -I../src/libsystemd/sd-hwdb -I../src/libsystemd/sd-id128 -I../src/libsystemd/sd-netlink -I../src/libsystemd/sd-network -I../src/libsystemd/sd-resolve -Isrc/libsystemd-network -I../src/libsystemd-network -I. -I.. -fdiagnostics-color=always -pipe -D_FILE_OFFSET_BITS=64 -std=gnu99 -Wno-unused-parameter -Wno-missing-field-initializers -Wno-unused-result -Wno-format-signedness -Werror=undef -Wlogical-op -Wmissing-include-dirs -Wold-style-definition -Wpointer-arith -Winit-self -Wfloat-equal -Wsuggest-attribute=noreturn -Werror=missing-prototypes -Werror=implicit-function-declaration -Werror=missing-declarations -Werror=return-type -Werror=incompatible-pointer-types -Werror=format=2 -Wstrict-prototypes -Wredundant-decls -Wmissing-noreturn -Wimplicit-fallthrough=5 -Wshadow -Wendif-labels -Wstrict-aliasing=2 -Wwrite-strings -Werror=overflow -Werror=shift-count-overflow -Werror=shift-overflow=2 -Wdate-time -Wnested-externs -Wno-error=nonnull -Wno-maybe-uninitialized -ffast-math -fno-common -fdiagnostics-show-option -fno-strict-aliasing -fvisibility=hidden -fstack-protector -fstack-protector-strong --param=ssp-buffer-size=4 -ffunction-sections -fdata-sections -Werror=shadow -include config.h -O2 -fwrapv -Wformat -Werror=format-security -gdwarf-4 -fno-debug-types-section -fvar-tracking-assignments -g2 -Wp,-D_FORTIFY_SOURCE=2 -fstack-protector-strong --param=ssp-buffer-size=4 -Werror=trampolines -fomit-frame-pointer -march=i686 -fasynchronous-unwind-tables -mtune=pentium4 -gdwarf-4 -fno-debug-types-section -fvar-tracking-assignments -g2 -fPIC -MD -MQ 'src/resolve/085a0f9@@systemd-resolve-core@sta/resolved-dns-rr.c.o' -MF 'src/resolve/085a0f9@@systemd-resolve-core@sta/resolved-dns-rr.c.o.d' -o 'src/resolve/085a0f9@@systemd-resolve-core@sta/resolved-dns-rr.c.o' -c ../src/resolve/resolved-dns-rr.c
[656/1881] i686-pld-linux-gcc  -o systemd-debug-generator 'systemd-debug-generator@exe/src_debug-generator_debug-generator.c.o' -Wl,--as-needed -Wl,--no-undefined -Wl,-z,relro -Wl,-z,now -fstack-protector -Wl,--gc-sections -O2 -fwrapv -pipe -Wformat -Werror=format-security -gdwarf-4 -fno-debug-types-section -fvar-tracking-assignments -g2 -Wp,-D_FORTIFY_SOURCE=2 -fstack-protector-strong --param=ssp-buffer-size=4 -Werror=trampolines -fomit-frame-pointer -march=i686 -fasynchronous-unwind-tables -mtune=pentium4 -gdwarf-4 -fno-debug-types-section -fvar-tracking-assignments -g2 -Wl,--as-needed -Wl,--no-copy-dt-needed-entries -Wl,-z,relro -Wl,-z,combreloc -Wl,--start-group src/shared/libsystemd-shared-245.so -Wl,--end-group '-Wl,-rpath,$ORIGIN/src/shared' -Wl,-rpath-link,/tmp/B.clK9HG/BUILD/systemd-245/build/src/shared
[657/1881] i686-pld-linux-gcc -Isystemd-fstab-generator@exe -I. -I.. -Isrc/basic -I../src/basic -Isrc/boot -I../src/boot -Isrc/shared -I../src/shared -Isrc/systemd -I../src/systemd -Isrc/journal -I../src/journal -Isrc/journal-remote -I../src/journal-remote -Isrc/nspawn -I../src/nspawn -Isrc/resolve -I../src/resolve -Isrc/timesync -I../src/timesync -I../src/time-wait-sync -Isrc/login -I../src/login -Isrc/udev -I../src/udev -Isrc/libudev -I../src/libudev -Isrc/core -I../src/core -Isrc/shutdown -I../src/shutdown -I../src/libsystemd/sd-bus -I../src/libsystemd/sd-device -I../src/libsystemd/sd-event -I../src/libsystemd/sd-hwdb -I../src/libsystemd/sd-id128 -I../src/libsystemd/sd-netlink -I../src/libsystemd/sd-network -I../src/libsystemd/sd-resolve -Isrc/libsystemd-network -I../src/libsystemd-network -fdiagnostics-color=always -pipe -D_FILE_OFFSET_BITS=64 -std=gnu99 -Wno-unused-parameter -Wno-missing-field-initializers -Wno-unused-result -Wno-format-signedness -Werror=undef -Wlogical-op -Wmissing-include-dirs -Wold-style-definition -Wpointer-arith -Winit-self -Wfloat-equal -Wsuggest-attribute=noreturn -Werror=missing-prototypes -Werror=implicit-function-declaration -Werror=missing-declarations -Werror=return-type -Werror=incompatible-pointer-types -Werror=format=2 -Wstrict-prototypes -Wredundant-decls -Wmissing-noreturn -Wimplicit-fallthrough=5 -Wshadow -Wendif-labels -Wstrict-aliasing=2 -Wwrite-strings -Werror=overflow -Werror=shift-count-overflow -Werror=shift-overflow=2 -Wdate-time -Wnested-externs -Wno-error=nonnull -Wno-maybe-uninitialized -ffast-math -fno-common -fdiagnostics-show-option -fno-strict-aliasing -fvisibility=hidden -fstack-protector -fstack-protector-strong --param=ssp-buffer-size=4 -ffunction-sections -fdata-sections -Werror=shadow -include config.h -O2 -fwrapv -Wformat -Werror=format-security -gdwarf-4 -fno-debug-types-section -fvar-tracking-assignments -g2 -Wp,-D_FORTIFY_SOURCE=2 -fstack-protector-strong --param=ssp-buffer-size=4 -Werror=trampolines -fomit-frame-pointer -march=i686 -fasynchronous-unwind-tables -mtune=pentium4 -gdwarf-4 -fno-debug-types-section -fvar-tracking-assignments -g2 -MD -MQ 'systemd-fstab-generator@exe/src_fstab-generator_fstab-generator.c.o' -MF 'systemd-fstab-generator@exe/src_fstab-generator_fstab-generator.c.o.d' -o 'systemd-fstab-generator@exe/src_fstab-generator_fstab-generator.c.o' -c ../src/fstab-generator/fstab-generator.c
[658/1881] i686-pld-linux-gcc -Isrc/resolve/085a0f9@@systemd-resolve-core@sta -Isrc/resolve -I../src/resolve -Isrc/basic -I../src/basic -Isrc/boot -I../src/boot -Isrc/shared -I../src/shared -Isrc/systemd -I../src/systemd -Isrc/journal -I../src/journal -Isrc/journal-remote -I../src/journal-remote -Isrc/nspawn -I../src/nspawn -Isrc/timesync -I../src/timesync -I../src/time-wait-sync -Isrc/login -I../src/login -Isrc/udev -I../src/udev -Isrc/libudev -I../src/libudev -Isrc/core -I../src/core -Isrc/shutdown -I../src/shutdown -I../src/libsystemd/sd-bus -I../src/libsystemd/sd-device -I../src/libsystemd/sd-event -I../src/libsystemd/sd-hwdb -I../src/libsystemd/sd-id128 -I../src/libsystemd/sd-netlink -I../src/libsystemd/sd-network -I../src/libsystemd/sd-resolve -Isrc/libsystemd-network -I../src/libsystemd-network -I. -I.. -fdiagnostics-color=always -pipe -D_FILE_OFFSET_BITS=64 -std=gnu99 -Wno-unused-parameter -Wno-missing-field-initializers -Wno-unused-result -Wno-format-signedness -Werror=undef -Wlogical-op -Wmissing-include-dirs -Wold-style-definition -Wpointer-arith -Winit-self -Wfloat-equal -Wsuggest-attribute=noreturn -Werror=missing-prototypes -Werror=implicit-function-declaration -Werror=missing-declarations -Werror=return-type -Werror=incompatible-pointer-types -Werror=format=2 -Wstrict-prototypes -Wredundant-decls -Wmissing-noreturn -Wimplicit-fallthrough=5 -Wshadow -Wendif-labels -Wstrict-aliasing=2 -Wwrite-strings -Werror=overflow -Werror=shift-count-overflow -Werror=shift-overflow=2 -Wdate-time -Wnested-externs -Wno-error=nonnull -Wno-maybe-uninitialized -ffast-math -fno-common -fdiagnostics-show-option -fno-strict-aliasing -fvisibility=hidden -fstack-protector -fstack-protector-strong --param=ssp-buffer-size=4 -ffunction-sections -fdata-sections -Werror=shadow -include config.h -O2 -fwrapv -Wformat -Werror=format-security -gdwarf-4 -fno-debug-types-section -fvar-tracking-assignments -g2 -Wp,-D_FORTIFY_SOURCE=2 -fstack-protector-strong --param=ssp-buffer-size=4 -Werror=trampolines -fomit-frame-pointer -march=i686 -fasynchronous-unwind-tables -mtune=pentium4 -gdwarf-4 -fno-debug-types-section -fvar-tracking-assignments -g2 -fPIC -MD -MQ 'src/resolve/085a0f9@@systemd-resolve-core@sta/resolved-dns-packet.c.o' -MF 'src/resolve/085a0f9@@systemd-resolve-core@sta/resolved-dns-packet.c.o.d' -o 'src/resolve/085a0f9@@systemd-resolve-core@sta/resolved-dns-packet.c.o' -c ../src/resolve/resolved-dns-packet.c
[659/1881] i686-pld-linux-gcc -I30-systemd-environment-d-generator@exe -I. -I.. -Isrc/basic -I../src/basic -Isrc/boot -I../src/boot -Isrc/shared -I../src/shared -Isrc/systemd -I../src/systemd -Isrc/journal -I../src/journal -Isrc/journal-remote -I../src/journal-remote -Isrc/nspawn -I../src/nspawn -Isrc/resolve -I../src/resolve -Isrc/timesync -I../src/timesync -I../src/time-wait-sync -Isrc/login -I../src/login -Isrc/udev -I../src/udev -Isrc/libudev -I../src/libudev -Isrc/core -I../src/core -Isrc/shutdown -I../src/shutdown -I../src/libsystemd/sd-bus -I../src/libsystemd/sd-device -I../src/libsystemd/sd-event -I../src/libsystemd/sd-hwdb -I../src/libsystemd/sd-id128 -I../src/libsystemd/sd-netlink -I../src/libsystemd/sd-network -I../src/libsystemd/sd-resolve -Isrc/libsystemd-network -I../src/libsystemd-network -fdiagnostics-color=always -pipe -D_FILE_OFFSET_BITS=64 -std=gnu99 -Wno-unused-parameter -Wno-missing-field-initializers -Wno-unused-result -Wno-format-signedness -Werror=undef -Wlogical-op -Wmissing-include-dirs -Wold-style-definition -Wpointer-arith -Winit-self -Wfloat-equal -Wsuggest-attribute=noreturn -Werror=missing-prototypes -Werror=implicit-function-declaration -Werror=missing-declarations -Werror=return-type -Werror=incompatible-pointer-types -Werror=format=2 -Wstrict-prototypes -Wredundant-decls -Wmissing-noreturn -Wimplicit-fallthrough=5 -Wshadow -Wendif-labels -Wstrict-aliasing=2 -Wwrite-strings -Werror=overflow -Werror=shift-count-overflow -Werror=shift-overflow=2 -Wdate-time -Wnested-externs -Wno-error=nonnull -Wno-maybe-uninitialized -ffast-math -fno-common -fdiagnostics-show-option -fno-strict-aliasing -fvisibility=hidden -fstack-protector -fstack-protector-strong --param=ssp-buffer-size=4 -ffunction-sections -fdata-sections -Werror=shadow -include config.h -O2 -fwrapv -Wformat -Werror=format-security -gdwarf-4 -fno-debug-types-section -fvar-tracking-assignments -g2 -Wp,-D_FORTIFY_SOURCE=2 -fstack-protector-strong --param=ssp-buffer-size=4 -Werror=trampolines -fomit-frame-pointer -march=i686 -fasynchronous-unwind-tables -mtune=pentium4 -gdwarf-4 -fno-debug-types-section -fvar-tracking-assignments -g2 -MD -MQ '30-systemd-environment-d-generator@exe/src_environment-d-generator_environment-d-generator.c.o' -MF '30-systemd-environment-d-generator@exe/src_environment-d-generator_environment-d-generator.c.o.d' -o '30-systemd-environment-d-generator@exe/src_environment-d-generator_environment-d-generator.c.o' -c ../src/environment-d-generator/environment-d-generator.c
[660/1881] rm -f src/resolve/libsystemd-resolve-core.a && gcc-ar csrD src/resolve/libsystemd-resolve-core.a 'src/resolve/085a0f9@@systemd-resolve-core@sta/resolved-dns-dnssec.c.o' 'src/resolve/085a0f9@@systemd-resolve-core@sta/resolved-dns-packet.c.o' 'src/resolve/085a0f9@@systemd-resolve-core@sta/resolved-dns-rr.c.o' 'src/resolve/085a0f9@@systemd-resolve-core@sta/resolved-dns-answer.c.o' 'src/resolve/085a0f9@@systemd-resolve-core@sta/resolved-dns-question.c.o' 'src/resolve/085a0f9@@systemd-resolve-core@sta/dns-type.c.o'
[661/1881] i686-pld-linux-gcc -Isystemd-hibernate-resume@exe -I. -I.. -Isrc/basic -I../src/basic -Isrc/boot -I../src/boot -Isrc/shared -I../src/shared -Isrc/systemd -I../src/systemd -Isrc/journal -I../src/journal -Isrc/journal-remote -I../src/journal-remote -Isrc/nspawn -I../src/nspawn -Isrc/resolve -I../src/resolve -Isrc/timesync -I../src/timesync -I../src/time-wait-sync -Isrc/login -I../src/login -Isrc/udev -I../src/udev -Isrc/libudev -I../src/libudev -Isrc/core -I../src/core -Isrc/shutdown -I../src/shutdown -I../src/libsystemd/sd-bus -I../src/libsystemd/sd-device -I../src/libsystemd/sd-event -I../src/libsystemd/sd-hwdb -I../src/libsystemd/sd-id128 -I../src/libsystemd/sd-netlink -I../src/libsystemd/sd-network -I../src/libsystemd/sd-resolve -Isrc/libsystemd-network -I../src/libsystemd-network -fdiagnostics-color=always -pipe -D_FILE_OFFSET_BITS=64 -std=gnu99 -Wno-unused-parameter -Wno-missing-field-initializers -Wno-unused-result -Wno-format-signedness -Werror=undef -Wlogical-op -Wmissing-include-dirs -Wold-style-definition -Wpointer-arith -Winit-self -Wfloat-equal -Wsuggest-attribute=noreturn -Werror=missing-prototypes -Werror=implicit-function-declaration -Werror=missing-declarations -Werror=return-type -Werror=incompatible-pointer-types -Werror=format=2 -Wstrict-prototypes -Wredundant-decls -Wmissing-noreturn -Wimplicit-fallthrough=5 -Wshadow -Wendif-labels -Wstrict-aliasing=2 -Wwrite-strings -Werror=overflow -Werror=shift-count-overflow -Werror=shift-overflow=2 -Wdate-time -Wnested-externs -Wno-error=nonnull -Wno-maybe-uninitialized -ffast-math -fno-common -fdiagnostics-show-option -fno-strict-aliasing -fvisibility=hidden -fstack-protector -fstack-protector-strong --param=ssp-buffer-size=4 -ffunction-sections -fdata-sections -Werror=shadow -include config.h -O2 -fwrapv -Wformat -Werror=format-security -gdwarf-4 -fno-debug-types-section -fvar-tracking-assignments -g2 -Wp,-D_FORTIFY_SOURCE=2 -fstack-protector-strong --param=ssp-buffer-size=4 -Werror=trampolines -fomit-frame-pointer -march=i686 -fasynchronous-unwind-tables -mtune=pentium4 -gdwarf-4 -fno-debug-types-section -fvar-tracking-assignments -g2 -MD -MQ 'systemd-hibernate-resume@exe/src_hibernate-resume_hibernate-resume.c.o' -MF 'systemd-hibernate-resume@exe/src_hibernate-resume_hibernate-resume.c.o.d' -o 'systemd-hibernate-resume@exe/src_hibernate-resume_hibernate-resume.c.o' -c ../src/hibernate-resume/hibernate-resume.c
[662/1881] i686-pld-linux-gcc -Isystemd-run-generator@exe -I. -I.. -Isrc/basic -I../src/basic -Isrc/boot -I../src/boot -Isrc/shared -I../src/shared -Isrc/systemd -I../src/systemd -Isrc/journal -I../src/journal -Isrc/journal-remote -I../src/journal-remote -Isrc/nspawn -I../src/nspawn -Isrc/resolve -I../src/resolve -Isrc/timesync -I../src/timesync -I../src/time-wait-sync -Isrc/login -I../src/login -Isrc/udev -I../src/udev -Isrc/libudev -I../src/libudev -Isrc/core -I../src/core -Isrc/shutdown -I../src/shutdown -I../src/libsystemd/sd-bus -I../src/libsystemd/sd-device -I../src/libsystemd/sd-event -I../src/libsystemd/sd-hwdb -I../src/libsystemd/sd-id128 -I../src/libsystemd/sd-netlink -I../src/libsystemd/sd-network -I../src/libsystemd/sd-resolve -Isrc/libsystemd-network -I../src/libsystemd-network -fdiagnostics-color=always -pipe -D_FILE_OFFSET_BITS=64 -std=gnu99 -Wno-unused-parameter -Wno-missing-field-initializers -Wno-unused-result -Wno-format-signedness -Werror=undef -Wlogical-op -Wmissing-include-dirs -Wold-style-definition -Wpointer-arith -Winit-self -Wfloat-equal -Wsuggest-attribute=noreturn -Werror=missing-prototypes -Werror=implicit-function-declaration -Werror=missing-declarations -Werror=return-type -Werror=incompatible-pointer-types -Werror=format=2 -Wstrict-prototypes -Wredundant-decls -Wmissing-noreturn -Wimplicit-fallthrough=5 -Wshadow -Wendif-labels -Wstrict-aliasing=2 -Wwrite-strings -Werror=overflow -Werror=shift-count-overflow -Werror=shift-overflow=2 -Wdate-time -Wnested-externs -Wno-error=nonnull -Wno-maybe-uninitialized -ffast-math -fno-common -fdiagnostics-show-option -fno-strict-aliasing -fvisibility=hidden -fstack-protector -fstack-protector-strong --param=ssp-buffer-size=4 -ffunction-sections -fdata-sections -Werror=shadow -include config.h -O2 -fwrapv -Wformat -Werror=format-security -gdwarf-4 -fno-debug-types-section -fvar-tracking-assignments -g2 -Wp,-D_FORTIFY_SOURCE=2 -fstack-protector-strong --param=ssp-buffer-size=4 -Werror=trampolines -fomit-frame-pointer -march=i686 -fasynchronous-unwind-tables -mtune=pentium4 -gdwarf-4 -fno-debug-types-section -fvar-tracking-assignments -g2 -MD -MQ 'systemd-run-generator@exe/src_run-generator_run-generator.c.o' -MF 'systemd-run-generator@exe/src_run-generator_run-generator.c.o.d' -o 'systemd-run-generator@exe/src_run-generator_run-generator.c.o' -c ../src/run-generator/run-generator.c
[663/1881] i686-pld-linux-gcc -Isystemd-hibernate-resume-generator@exe -I. -I.. -Isrc/basic -I../src/basic -Isrc/boot -I../src/boot -Isrc/shared -I../src/shared -Isrc/systemd -I../src/systemd -Isrc/journal -I../src/journal -Isrc/journal-remote -I../src/journal-remote -Isrc/nspawn -I../src/nspawn -Isrc/resolve -I../src/resolve -Isrc/timesync -I../src/timesync -I../src/time-wait-sync -Isrc/login -I../src/login -Isrc/udev -I../src/udev -Isrc/libudev -I../src/libudev -Isrc/core -I../src/core -Isrc/shutdown -I../src/shutdown -I../src/libsystemd/sd-bus -I../src/libsystemd/sd-device -I../src/libsystemd/sd-event -I../src/libsystemd/sd-hwdb -I../src/libsystemd/sd-id128 -I../src/libsystemd/sd-netlink -I../src/libsystemd/sd-network -I../src/libsystemd/sd-resolve -Isrc/libsystemd-network -I../src/libsystemd-network -fdiagnostics-color=always -pipe -D_FILE_OFFSET_BITS=64 -std=gnu99 -Wno-unused-parameter -Wno-missing-field-initializers -Wno-unused-result -Wno-format-signedness -Werror=undef -Wlogical-op -Wmissing-include-dirs -Wold-style-definition -Wpointer-arith -Winit-self -Wfloat-equal -Wsuggest-attribute=noreturn -Werror=missing-prototypes -Werror=implicit-function-declaration -Werror=missing-declarations -Werror=return-type -Werror=incompatible-pointer-types -Werror=format=2 -Wstrict-prototypes -Wredundant-decls -Wmissing-noreturn -Wimplicit-fallthrough=5 -Wshadow -Wendif-labels -Wstrict-aliasing=2 -Wwrite-strings -Werror=overflow -Werror=shift-count-overflow -Werror=shift-overflow=2 -Wdate-time -Wnested-externs -Wno-error=nonnull -Wno-maybe-uninitialized -ffast-math -fno-common -fdiagnostics-show-option -fno-strict-aliasing -fvisibility=hidden -fstack-protector -fstack-protector-strong --param=ssp-buffer-size=4 -ffunction-sections -fdata-sections -Werror=shadow -include config.h -O2 -fwrapv -Wformat -Werror=format-security -gdwarf-4 -fno-debug-types-section -fvar-tracking-assignments -g2 -Wp,-D_FORTIFY_SOURCE=2 -fstack-protector-strong --param=ssp-buffer-size=4 -Werror=trampolines -fomit-frame-pointer -march=i686 -fasynchronous-unwind-tables -mtune=pentium4 -gdwarf-4 -fno-debug-types-section -fvar-tracking-assignments -g2 -MD -MQ 'systemd-hibernate-resume-generator@exe/src_hibernate-resume_hibernate-resume-generator.c.o' -MF 'systemd-hibernate-resume-generator@exe/src_hibernate-resume_hibernate-resume-generator.c.o.d' -o 'systemd-hibernate-resume-generator@exe/src_hibernate-resume_hibernate-resume-generator.c.o' -c ../src/hibernate-resume/hibernate-resume-generator.c
[664/1881] i686-pld-linux-gcc -Isystemd-gpt-auto-generator@exe -I. -I.. -Isrc/basic -I../src/basic -Isrc/boot -I../src/boot -Isrc/shared -I../src/shared -Isrc/systemd -I../src/systemd -Isrc/journal -I../src/journal -Isrc/journal-remote -I../src/journal-remote -Isrc/nspawn -I../src/nspawn -Isrc/resolve -I../src/resolve -Isrc/timesync -I../src/timesync -I../src/time-wait-sync -Isrc/login -I../src/login -Isrc/udev -I../src/udev -Isrc/libudev -I../src/libudev -Isrc/core -I../src/core -Isrc/shutdown -I../src/shutdown -I../src/libsystemd/sd-bus -I../src/libsystemd/sd-device -I../src/libsystemd/sd-event -I../src/libsystemd/sd-hwdb -I../src/libsystemd/sd-id128 -I../src/libsystemd/sd-netlink -I../src/libsystemd/sd-network -I../src/libsystemd/sd-resolve -Isrc/libsystemd-network -I../src/libsystemd-network -I/usr/include/blkid -fdiagnostics-color=always -pipe -D_FILE_OFFSET_BITS=64 -std=gnu99 -Wno-unused-parameter -Wno-missing-field-initializers -Wno-unused-result -Wno-format-signedness -Werror=undef -Wlogical-op -Wmissing-include-dirs -Wold-style-definition -Wpointer-arith -Winit-self -Wfloat-equal -Wsuggest-attribute=noreturn -Werror=missing-prototypes -Werror=implicit-function-declaration -Werror=missing-declarations -Werror=return-type -Werror=incompatible-pointer-types -Werror=format=2 -Wstrict-prototypes -Wredundant-decls -Wmissing-noreturn -Wimplicit-fallthrough=5 -Wshadow -Wendif-labels -Wstrict-aliasing=2 -Wwrite-strings -Werror=overflow -Werror=shift-count-overflow -Werror=shift-overflow=2 -Wdate-time -Wnested-externs -Wno-error=nonnull -Wno-maybe-uninitialized -ffast-math -fno-common -fdiagnostics-show-option -fno-strict-aliasing -fvisibility=hidden -fstack-protector -fstack-protector-strong --param=ssp-buffer-size=4 -ffunction-sections -fdata-sections -Werror=shadow -include config.h -O2 -fwrapv -Wformat -Werror=format-security -gdwarf-4 -fno-debug-types-section -fvar-tracking-assignments -g2 -Wp,-D_FORTIFY_SOURCE=2 -fstack-protector-strong --param=ssp-buffer-size=4 -Werror=trampolines -fomit-frame-pointer -march=i686 -fasynchronous-unwind-tables -mtune=pentium4 -gdwarf-4 -fno-debug-types-section -fvar-tracking-assignments -g2 -MD -MQ 'systemd-gpt-auto-generator@exe/src_gpt-auto-generator_gpt-auto-generator.c.o' -MF 'systemd-gpt-auto-generator@exe/src_gpt-auto-generator_gpt-auto-generator.c.o.d' -o 'systemd-gpt-auto-generator@exe/src_gpt-auto-generator_gpt-auto-generator.c.o' -c ../src/gpt-auto-generator/gpt-auto-generator.c
[665/1881] i686-pld-linux-gcc  -o systemd 'systemd@exe/src_core_main.c.o' -Wl,--as-needed -Wl,--no-undefined -Wl,-z,relro -Wl,-z,now -fstack-protector -Wl,--gc-sections -O2 -fwrapv -pipe -Wformat -Werror=format-security -gdwarf-4 -fno-debug-types-section -fvar-tracking-assignments -g2 -Wp,-D_FORTIFY_SOURCE=2 -fstack-protector-strong --param=ssp-buffer-size=4 -Werror=trampolines -fomit-frame-pointer -march=i686 -fasynchronous-unwind-tables -mtune=pentium4 -gdwarf-4 -fno-debug-types-section -fvar-tracking-assignments -g2 -Wl,--as-needed -Wl,--no-copy-dt-needed-entries -Wl,-z,relro -Wl,-z,combreloc -Wl,--start-group src/core/libcore.a src/core/libcore-shared.a src/shared/libsystemd-shared-245.so -pthread -lrt /usr/lib/libseccomp.so /usr/lib/libselinux.so /usr/lib/libmount.so /usr/lib/libblkid.so -lpam /usr/lib/libaudit.so /usr/lib/libkmod.so /usr/lib/libapparmor.so -Wl,--end-group '-Wl,-rpath,$ORIGIN/src/core:$ORIGIN/src/shared' -Wl,-rpath-link,/tmp/B.clK9HG/BUILD/systemd-245/build/src/core -Wl,-rpath-link,/tmp/B.clK9HG/BUILD/systemd-245/build/src/shared
[666/1881] i686-pld-linux-gcc  -o systemd-fstab-generator 'systemd-fstab-generator@exe/src_fstab-generator_fstab-generator.c.o' -Wl,--as-needed -Wl,--no-undefined -Wl,-z,relro -Wl,-z,now -fstack-protector -Wl,--gc-sections -O2 -fwrapv -pipe -Wformat -Werror=format-security -gdwarf-4 -fno-debug-types-section -fvar-tracking-assignments -g2 -Wp,-D_FORTIFY_SOURCE=2 -fstack-protector-strong --param=ssp-buffer-size=4 -Werror=trampolines -fomit-frame-pointer -march=i686 -fasynchronous-unwind-tables -mtune=pentium4 -gdwarf-4 -fno-debug-types-section -fvar-tracking-assignments -g2 -Wl,--as-needed -Wl,--no-copy-dt-needed-entries -Wl,-z,relro -Wl,-z,combreloc -Wl,--start-group src/core/libcore-shared.a src/shared/libsystemd-shared-245.so /usr/lib/libmount.so -Wl,--end-group '-Wl,-rpath,$ORIGIN/src/core:$ORIGIN/src/shared' -Wl,-rpath-link,/tmp/B.clK9HG/BUILD/systemd-245/build/src/core -Wl,-rpath-link,/tmp/B.clK9HG/BUILD/systemd-245/build/src/shared
[667/1881] i686-pld-linux-gcc  -o systemd-analyze 'systemd-analyze@exe/src_analyze_analyze.c.o' 'systemd-analyze@exe/src_analyze_analyze-condition.c.o' 'systemd-analyze@exe/src_analyze_analyze-verify.c.o' 'systemd-analyze@exe/src_analyze_analyze-security.c.o' -Wl,--as-needed -Wl,--no-undefined -Wl,-z,relro -Wl,-z,now -fstack-protector -Wl,--gc-sections -O2 -fwrapv -pipe -Wformat -Werror=format-security -gdwarf-4 -fno-debug-types-section -fvar-tracking-assignments -g2 -Wp,-D_FORTIFY_SOURCE=2 -fstack-protector-strong --param=ssp-buffer-size=4 -Werror=trampolines -fomit-frame-pointer -march=i686 -fasynchronous-unwind-tables -mtune=pentium4 -gdwarf-4 -fno-debug-types-section -fvar-tracking-assignments -g2 -Wl,--as-needed -Wl,--no-copy-dt-needed-entries -Wl,-z,relro -Wl,-z,combreloc -Wl,--start-group src/core/libcore.a src/core/libcore-shared.a src/shared/libsystemd-shared-245.so -pthread -lrt /usr/lib/libseccomp.so /usr/lib/libselinux.so /usr/lib/libmount.so /usr/lib/libblkid.so -lpam /usr/lib/libaudit.so /usr/lib/libkmod.so /usr/lib/libapparmor.so -Wl,--end-group '-Wl,-rpath,$ORIGIN/src/core:$ORIGIN/src/shared' -Wl,-rpath-link,/tmp/B.clK9HG/BUILD/systemd-245/build/src/core -Wl,-rpath-link,/tmp/B.clK9HG/BUILD/systemd-245/build/src/shared
[668/1881] i686-pld-linux-gcc  -o systemd-run-generator 'systemd-run-generator@exe/src_run-generator_run-generator.c.o' -Wl,--as-needed -Wl,--no-undefined -Wl,-z,relro -Wl,-z,now -fstack-protector -Wl,--gc-sections -O2 -fwrapv -pipe -Wformat -Werror=format-security -gdwarf-4 -fno-debug-types-section -fvar-tracking-assignments -g2 -Wp,-D_FORTIFY_SOURCE=2 -fstack-protector-strong --param=ssp-buffer-size=4 -Werror=trampolines -fomit-frame-pointer -march=i686 -fasynchronous-unwind-tables -mtune=pentium4 -gdwarf-4 -fno-debug-types-section -fvar-tracking-assignments -g2 -Wl,--as-needed -Wl,--no-copy-dt-needed-entries -Wl,-z,relro -Wl,-z,combreloc -Wl,--start-group src/shared/libsystemd-shared-245.so -Wl,--end-group '-Wl,-rpath,$ORIGIN/src/shared' -Wl,-rpath-link,/tmp/B.clK9HG/BUILD/systemd-245/build/src/shared
[669/1881] i686-pld-linux-gcc  -o 30-systemd-environment-d-generator '30-systemd-environment-d-generator@exe/src_environment-d-generator_environment-d-generator.c.o' -Wl,--as-needed -Wl,--no-undefined -Wl,-z,relro -Wl,-z,now -fstack-protector -Wl,--gc-sections -O2 -fwrapv -pipe -Wformat -Werror=format-security -gdwarf-4 -fno-debug-types-section -fvar-tracking-assignments -g2 -Wp,-D_FORTIFY_SOURCE=2 -fstack-protector-strong --param=ssp-buffer-size=4 -Werror=trampolines -fomit-frame-pointer -march=i686 -fasynchronous-unwind-tables -mtune=pentium4 -gdwarf-4 -fno-debug-types-section -fvar-tracking-assignments -g2 -Wl,--as-needed -Wl,--no-copy-dt-needed-entries -Wl,-z,relro -Wl,-z,combreloc -Wl,--start-group src/shared/libsystemd-shared-245.so -Wl,--end-group '-Wl,-rpath,$ORIGIN/src/shared' -Wl,-rpath-link,/tmp/B.clK9HG/BUILD/systemd-245/build/src/shared
[670/1881] i686-pld-linux-gcc  -o systemd-hibernate-resume 'systemd-hibernate-resume@exe/src_hibernate-resume_hibernate-resume.c.o' -Wl,--as-needed -Wl,--no-undefined -Wl,-z,relro -Wl,-z,now -fstack-protector -Wl,--gc-sections -O2 -fwrapv -pipe -Wformat -Werror=format-security -gdwarf-4 -fno-debug-types-section -fvar-tracking-assignments -g2 -Wp,-D_FORTIFY_SOURCE=2 -fstack-protector-strong --param=ssp-buffer-size=4 -Werror=trampolines -fomit-frame-pointer -march=i686 -fasynchronous-unwind-tables -mtune=pentium4 -gdwarf-4 -fno-debug-types-section -fvar-tracking-assignments -g2 -Wl,--as-needed -Wl,--no-copy-dt-needed-entries -Wl,-z,relro -Wl,-z,combreloc -Wl,--start-group src/shared/libsystemd-shared-245.so -Wl,--end-group '-Wl,-rpath,$ORIGIN/src/shared' -Wl,-rpath-link,/tmp/B.clK9HG/BUILD/systemd-245/build/src/shared
[671/1881] i686-pld-linux-gcc -Isystemd-dissect@exe -I. -I.. -Isrc/basic -I../src/basic -Isrc/boot -I../src/boot -Isrc/shared -I../src/shared -Isrc/systemd -I../src/systemd -Isrc/journal -I../src/journal -Isrc/journal-remote -I../src/journal-remote -Isrc/nspawn -I../src/nspawn -Isrc/resolve -I../src/resolve -Isrc/timesync -I../src/timesync -I../src/time-wait-sync -Isrc/login -I../src/login -Isrc/udev -I../src/udev -Isrc/libudev -I../src/libudev -Isrc/core -I../src/core -Isrc/shutdown -I../src/shutdown -I../src/libsystemd/sd-bus -I../src/libsystemd/sd-device -I../src/libsystemd/sd-event -I../src/libsystemd/sd-hwdb -I../src/libsystemd/sd-id128 -I../src/libsystemd/sd-netlink -I../src/libsystemd/sd-network -I../src/libsystemd/sd-resolve -Isrc/libsystemd-network -I../src/libsystemd-network -fdiagnostics-color=always -pipe -D_FILE_OFFSET_BITS=64 -std=gnu99 -Wno-unused-parameter -Wno-missing-field-initializers -Wno-unused-result -Wno-format-signedness -Werror=undef -Wlogical-op -Wmissing-include-dirs -Wold-style-definition -Wpointer-arith -Winit-self -Wfloat-equal -Wsuggest-attribute=noreturn -Werror=missing-prototypes -Werror=implicit-function-declaration -Werror=missing-declarations -Werror=return-type -Werror=incompatible-pointer-types -Werror=format=2 -Wstrict-prototypes -Wredundant-decls -Wmissing-noreturn -Wimplicit-fallthrough=5 -Wshadow -Wendif-labels -Wstrict-aliasing=2 -Wwrite-strings -Werror=overflow -Werror=shift-count-overflow -Werror=shift-overflow=2 -Wdate-time -Wnested-externs -Wno-error=nonnull -Wno-maybe-uninitialized -ffast-math -fno-common -fdiagnostics-show-option -fno-strict-aliasing -fvisibility=hidden -fstack-protector -fstack-protector-strong --param=ssp-buffer-size=4 -ffunction-sections -fdata-sections -Werror=shadow -include config.h -O2 -fwrapv -Wformat -Werror=format-security -gdwarf-4 -fno-debug-types-section -fvar-tracking-assignments -g2 -Wp,-D_FORTIFY_SOURCE=2 -fstack-protector-strong --param=ssp-buffer-size=4 -Werror=trampolines -fomit-frame-pointer -march=i686 -fasynchronous-unwind-tables -mtune=pentium4 -gdwarf-4 -fno-debug-types-section -fvar-tracking-assignments -g2 -MD -MQ 'systemd-dissect@exe/src_dissect_dissect.c.o' -MF 'systemd-dissect@exe/src_dissect_dissect.c.o.d' -o 'systemd-dissect@exe/src_dissect_dissect.c.o' -c ../src/dissect/dissect.c
[672/1881] i686-pld-linux-gcc -Isystemd-resolved@exe -I. -I.. -Isrc/basic -I../src/basic -Isrc/boot -I../src/boot -Isrc/shared -I../src/shared -Isrc/systemd -I../src/systemd -Isrc/journal -I../src/journal -Isrc/journal-remote -I../src/journal-remote -Isrc/nspawn -I../src/nspawn -Isrc/resolve -I../src/resolve -Isrc/timesync -I../src/timesync -I../src/time-wait-sync -Isrc/login -I../src/login -Isrc/udev -I../src/udev -Isrc/libudev -I../src/libudev -Isrc/core -I../src/core -Isrc/shutdown -I../src/shutdown -I../src/libsystemd/sd-bus -I../src/libsystemd/sd-device -I../src/libsystemd/sd-event -I../src/libsystemd/sd-hwdb -I../src/libsystemd/sd-id128 -I../src/libsystemd/sd-netlink -I../src/libsystemd/sd-network -I../src/libsystemd/sd-resolve -Isrc/libsystemd-network -I../src/libsystemd-network -I/usr/include/p11-kit-1 -fdiagnostics-color=always -pipe -D_FILE_OFFSET_BITS=64 -std=gnu99 -Wno-unused-parameter -Wno-missing-field-initializers -Wno-unused-result -Wno-format-signedness -Werror=undef -Wlogical-op -Wmissing-include-dirs -Wold-style-definition -Wpointer-arith -Winit-self -Wfloat-equal -Wsuggest-attribute=noreturn -Werror=missing-prototypes -Werror=implicit-function-declaration -Werror=missing-declarations -Werror=return-type -Werror=incompatible-pointer-types -Werror=format=2 -Wstrict-prototypes -Wredundant-decls -Wmissing-noreturn -Wimplicit-fallthrough=5 -Wshadow -Wendif-labels -Wstrict-aliasing=2 -Wwrite-strings -Werror=overflow -Werror=shift-count-overflow -Werror=shift-overflow=2 -Wdate-time -Wnested-externs -Wno-error=nonnull -Wno-maybe-uninitialized -ffast-math -fno-common -fdiagnostics-show-option -fno-strict-aliasing -fvisibility=hidden -fstack-protector -fstack-protector-strong --param=ssp-buffer-size=4 -ffunction-sections -fdata-sections -Werror=shadow -include config.h -O2 -fwrapv -Wformat -Werror=format-security -gdwarf-4 -fno-debug-types-section -fvar-tracking-assignments -g2 -Wp,-D_FORTIFY_SOURCE=2 -fstack-protector-strong --param=ssp-buffer-size=4 -Werror=trampolines -fomit-frame-pointer -march=i686 -fasynchronous-unwind-tables -mtune=pentium4 -gdwarf-4 -fno-debug-types-section -fvar-tracking-assignments -g2 -pthread -MD -MQ 'systemd-resolved@exe/meson-generated_.._src_resolve_resolved-gperf.c.o' -MF 'systemd-resolved@exe/meson-generated_.._src_resolve_resolved-gperf.c.o.d' -o 'systemd-resolved@exe/meson-generated_.._src_resolve_resolved-gperf.c.o' -c src/resolve/resolved-gperf.c
Terminated
ended at: Wed Jun 10 10:53:02 2020, done in 0:00:45.942353
[673/1881] i686-pld-linux-gcc  -o systemd-hibernate-resume-generator 'systemd-hibernate-resume-generator@exe/src_hibernate-resume_hibernate-resume-generator.c.o' -Wl,--as-needed -Wl,--no-undefined -Wl,-z,relro -Wl,-z,now -fstack-protector -Wl,--gc-sections -O2 -fwrapv -pipe -Wformat -Werror=format-security -gdwarf-4 -fno-debug-types-section -fvar-tracking-assignments -g2 -Wp,-D_FORTIFY_SOURCE=2 -fstack-protector-strong --param=ssp-buffer-size=4 -Werror=trampolines -fomit-frame-pointer -march=i686 -fasynchronous-unwind-tables -mtune=pentium4 -gdwarf-4 -fno-debug-types-section -fvar-tracking-assignments -g2 -Wl,--as-needed -Wl,--no-copy-dt-needed-entries -Wl,-z,relro -Wl,-z,combreloc -Wl,--start-group src/shared/libsystemd-shared-245.so -Wl,--end-group '-Wl,-rpath,$ORIGIN/src/shared' -Wl,-rpath-link,/tmp/B.clK9HG/BUILD/systemd-245/build/src/shared
error: No files produced.
[674/1881] i686-pld-linux-gcc  -o systemd-gpt-auto-generator 'systemd-gpt-auto-generator@exe/src_gpt-auto-generator_gpt-auto-generator.c.o' -Wl,--as-needed -Wl,--no-undefined -Wl,-z,relro -Wl,-z,now -fstack-protector -Wl,--gc-sections -O2 -fwrapv -pipe -Wformat -Werror=format-security -gdwarf-4 -fno-debug-types-section -fvar-tracking-assignments -g2 -Wp,-D_FORTIFY_SOURCE=2 -fstack-protector-strong --param=ssp-buffer-size=4 -Werror=trampolines -fomit-frame-pointer -march=i686 -fasynchronous-unwind-tables -mtune=pentium4 -gdwarf-4 -fno-debug-types-section -fvar-tracking-assignments -g2 -Wl,--as-needed -Wl,--no-copy-dt-needed-entries -Wl,-z,relro -Wl,-z,combreloc -Wl,--start-group src/shared/libsystemd-shared-245.so /usr/lib/libblkid.so -Wl,--end-group '-Wl,-rpath,$ORIGIN/src/shared' -Wl,-rpath-link,/tmp/B.clK9HG/BUILD/systemd-245/build/src/shared
[675/1881] i686-pld-linux-gcc -Isystemd-resolved@exe -I. -I.. -Isrc/basic -I../src/basic -Isrc/boot -I../src/boot -Isrc/shared -I../src/shared -Isrc/systemd -I../src/systemd -Isrc/journal -I../src/journal -Isrc/journal-remote -I../src/journal-remote -Isrc/nspawn -I../src/nspawn -Isrc/resolve -I../src/resolve -Isrc/timesync -I../src/timesync -I../src/time-wait-sync -Isrc/login -I../src/login -Isrc/udev -I../src/udev -Isrc/libudev -I../src/libudev -Isrc/core -I../src/core -Isrc/shutdown -I../src/shutdown -I../src/libsystemd/sd-bus -I../src/libsystemd/sd-device -I../src/libsystemd/sd-event -I../src/libsystemd/sd-hwdb -I../src/libsystemd/sd-id128 -I../src/libsystemd/sd-netlink -I../src/libsystemd/sd-network -I../src/libsystemd/sd-resolve -Isrc/libsystemd-network -I../src/libsystemd-network -I/usr/include/p11-kit-1 -fdiagnostics-color=always -pipe -D_FILE_OFFSET_BITS=64 -std=gnu99 -Wno-unused-parameter -Wno-missing-field-initializers -Wno-unused-result -Wno-format-signedness -Werror=undef -Wlogical-op -Wmissing-include-dirs -Wold-style-definition -Wpointer-arith -Winit-self -Wfloat-equal -Wsuggest-attribute=noreturn -Werror=missing-prototypes -Werror=implicit-function-declaration -Werror=missing-declarations -Werror=return-type -Werror=incompatible-pointer-types -Werror=format=2 -Wstrict-prototypes -Wredundant-decls -Wmissing-noreturn -Wimplicit-fallthrough=5 -Wshadow -Wendif-labels -Wstrict-aliasing=2 -Wwrite-strings -Werror=overflow -Werror=shift-count-overflow -Werror=shift-overflow=2 -Wdate-time -Wnested-externs -Wno-error=nonnull -Wno-maybe-uninitialized -ffast-math -fno-common -fdiagnostics-show-option -fno-strict-aliasing -fvisibility=hidden -fstack-protector -fstack-protector-strong --param=ssp-buffer-size=4 -ffunction-sections -fdata-sections -Werror=shadow -include config.h -O2 -fwrapv -Wformat -Werror=format-security -gdwarf-4 -fno-debug-types-section -fvar-tracking-assignments -g2 -Wp,-D_FORTIFY_SOURCE=2 -fstack-protector-strong --param=ssp-buffer-size=4 -Werror=trampolines -fomit-frame-pointer -march=i686 -fasynchronous-unwind-tables -mtune=pentium4 -gdwarf-4 -fno-debug-types-section -fvar-tracking-assignments -g2 -pthread -MD -MQ 'systemd-resolved@exe/meson-generated_.._src_resolve_resolved-dnssd-gperf.c.o' -MF 'systemd-resolved@exe/meson-generated_.._src_resolve_resolved-dnssd-gperf.c.o.d' -o 'systemd-resolved@exe/meson-generated_.._src_resolve_resolved-dnssd-gperf.c.o' -c src/resolve/resolved-dnssd-gperf.c
+ chmod -R u+rwX /tmp/B.clK9HG/BUILD
[676/1881] i686-pld-linux-gcc  -o systemd-dissect 'systemd-dissect@exe/src_dissect_dissect.c.o' -Wl,--as-needed -Wl,--no-undefined -Wl,-z,relro -Wl,-z,now -fstack-protector -Wl,--gc-sections -O2 -fwrapv -pipe -Wformat -Werror=format-security -gdwarf-4 -fno-debug-types-section -fvar-tracking-assignments -g2 -Wp,-D_FORTIFY_SOURCE=2 -fstack-protector-strong --param=ssp-buffer-size=4 -Werror=trampolines -fomit-frame-pointer -march=i686 -fasynchronous-unwind-tables -mtune=pentium4 -gdwarf-4 -fno-debug-types-section -fvar-tracking-assignments -g2 -Wl,--as-needed -Wl,--no-copy-dt-needed-entries -Wl,-z,relro -Wl,-z,combreloc -Wl,--start-group src/shared/libsystemd-shared-245.so -Wl,--end-group '-Wl,-rpath,$ORIGIN/src/shared' -Wl,-rpath-link,/tmp/B.clK9HG/BUILD/systemd-245/build/src/shared
[677/1881] i686-pld-linux-gcc -Isystemd-resolved@exe -I. -I.. -Isrc/basic -I../src/basic -Isrc/boot -I../src/boot -Isrc/shared -I../src/shared -Isrc/systemd -I../src/systemd -Isrc/journal -I../src/journal -Isrc/journal-remote -I../src/journal-remote -Isrc/nspawn -I../src/nspawn -Isrc/resolve -I../src/resolve -Isrc/timesync -I../src/timesync -I../src/time-wait-sync -Isrc/login -I../src/login -Isrc/udev -I../src/udev -Isrc/libudev -I../src/libudev -Isrc/core -I../src/core -Isrc/shutdown -I../src/shutdown -I../src/libsystemd/sd-bus -I../src/libsystemd/sd-device -I../src/libsystemd/sd-event -I../src/libsystemd/sd-hwdb -I../src/libsystemd/sd-id128 -I../src/libsystemd/sd-netlink -I../src/libsystemd/sd-network -I../src/libsystemd/sd-resolve -Isrc/libsystemd-network -I../src/libsystemd-network -I/usr/include/p11-kit-1 -fdiagnostics-color=always -pipe -D_FILE_OFFSET_BITS=64 -std=gnu99 -Wno-unused-parameter -Wno-missing-field-initializers -Wno-unused-result -Wno-format-signedness -Werror=undef -Wlogical-op -Wmissing-include-dirs -Wold-style-definition -Wpointer-arith -Winit-self -Wfloat-equal -Wsuggest-attribute=noreturn -Werror=missing-prototypes -Werror=implicit-function-declaration -Werror=missing-declarations -Werror=return-type -Werror=incompatible-pointer-types -Werror=format=2 -Wstrict-prototypes -Wredundant-decls -Wmissing-noreturn -Wimplicit-fallthrough=5 -Wshadow -Wendif-labels -Wstrict-aliasing=2 -Wwrite-strings -Werror=overflow -Werror=shift-count-overflow -Werror=shift-overflow=2 -Wdate-time -Wnested-externs -Wno-error=nonnull -Wno-maybe-uninitialized -ffast-math -fno-common -fdiagnostics-show-option -fno-strict-aliasing -fvisibility=hidden -fstack-protector -fstack-protector-strong --param=ssp-buffer-size=4 -ffunction-sections -fdata-sections -Werror=shadow -include config.h -O2 -fwrapv -Wformat -Werror=format-security -gdwarf-4 -fno-debug-types-section -fvar-tracking-assignments -g2 -Wp,-D_FORTIFY_SOURCE=2 -fstack-protector-strong --param=ssp-buffer-size=4 -Werror=trampolines -fomit-frame-pointer -march=i686 -fasynchronous-unwind-tables -mtune=pentium4 -gdwarf-4 -fno-debug-types-section -fvar-tracking-assignments -g2 -pthread -MD -MQ 'systemd-resolved@exe/src_resolve_resolved-dnssd-bus.c.o' -MF 'systemd-resolved@exe/src_resolve_resolved-dnssd-bus.c.o.d' -o 'systemd-resolved@exe/src_resolve_resolved-dnssd-bus.c.o' -c ../src/resolve/resolved-dnssd-bus.c
[678/1881] i686-pld-linux-gcc -Isystemd-resolved@exe -I. -I.. -Isrc/basic -I../src/basic -Isrc/boot -I../src/boot -Isrc/shared -I../src/shared -Isrc/systemd -I../src/systemd -Isrc/journal -I../src/journal -Isrc/journal-remote -I../src/journal-remote -Isrc/nspawn -I../src/nspawn -Isrc/resolve -I../src/resolve -Isrc/timesync -I../src/timesync -I../src/time-wait-sync -Isrc/login -I../src/login -Isrc/udev -I../src/udev -Isrc/libudev -I../src/libudev -Isrc/core -I../src/core -Isrc/shutdown -I../src/shutdown -I../src/libsystemd/sd-bus -I../src/libsystemd/sd-device -I../src/libsystemd/sd-event -I../src/libsystemd/sd-hwdb -I../src/libsystemd/sd-id128 -I../src/libsystemd/sd-netlink -I../src/libsystemd/sd-network -I../src/libsystemd/sd-resolve -Isrc/libsystemd-network -I../src/libsystemd-network -I/usr/include/p11-kit-1 -fdiagnostics-color=always -pipe -D_FILE_OFFSET_BITS=64 -std=gnu99 -Wno-unused-parameter -Wno-missing-field-initializers -Wno-unused-result -Wno-format-signedness -Werror=undef -Wlogical-op -Wmissing-include-dirs -Wold-style-definition -Wpointer-arith -Winit-self -Wfloat-equal -Wsuggest-attribute=noreturn -Werror=missing-prototypes -Werror=implicit-function-declaration -Werror=missing-declarations -Werror=return-type -Werror=incompatible-pointer-types -Werror=format=2 -Wstrict-prototypes -Wredundant-decls -Wmissing-noreturn -Wimplicit-fallthrough=5 -Wshadow -Wendif-labels -Wstrict-aliasing=2 -Wwrite-strings -Werror=overflow -Werror=shift-count-overflow -Werror=shift-overflow=2 -Wdate-time -Wnested-externs -Wno-error=nonnull -Wno-maybe-uninitialized -ffast-math -fno-common -fdiagnostics-show-option -fno-strict-aliasing -fvisibility=hidden -fstack-protector -fstack-protector-strong --param=ssp-buffer-size=4 -ffunction-sections -fdata-sections -Werror=shadow -include config.h -O2 -fwrapv -Wformat -Werror=format-security -gdwarf-4 -fno-debug-types-section -fvar-tracking-assignments -g2 -Wp,-D_FORTIFY_SOURCE=2 -fstack-protector-strong --param=ssp-buffer-size=4 -Werror=trampolines -fomit-frame-pointer -march=i686 -fasynchronous-unwind-tables -mtune=pentium4 -gdwarf-4 -fno-debug-types-section -fvar-tracking-assignments -g2 -pthread -MD -MQ 'systemd-resolved@exe/src_resolve_resolved.c.o' -MF 'systemd-resolved@exe/src_resolve_resolved.c.o.d' -o 'systemd-resolved@exe/src_resolve_resolved.c.o' -c ../src/resolve/resolved.c
+ rm -rf /tmp/B.clK9HG/tmp /tmp/B.clK9HG/BUILD
[679/1881] i686-pld-linux-gcc -Isystemd-resolved@exe -I. -I.. -Isrc/basic -I../src/basic -Isrc/boot -I../src/boot -Isrc/shared -I../src/shared -Isrc/systemd -I../src/systemd -Isrc/journal -I../src/journal -Isrc/journal-remote -I../src/journal-remote -Isrc/nspawn -I../src/nspawn -Isrc/resolve -I../src/resolve -Isrc/timesync -I../src/timesync -I../src/time-wait-sync -Isrc/login -I../src/login -Isrc/udev -I../src/udev -Isrc/libudev -I../src/libudev -Isrc/core -I../src/core -Isrc/shutdown -I../src/shutdown -I../src/libsystemd/sd-bus -I../src/libsystemd/sd-device -I../src/libsystemd/sd-event -I../src/libsystemd/sd-hwdb -I../src/libsystemd/sd-id128 -I../src/libsystemd/sd-netlink -I../src/libsystemd/sd-network -I../src/libsystemd/sd-resolve -Isrc/libsystemd-network -I../src/libsystemd-network -I/usr/include/p11-kit-1 -fdiagnostics-color=always -pipe -D_FILE_OFFSET_BITS=64 -std=gnu99 -Wno-unused-parameter -Wno-missing-field-initializers -Wno-unused-result -Wno-format-signedness -Werror=undef -Wlogical-op -Wmissing-include-dirs -Wold-style-definition -Wpointer-arith -Winit-self -Wfloat-equal -Wsuggest-attribute=noreturn -Werror=missing-prototypes -Werror=implicit-function-declaration -Werror=missing-declarations -Werror=return-type -Werror=incompatible-pointer-types -Werror=format=2 -Wstrict-prototypes -Wredundant-decls -Wmissing-noreturn -Wimplicit-fallthrough=5 -Wshadow -Wendif-labels -Wstrict-aliasing=2 -Wwrite-strings -Werror=overflow -Werror=shift-count-overflow -Werror=shift-overflow=2 -Wdate-time -Wnested-externs -Wno-error=nonnull -Wno-maybe-uninitialized -ffast-math -fno-common -fdiagnostics-show-option -fno-strict-aliasing -fvisibility=hidden -fstack-protector -fstack-protector-strong --param=ssp-buffer-size=4 -ffunction-sections -fdata-sections -Werror=shadow -include config.h -O2 -fwrapv -Wformat -Werror=format-security -gdwarf-4 -fno-debug-types-section -fvar-tracking-assignments -g2 -Wp,-D_FORTIFY_SOURCE=2 -fstack-protector-strong --param=ssp-buffer-size=4 -Werror=trampolines -fomit-frame-pointer -march=i686 -fasynchronous-unwind-tables -mtune=pentium4 -gdwarf-4 -fno-debug-types-section -fvar-tracking-assignments -g2 -pthread -MD -MQ 'systemd-resolved@exe/src_resolve_resolved-resolv-conf.c.o' -MF 'systemd-resolved@exe/src_resolve_resolved-resolv-conf.c.o.d' -o 'systemd-resolved@exe/src_resolve_resolved-resolv-conf.c.o' -c ../src/resolve/resolved-resolv-conf.c
[680/1881] i686-pld-linux-gcc -Iloginctl@exe -I. -I.. -Isrc/basic -I../src/basic -Isrc/boot -I../src/boot -Isrc/shared -I../src/shared -Isrc/systemd -I../src/systemd -Isrc/journal -I../src/journal -Isrc/journal-remote -I../src/journal-remote -Isrc/nspawn -I../src/nspawn -Isrc/resolve -I../src/resolve -Isrc/timesync -I../src/timesync -I../src/time-wait-sync -Isrc/login -I../src/login -Isrc/udev -I../src/udev -Isrc/libudev -I../src/libudev -Isrc/core -I../src/core -Isrc/shutdown -I../src/shutdown -I../src/libsystemd/sd-bus -I../src/libsystemd/sd-device -I../src/libsystemd/sd-event -I../src/libsystemd/sd-hwdb -I../src/libsystemd/sd-id128 -I../src/libsystemd/sd-netlink -I../src/libsystemd/sd-network -I../src/libsystemd/sd-resolve -Isrc/libsystemd-network -I../src/libsystemd-network -fdiagnostics-color=always -pipe -D_FILE_OFFSET_BITS=64 -std=gnu99 -Wno-unused-parameter -Wno-missing-field-initializers -Wno-unused-result -Wno-format-signedness -Werror=undef -Wlogical-op -Wmissing-include-dirs -Wold-style-definition -Wpointer-arith -Winit-self -Wfloat-equal -Wsuggest-attribute=noreturn -Werror=missing-prototypes -Werror=implicit-function-declaration -Werror=missing-declarations -Werror=return-type -Werror=incompatible-pointer-types -Werror=format=2 -Wstrict-prototypes -Wredundant-decls -Wmissing-noreturn -Wimplicit-fallthrough=5 -Wshadow -Wendif-labels -Wstrict-aliasing=2 -Wwrite-strings -Werror=overflow -Werror=shift-count-overflow -Werror=shift-overflow=2 -Wdate-time -Wnested-externs -Wno-error=nonnull -Wno-maybe-uninitialized -ffast-math -fno-common -fdiagnostics-show-option -fno-strict-aliasing -fvisibility=hidden -fstack-protector -fstack-protector-strong --param=ssp-buffer-size=4 -ffunction-sections -fdata-sections -Werror=shadow -include config.h -O2 -fwrapv -Wformat -Werror=format-security -gdwarf-4 -fno-debug-types-section -fvar-tracking-assignments -g2 -Wp,-D_FORTIFY_SOURCE=2 -fstack-protector-strong --param=ssp-buffer-size=4 -Werror=trampolines -fomit-frame-pointer -march=i686 -fasynchronous-unwind-tables -mtune=pentium4 -gdwarf-4 -fno-debug-types-section -fvar-tracking-assignments -g2 -pthread -MD -MQ 'loginctl@exe/src_login_loginctl.c.o' -MF 'loginctl@exe/src_login_loginctl.c.o.d' -o 'loginctl@exe/src_login_loginctl.c.o' -c ../src/login/loginctl.c
FAILED: loginctl@exe/src_login_loginctl.c.o 
i686-pld-linux-gcc -Iloginctl@exe -I. -I.. -Isrc/basic -I../src/basic -Isrc/boot -I../src/boot -Isrc/shared -I../src/shared -Isrc/systemd -I../src/systemd -Isrc/journal -I../src/journal -Isrc/journal-remote -I../src/journal-remote -Isrc/nspawn -I../src/nspawn -Isrc/resolve -I../src/resolve -Isrc/timesync -I../src/timesync -I../src/time-wait-sync -Isrc/login -I../src/login -Isrc/udev -I../src/udev -Isrc/libudev -I../src/libudev -Isrc/core -I../src/core -Isrc/shutdown -I../src/shutdown -I../src/libsystemd/sd-bus -I../src/libsystemd/sd-device -I../src/libsystemd/sd-event -I../src/libsystemd/sd-hwdb -I../src/libsystemd/sd-id128 -I../src/libsystemd/sd-netlink -I../src/libsystemd/sd-network -I../src/libsystemd/sd-resolve -Isrc/libsystemd-network -I../src/libsystemd-network -fdiagnostics-color=always -pipe -D_FILE_OFFSET_BITS=64 -std=gnu99 -Wno-unused-parameter -Wno-missing-field-initializers -Wno-unused-result -Wno-format-signedness -Werror=undef -Wlogical-op -Wmissing-include-dirs -Wold-style-definition -Wpointer-arith -Winit-self -Wfloat-equal -Wsuggest-attribute=noreturn -Werror=missing-prototypes -Werror=implicit-function-declaration -Werror=missing-declarations -Werror=return-type -Werror=incompatible-pointer-types -Werror=format=2 -Wstrict-prototypes -Wredundant-decls -Wmissing-noreturn -Wimplicit-fallthrough=5 -Wshadow -Wendif-labels -Wstrict-aliasing=2 -Wwrite-strings -Werror=overflow -Werror=shift-count-overflow -Werror=shift-overflow=2 -Wdate-time -Wnested-externs -Wno-error=nonnull -Wno-maybe-uninitialized -ffast-math -fno-common -fdiagnostics-show-option -fno-strict-aliasing -fvisibility=hidden -fstack-protector -fstack-protector-strong --param=ssp-buffer-size=4 -ffunction-sections -fdata-sections -Werror=shadow -include config.h -O2 -fwrapv -Wformat -Werror=format-security -gdwarf-4 -fno-debug-types-section -fvar-tracking-assignments -g2 -Wp,-D_FORTIFY_SOURCE=2 -fstack-protector-strong --param=ssp-buffer-size=4 -Werror=trampolines -fomit-frame-pointer -march=i686 -fasynchronous-unwind-tables -mtune=pentium4 -gdwarf-4 -fno-debug-types-section -fvar-tracking-assignments -g2 -pthread -MD -MQ 'loginctl@exe/src_login_loginctl.c.o' -MF 'loginctl@exe/src_login_loginctl.c.o.d' -o 'loginctl@exe/src_login_loginctl.c.o' -c ../src/login/loginctl.c
In file included from ../src/login/loginctl.c:11:
../src/libsystemd/sd-bus/bus-error.h:8:10: fatal error: macro.h: No such file or directory
    8 | #include "macro.h"
      |          ^~~~~~~~~
compilation terminated.
[681/1881] i686-pld-linux-gcc -Isystemd-resolved@exe -I. -I.. -Isrc/basic -I../src/basic -Isrc/boot -I../src/boot -Isrc/shared -I../src/shared -Isrc/systemd -I../src/systemd -Isrc/journal -I../src/journal -Isrc/journal-remote -I../src/journal-remote -Isrc/nspawn -I../src/nspawn -Isrc/resolve -I../src/resolve -Isrc/timesync -I../src/timesync -I../src/time-wait-sync -Isrc/login -I../src/login -Isrc/udev -I../src/udev -Isrc/libudev -I../src/libudev -Isrc/core -I../src/core -Isrc/shutdown -I../src/shutdown -I../src/libsystemd/sd-bus -I../src/libsystemd/sd-device -I../src/libsystemd/sd-event -I../src/libsystemd/sd-hwdb -I../src/libsystemd/sd-id128 -I../src/libsystemd/sd-netlink -I../src/libsystemd/sd-network -I../src/libsystemd/sd-resolve -Isrc/libsystemd-network -I../src/libsystemd-network -I/usr/include/p11-kit-1 -fdiagnostics-color=always -pipe -D_FILE_OFFSET_BITS=64 -std=gnu99 -Wno-unused-parameter -Wno-missing-field-initializers -Wno-unused-result -Wno-format-signedness -Werror=undef -Wlogical-op -Wmissing-include-dirs -Wold-style-definition -Wpointer-arith -Winit-self -Wfloat-equal -Wsuggest-attribute=noreturn -Werror=missing-prototypes -Werror=implicit-function-declaration -Werror=missing-declarations -Werror=return-type -Werror=incompatible-pointer-types -Werror=format=2 -Wstrict-prototypes -Wredundant-decls -Wmissing-noreturn -Wimplicit-fallthrough=5 -Wshadow -Wendif-labels -Wstrict-aliasing=2 -Wwrite-strings -Werror=overflow -Werror=shift-count-overflow -Werror=shift-overflow=2 -Wdate-time -Wnested-externs -Wno-error=nonnull -Wno-maybe-uninitialized -ffast-math -fno-common -fdiagnostics-show-option -fno-strict-aliasing -fvisibility=hidden -fstack-protector -fstack-protector-strong --param=ssp-buffer-size=4 -ffunction-sections -fdata-sections -Werror=shadow -include config.h -O2 -fwrapv -Wformat -Werror=format-security -gdwarf-4 -fno-debug-types-section -fvar-tracking-assignments -g2 -Wp,-D_FORTIFY_SOURCE=2 -fstack-protector-strong --param=ssp-buffer-size=4 -Werror=trampolines -fomit-frame-pointer -march=i686 -fasynchronous-unwind-tables -mtune=pentium4 -gdwarf-4 -fno-debug-types-section -fvar-tracking-assignments -g2 -pthread -MD -MQ 'systemd-resolved@exe/src_resolve_resolved-link-bus.c.o' -MF 'systemd-resolved@exe/src_resolve_resolved-link-bus.c.o.d' -o 'systemd-resolved@exe/src_resolve_resolved-link-bus.c.o' -c ../src/resolve/resolved-link-bus.c
FAILED: systemd-resolved@exe/src_resolve_resolved-link-bus.c.o 
i686-pld-linux-gcc -Isystemd-resolved@exe -I. -I.. -Isrc/basic -I../src/basic -Isrc/boot -I../src/boot -Isrc/shared -I../src/shared -Isrc/systemd -I../src/systemd -Isrc/journal -I../src/journal -Isrc/journal-remote -I../src/journal-remote -Isrc/nspawn -I../src/nspawn -Isrc/resolve -I../src/resolve -Isrc/timesync -I../src/timesync -I../src/time-wait-sync -Isrc/login -I../src/login -Isrc/udev -I../src/udev -Isrc/libudev -I../src/libudev -Isrc/core -I../src/core -Isrc/shutdown -I../src/shutdown -I../src/libsystemd/sd-bus -I../src/libsystemd/sd-device -I../src/libsystemd/sd-event -I../src/libsystemd/sd-hwdb -I../src/libsystemd/sd-id128 -I../src/libsystemd/sd-netlink -I../src/libsystemd/sd-network -I../src/libsystemd/sd-resolve -Isrc/libsystemd-network -I../src/libsystemd-network -I/usr/include/p11-kit-1 -fdiagnostics-color=always -pipe -D_FILE_OFFSET_BITS=64 -std=gnu99 -Wno-unused-parameter -Wno-missing-field-initializers -Wno-unused-result -Wno-format-signedness -Werror=undef -Wlogical-op -Wmissing-include-dirs -Wold-style-definition -Wpointer-arith -Winit-self -Wfloat-equal -Wsuggest-attribute=noreturn -Werror=missing-prototypes -Werror=implicit-function-declaration -Werror=missing-declarations -Werror=return-type -Werror=incompatible-pointer-types -Werror=format=2 -Wstrict-prototypes -Wredundant-decls -Wmissing-noreturn -Wimplicit-fallthrough=5 -Wshadow -Wendif-labels -Wstrict-aliasing=2 -Wwrite-strings -Werror=overflow -Werror=shift-count-overflow -Werror=shift-overflow=2 -Wdate-time -Wnested-externs -Wno-error=nonnull -Wno-maybe-uninitialized -ffast-math -fno-common -fdiagnostics-show-option -fno-strict-aliasing -fvisibility=hidden -fstack-protector -fstack-protector-strong --param=ssp-buffer-size=4 -ffunction-sections -fdata-sections -Werror=shadow -include config.h -O2 -fwrapv -Wformat -Werror=format-security -gdwarf-4 -fno-debug-types-section -fvar-tracking-assignments -g2 -Wp,-D_FORTIFY_SOURCE=2 -fstack-protector-strong --param=ssp-buffer-size=4 -Werror=trampolines -fomit-frame-pointer -march=i686 -fasynchronous-unwind-tables -mtune=pentium4 -gdwarf-4 -fno-debug-types-section -fvar-tracking-assignments -g2 -pthread -MD -MQ 'systemd-resolved@exe/src_resolve_resolved-link-bus.c.o' -MF 'systemd-resolved@exe/src_resolve_resolved-link-bus.c.o.d' -o 'systemd-resolved@exe/src_resolve_resolved-link-bus.c.o' -c ../src/resolve/resolved-link-bus.c
../src/resolve/resolved-link-bus.c:7:10: fatal error: alloc-util.h: No such file or directory
    7 | #include "alloc-util.h"
      |          ^~~~~~~~~~~~~~
compilation terminated.
[682/1881] i686-pld-linux-gcc -Iloginctl@exe -I. -I.. -Isrc/basic -I../src/basic -Isrc/boot -I../src/boot -Isrc/shared -I../src/shared -Isrc/systemd -I../src/systemd -Isrc/journal -I../src/journal -Isrc/journal-remote -I../src/journal-remote -Isrc/nspawn -I../src/nspawn -Isrc/resolve -I../src/resolve -Isrc/timesync -I../src/timesync -I../src/time-wait-sync -Isrc/login -I../src/login -Isrc/udev -I../src/udev -Isrc/libudev -I../src/libudev -Isrc/core -I../src/core -Isrc/shutdown -I../src/shutdown -I../src/libsystemd/sd-bus -I../src/libsystemd/sd-device -I../src/libsystemd/sd-event -I../src/libsystemd/sd-hwdb -I../src/libsystemd/sd-id128 -I../src/libsystemd/sd-netlink -I../src/libsystemd/sd-network -I../src/libsystemd/sd-resolve -Isrc/libsystemd-network -I../src/libsystemd-network -fdiagnostics-color=always -pipe -D_FILE_OFFSET_BITS=64 -std=gnu99 -Wno-unused-parameter -Wno-missing-field-initializers -Wno-unused-result -Wno-format-signedness -Werror=undef -Wlogical-op -Wmissing-include-dirs -Wold-style-definition -Wpointer-arith -Winit-self -Wfloat-equal -Wsuggest-attribute=noreturn -Werror=missing-prototypes -Werror=implicit-function-declaration -Werror=missing-declarations -Werror=return-type -Werror=incompatible-pointer-types -Werror=format=2 -Wstrict-prototypes -Wredundant-decls -Wmissing-noreturn -Wimplicit-fallthrough=5 -Wshadow -Wendif-labels -Wstrict-aliasing=2 -Wwrite-strings -Werror=overflow -Werror=shift-count-overflow -Werror=shift-overflow=2 -Wdate-time -Wnested-externs -Wno-error=nonnull -Wno-maybe-uninitialized -ffast-math -fno-common -fdiagnostics-show-option -fno-strict-aliasing -fvisibility=hidden -fstack-protector -fstack-protector-strong --param=ssp-buffer-size=4 -ffunction-sections -fdata-sections -Werror=shadow -include config.h -O2 -fwrapv -Wformat -Werror=format-security -gdwarf-4 -fno-debug-types-section -fvar-tracking-assignments -g2 -Wp,-D_FORTIFY_SOURCE=2 -fstack-protector-strong --param=ssp-buffer-size=4 -Werror=trampolines -fomit-frame-pointer -march=i686 -fasynchronous-unwind-tables -mtune=pentium4 -gdwarf-4 -fno-debug-types-section -fvar-tracking-assignments -g2 -pthread -MD -MQ 'loginctl@exe/src_login_sysfs-show.c.o' -MF 'loginctl@exe/src_login_sysfs-show.c.o.d' -o 'loginctl@exe/src_login_sysfs-show.c.o' -c ../src/login/sysfs-show.c
FAILED: loginctl@exe/src_login_sysfs-show.c.o 
i686-pld-linux-gcc -Iloginctl@exe -I. -I.. -Isrc/basic -I../src/basic -Isrc/boot -I../src/boot -Isrc/shared -I../src/shared -Isrc/systemd -I../src/systemd -Isrc/journal -I../src/journal -Isrc/journal-remote -I../src/journal-remote -Isrc/nspawn -I../src/nspawn -Isrc/resolve -I../src/resolve -Isrc/timesync -I../src/timesync -I../src/time-wait-sync -Isrc/login -I../src/login -Isrc/udev -I../src/udev -Isrc/libudev -I../src/libudev -Isrc/core -I../src/core -Isrc/shutdown -I../src/shutdown -I../src/libsystemd/sd-bus -I../src/libsystemd/sd-device -I../src/libsystemd/sd-event -I../src/libsystemd/sd-hwdb -I../src/libsystemd/sd-id128 -I../src/libsystemd/sd-netlink -I../src/libsystemd/sd-network -I../src/libsystemd/sd-resolve -Isrc/libsystemd-network -I../src/libsystemd-network -fdiagnostics-color=always -pipe -D_FILE_OFFSET_BITS=64 -std=gnu99 -Wno-unused-parameter -Wno-missing-field-initializers -Wno-unused-result -Wno-format-signedness -Werror=undef -Wlogical-op -Wmissing-include-dirs -Wold-style-definition -Wpointer-arith -Winit-self -Wfloat-equal -Wsuggest-attribute=noreturn -Werror=missing-prototypes -Werror=implicit-function-declaration -Werror=missing-declarations -Werror=return-type -Werror=incompatible-pointer-types -Werror=format=2 -Wstrict-prototypes -Wredundant-decls -Wmissing-noreturn -Wimplicit-fallthrough=5 -Wshadow -Wendif-labels -Wstrict-aliasing=2 -Wwrite-strings -Werror=overflow -Werror=shift-count-overflow -Werror=shift-overflow=2 -Wdate-time -Wnested-externs -Wno-error=nonnull -Wno-maybe-uninitialized -ffast-math -fno-common -fdiagnostics-show-option -fno-strict-aliasing -fvisibility=hidden -fstack-protector -fstack-protector-strong --param=ssp-buffer-size=4 -ffunction-sections -fdata-sections -Werror=shadow -include config.h -O2 -fwrapv -Wformat -Werror=format-security -gdwarf-4 -fno-debug-types-section -fvar-tracking-assignments -g2 -Wp,-D_FORTIFY_SOURCE=2 -fstack-protector-strong --param=ssp-buffer-size=4 -Werror=trampolines -fomit-frame-pointer -march=i686 -fasynchronous-unwind-tables -mtune=pentium4 -gdwarf-4 -fno-debug-types-section -fvar-tracking-assignments -g2 -pthread -MD -MQ 'loginctl@exe/src_login_sysfs-show.c.o' -MF 'loginctl@exe/src_login_sysfs-show.c.o.d' -o 'loginctl@exe/src_login_sysfs-show.c.o' -c ../src/login/sysfs-show.c
../src/login/sysfs-show.c:7:10: fatal error: alloc-util.h: No such file or directory
    7 | #include "alloc-util.h"
      |          ^~~~~~~~~~~~~~
compilation terminated.
[683/1881] i686-pld-linux-gcc -Isystemd-resolved@exe -I. -I.. -Isrc/basic -I../src/basic -Isrc/boot -I../src/boot -Isrc/shared -I../src/shared -Isrc/systemd -I../src/systemd -Isrc/journal -I../src/journal -Isrc/journal-remote -I../src/journal-remote -Isrc/nspawn -I../src/nspawn -Isrc/resolve -I../src/resolve -Isrc/timesync -I../src/timesync -I../src/time-wait-sync -Isrc/login -I../src/login -Isrc/udev -I../src/udev -Isrc/libudev -I../src/libudev -Isrc/core -I../src/core -Isrc/shutdown -I../src/shutdown -I../src/libsystemd/sd-bus -I../src/libsystemd/sd-device -I../src/libsystemd/sd-event -I../src/libsystemd/sd-hwdb -I../src/libsystemd/sd-id128 -I../src/libsystemd/sd-netlink -I../src/libsystemd/sd-network -I../src/libsystemd/sd-resolve -Isrc/libsystemd-network -I../src/libsystemd-network -I/usr/include/p11-kit-1 -fdiagnostics-color=always -pipe -D_FILE_OFFSET_BITS=64 -std=gnu99 -Wno-unused-parameter -Wno-missing-field-initializers -Wno-unused-result -Wno-format-signedness -Werror=undef -Wlogical-op -Wmissing-include-dirs -Wold-style-definition -Wpointer-arith -Winit-self -Wfloat-equal -Wsuggest-attribute=noreturn -Werror=missing-prototypes -Werror=implicit-function-declaration -Werror=missing-declarations -Werror=return-type -Werror=incompatible-pointer-types -Werror=format=2 -Wstrict-prototypes -Wredundant-decls -Wmissing-noreturn -Wimplicit-fallthrough=5 -Wshadow -Wendif-labels -Wstrict-aliasing=2 -Wwrite-strings -Werror=overflow -Werror=shift-count-overflow -Werror=shift-overflow=2 -Wdate-time -Wnested-externs -Wno-error=nonnull -Wno-maybe-uninitialized -ffast-math -fno-common -fdiagnostics-show-option -fno-strict-aliasing -fvisibility=hidden -fstack-protector -fstack-protector-strong --param=ssp-buffer-size=4 -ffunction-sections -fdata-sections -Werror=shadow -include config.h -O2 -fwrapv -Wformat -Werror=format-security -gdwarf-4 -fno-debug-types-section -fvar-tracking-assignments -g2 -Wp,-D_FORTIFY_SOURCE=2 -fstack-protector-strong --param=ssp-buffer-size=4 -Werror=trampolines -fomit-frame-pointer -march=i686 -fasynchronous-unwind-tables -mtune=pentium4 -gdwarf-4 -fno-debug-types-section -fvar-tracking-assignments -g2 -pthread -MD -MQ 'systemd-resolved@exe/src_resolve_resolved-dnssd.c.o' -MF 'systemd-resolved@exe/src_resolve_resolved-dnssd.c.o.d' -o 'systemd-resolved@exe/src_resolve_resolved-dnssd.c.o' -c ../src/resolve/resolved-dnssd.c
[684/1881] i686-pld-linux-gcc -Isystemd-resolved@exe -I. -I.. -Isrc/basic -I../src/basic -Isrc/boot -I../src/boot -Isrc/shared -I../src/shared -Isrc/systemd -I../src/systemd -Isrc/journal -I../src/journal -Isrc/journal-remote -I../src/journal-remote -Isrc/nspawn -I../src/nspawn -Isrc/resolve -I../src/resolve -Isrc/timesync -I../src/timesync -I../src/time-wait-sync -Isrc/login -I../src/login -Isrc/udev -I../src/udev -Isrc/libudev -I../src/libudev -Isrc/core -I../src/core -Isrc/shutdown -I../src/shutdown -I../src/libsystemd/sd-bus -I../src/libsystemd/sd-device -I../src/libsystemd/sd-event -I../src/libsystemd/sd-hwdb -I../src/libsystemd/sd-id128 -I../src/libsystemd/sd-netlink -I../src/libsystemd/sd-network -I../src/libsystemd/sd-resolve -Isrc/libsystemd-network -I../src/libsystemd-network -I/usr/include/p11-kit-1 -fdiagnostics-color=always -pipe -D_FILE_OFFSET_BITS=64 -std=gnu99 -Wno-unused-parameter -Wno-missing-field-initializers -Wno-unused-result -Wno-format-signedness -Werror=undef -Wlogical-op -Wmissing-include-dirs -Wold-style-definition -Wpointer-arith -Winit-self -Wfloat-equal -Wsuggest-attribute=noreturn -Werror=missing-prototypes -Werror=implicit-function-declaration -Werror=missing-declarations -Werror=return-type -Werror=incompatible-pointer-types -Werror=format=2 -Wstrict-prototypes -Wredundant-decls -Wmissing-noreturn -Wimplicit-fallthrough=5 -Wshadow -Wendif-labels -Wstrict-aliasing=2 -Wwrite-strings -Werror=overflow -Werror=shift-count-overflow -Werror=shift-overflow=2 -Wdate-time -Wnested-externs -Wno-error=nonnull -Wno-maybe-uninitialized -ffast-math -fno-common -fdiagnostics-show-option -fno-strict-aliasing -fvisibility=hidden -fstack-protector -fstack-protector-strong --param=ssp-buffer-size=4 -ffunction-sections -fdata-sections -Werror=shadow -include config.h -O2 -fwrapv -Wformat -Werror=format-security -gdwarf-4 -fno-debug-types-section -fvar-tracking-assignments -g2 -Wp,-D_FORTIFY_SOURCE=2 -fstack-protector-strong --param=ssp-buffer-size=4 -Werror=trampolines -fomit-frame-pointer -march=i686 -fasynchronous-unwind-tables -mtune=pentium4 -gdwarf-4 -fno-debug-types-section -fvar-tracking-assignments -g2 -pthread -MD -MQ 'systemd-resolved@exe/src_resolve_resolved-llmnr.c.o' -MF 'systemd-resolved@exe/src_resolve_resolved-llmnr.c.o.d' -o 'systemd-resolved@exe/src_resolve_resolved-llmnr.c.o' -c ../src/resolve/resolved-llmnr.c
FAILED: systemd-resolved@exe/src_resolve_resolved-llmnr.c.o 
i686-pld-linux-gcc -Isystemd-resolved@exe -I. -I.. -Isrc/basic -I../src/basic -Isrc/boot -I../src/boot -Isrc/shared -I../src/shared -Isrc/systemd -I../src/systemd -Isrc/journal -I../src/journal -Isrc/journal-remote -I../src/journal-remote -Isrc/nspawn -I../src/nspawn -Isrc/resolve -I../src/resolve -Isrc/timesync -I../src/timesync -I../src/time-wait-sync -Isrc/login -I../src/login -Isrc/udev -I../src/udev -Isrc/libudev -I../src/libudev -Isrc/core -I../src/core -Isrc/shutdown -I../src/shutdown -I../src/libsystemd/sd-bus -I../src/libsystemd/sd-device -I../src/libsystemd/sd-event -I../src/libsystemd/sd-hwdb -I../src/libsystemd/sd-id128 -I../src/libsystemd/sd-netlink -I../src/libsystemd/sd-network -I../src/libsystemd/sd-resolve -Isrc/libsystemd-network -I../src/libsystemd-network -I/usr/include/p11-kit-1 -fdiagnostics-color=always -pipe -D_FILE_OFFSET_BITS=64 -std=gnu99 -Wno-unused-parameter -Wno-missing-field-initializers -Wno-unused-result -Wno-format-signedness -Werror=undef -Wlogical-op -Wmissing-include-dirs -Wold-style-definition -Wpointer-arith -Winit-self -Wfloat-equal -Wsuggest-attribute=noreturn -Werror=missing-prototypes -Werror=implicit-function-declaration -Werror=missing-declarations -Werror=return-type -Werror=incompatible-pointer-types -Werror=format=2 -Wstrict-prototypes -Wredundant-decls -Wmissing-noreturn -Wimplicit-fallthrough=5 -Wshadow -Wendif-labels -Wstrict-aliasing=2 -Wwrite-strings -Werror=overflow -Werror=shift-count-overflow -Werror=shift-overflow=2 -Wdate-time -Wnested-externs -Wno-error=nonnull -Wno-maybe-uninitialized -ffast-math -fno-common -fdiagnostics-show-option -fno-strict-aliasing -fvisibility=hidden -fstack-protector -fstack-protector-strong --param=ssp-buffer-size=4 -ffunction-sections -fdata-sections -Werror=shadow -include config.h -O2 -fwrapv -Wformat -Werror=format-security -gdwarf-4 -fno-debug-types-section -fvar-tracking-assignments -g2 -Wp,-D_FORTIFY_SOURCE=2 -fstack-protector-strong --param=ssp-buffer-size=4 -Werror=trampolines -fomit-frame-pointer -march=i686 -fasynchronous-unwind-tables -mtune=pentium4 -gdwarf-4 -fno-debug-types-section -fvar-tracking-assignments -g2 -pthread -MD -MQ 'systemd-resolved@exe/src_resolve_resolved-llmnr.c.o' -MF 'systemd-resolved@exe/src_resolve_resolved-llmnr.c.o.d' -o 'systemd-resolved@exe/src_resolve_resolved-llmnr.c.o' -c ../src/resolve/resolved-llmnr.c
cc1: warning: ../src/basic: No such file or directory [-Wmissing-include-dirs]
cc1: warning: ../src/boot: No such file or directory [-Wmissing-include-dirs]
cc1: warning: ../src/core: No such file or directory [-Wmissing-include-dirs]
../src/resolve/resolved-llmnr.c:6:10: fatal error: errno-util.h: No such file or directory
compilation terminated.
[685/1881] i686-pld-linux-gcc -Isystemd-resolved@exe -I. -I.. -Isrc/basic -I../src/basic -Isrc/boot -I../src/boot -Isrc/shared -I../src/shared -Isrc/systemd -I../src/systemd -Isrc/journal -I../src/journal -Isrc/journal-remote -I../src/journal-remote -Isrc/nspawn -I../src/nspawn -Isrc/resolve -I../src/resolve -Isrc/timesync -I../src/timesync -I../src/time-wait-sync -Isrc/login -I../src/login -Isrc/udev -I../src/udev -Isrc/libudev -I../src/libudev -Isrc/core -I../src/core -Isrc/shutdown -I../src/shutdown -I../src/libsystemd/sd-bus -I../src/libsystemd/sd-device -I../src/libsystemd/sd-event -I../src/libsystemd/sd-hwdb -I../src/libsystemd/sd-id128 -I../src/libsystemd/sd-netlink -I../src/libsystemd/sd-network -I../src/libsystemd/sd-resolve -Isrc/libsystemd-network -I../src/libsystemd-network -I/usr/include/p11-kit-1 -fdiagnostics-color=always -pipe -D_FILE_OFFSET_BITS=64 -std=gnu99 -Wno-unused-parameter -Wno-missing-field-initializers -Wno-unused-result -Wno-format-signedness -Werror=undef -Wlogical-op -Wmissing-include-dirs -Wold-style-definition -Wpointer-arith -Winit-self -Wfloat-equal -Wsuggest-attribute=noreturn -Werror=missing-prototypes -Werror=implicit-function-declaration -Werror=missing-declarations -Werror=return-type -Werror=incompatible-pointer-types -Werror=format=2 -Wstrict-prototypes -Wredundant-decls -Wmissing-noreturn -Wimplicit-fallthrough=5 -Wshadow -Wendif-labels -Wstrict-aliasing=2 -Wwrite-strings -Werror=overflow -Werror=shift-count-overflow -Werror=shift-overflow=2 -Wdate-time -Wnested-externs -Wno-error=nonnull -Wno-maybe-uninitialized -ffast-math -fno-common -fdiagnostics-show-option -fno-strict-aliasing -fvisibility=hidden -fstack-protector -fstack-protector-strong --param=ssp-buffer-size=4 -ffunction-sections -fdata-sections -Werror=shadow -include config.h -O2 -fwrapv -Wformat -Werror=format-security -gdwarf-4 -fno-debug-types-section -fvar-tracking-assignments -g2 -Wp,-D_FORTIFY_SOURCE=2 -fstack-protector-strong --param=ssp-buffer-size=4 -Werror=trampolines -fomit-frame-pointer -march=i686 -fasynchronous-unwind-tables -mtune=pentium4 -gdwarf-4 -fno-debug-types-section -fvar-tracking-assignments -g2 -pthread -MD -MQ 'systemd-resolved@exe/src_resolve_resolved-conf.c.o' -MF 'systemd-resolved@exe/src_resolve_resolved-conf.c.o.d' -o 'systemd-resolved@exe/src_resolve_resolved-conf.c.o' -c ../src/resolve/resolved-conf.c
[686/1881] i686-pld-linux-gcc -Isystemd-resolved@exe -I. -I.. -Isrc/basic -I../src/basic -Isrc/boot -I../src/boot -Isrc/shared -I../src/shared -Isrc/systemd -I../src/systemd -Isrc/journal -I../src/journal -Isrc/journal-remote -I../src/journal-remote -Isrc/nspawn -I../src/nspawn -Isrc/resolve -I../src/resolve -Isrc/timesync -I../src/timesync -I../src/time-wait-sync -Isrc/login -I../src/login -Isrc/udev -I../src/udev -Isrc/libudev -I../src/libudev -Isrc/core -I../src/core -Isrc/shutdown -I../src/shutdown -I../src/libsystemd/sd-bus -I../src/libsystemd/sd-device -I../src/libsystemd/sd-event -I../src/libsystemd/sd-hwdb -I../src/libsystemd/sd-id128 -I../src/libsystemd/sd-netlink -I../src/libsystemd/sd-network -I../src/libsystemd/sd-resolve -Isrc/libsystemd-network -I../src/libsystemd-network -I/usr/include/p11-kit-1 -fdiagnostics-color=always -pipe -D_FILE_OFFSET_BITS=64 -std=gnu99 -Wno-unused-parameter -Wno-missing-field-initializers -Wno-unused-result -Wno-format-signedness -Werror=undef -Wlogical-op -Wmissing-include-dirs -Wold-style-definition -Wpointer-arith -Winit-self -Wfloat-equal -Wsuggest-attribute=noreturn -Werror=missing-prototypes -Werror=implicit-function-declaration -Werror=missing-declarations -Werror=return-type -Werror=incompatible-pointer-types -Werror=format=2 -Wstrict-prototypes -Wredundant-decls -Wmissing-noreturn -Wimplicit-fallthrough=5 -Wshadow -Wendif-labels -Wstrict-aliasing=2 -Wwrite-strings -Werror=overflow -Werror=shift-count-overflow -Werror=shift-overflow=2 -Wdate-time -Wnested-externs -Wno-error=nonnull -Wno-maybe-uninitialized -ffast-math -fno-common -fdiagnostics-show-option -fno-strict-aliasing -fvisibility=hidden -fstack-protector -fstack-protector-strong --param=ssp-buffer-size=4 -ffunction-sections -fdata-sections -Werror=shadow -include config.h -O2 -fwrapv -Wformat -Werror=format-security -gdwarf-4 -fno-debug-types-section -fvar-tracking-assignments -g2 -Wp,-D_FORTIFY_SOURCE=2 -fstack-protector-strong --param=ssp-buffer-size=4 -Werror=trampolines -fomit-frame-pointer -march=i686 -fasynchronous-unwind-tables -mtune=pentium4 -gdwarf-4 -fno-debug-types-section -fvar-tracking-assignments -g2 -pthread -MD -MQ 'systemd-resolved@exe/src_resolve_resolved-manager.c.o' -MF 'systemd-resolved@exe/src_resolve_resolved-manager.c.o.d' -o 'systemd-resolved@exe/src_resolve_resolved-manager.c.o' -c ../src/resolve/resolved-manager.c
[687/1881] i686-pld-linux-gcc -Isystemd-resolved@exe -I. -I.. -Isrc/basic -I../src/basic -Isrc/boot -I../src/boot -Isrc/shared -I../src/shared -Isrc/systemd -I../src/systemd -Isrc/journal -I../src/journal -Isrc/journal-remote -I../src/journal-remote -Isrc/nspawn -I../src/nspawn -Isrc/resolve -I../src/resolve -Isrc/timesync -I../src/timesync -I../src/time-wait-sync -Isrc/login -I../src/login -Isrc/udev -I../src/udev -Isrc/libudev -I../src/libudev -Isrc/core -I../src/core -Isrc/shutdown -I../src/shutdown -I../src/libsystemd/sd-bus -I../src/libsystemd/sd-device -I../src/libsystemd/sd-event -I../src/libsystemd/sd-hwdb -I../src/libsystemd/sd-id128 -I../src/libsystemd/sd-netlink -I../src/libsystemd/sd-network -I../src/libsystemd/sd-resolve -Isrc/libsystemd-network -I../src/libsystemd-network -I/usr/include/p11-kit-1 -fdiagnostics-color=always -pipe -D_FILE_OFFSET_BITS=64 -std=gnu99 -Wno-unused-parameter -Wno-missing-field-initializers -Wno-unused-result -Wno-format-signedness -Werror=undef -Wlogical-op -Wmissing-include-dirs -Wold-style-definition -Wpointer-arith -Winit-self -Wfloat-equal -Wsuggest-attribute=noreturn -Werror=missing-prototypes -Werror=implicit-function-declaration -Werror=missing-declarations -Werror=return-type -Werror=incompatible-pointer-types -Werror=format=2 -Wstrict-prototypes -Wredundant-decls -Wmissing-noreturn -Wimplicit-fallthrough=5 -Wshadow -Wendif-labels -Wstrict-aliasing=2 -Wwrite-strings -Werror=overflow -Werror=shift-count-overflow -Werror=shift-overflow=2 -Wdate-time -Wnested-externs -Wno-error=nonnull -Wno-maybe-uninitialized -ffast-math -fno-common -fdiagnostics-show-option -fno-strict-aliasing -fvisibility=hidden -fstack-protector -fstack-protector-strong --param=ssp-buffer-size=4 -ffunction-sections -fdata-sections -Werror=shadow -include config.h -O2 -fwrapv -Wformat -Werror=format-security -gdwarf-4 -fno-debug-types-section -fvar-tracking-assignments -g2 -Wp,-D_FORTIFY_SOURCE=2 -fstack-protector-strong --param=ssp-buffer-size=4 -Werror=trampolines -fomit-frame-pointer -march=i686 -fasynchronous-unwind-tables -mtune=pentium4 -gdwarf-4 -fno-debug-types-section -fvar-tracking-assignments -g2 -pthread -MD -MQ 'systemd-resolved@exe/src_resolve_resolved-link.c.o' -MF 'systemd-resolved@exe/src_resolve_resolved-link.c.o.d' -o 'systemd-resolved@exe/src_resolve_resolved-link.c.o' -c ../src/resolve/resolved-link.c
+ rm -rf /tmp/B.clK9HG
Begin-PLD-Builder-Info
Build-Time: user:3.19s sys:1.06s real:51.35s (faults io:0 non-io:118942)

End-PLD-Builder-Info
[688/1881] i686-pld-linux-gcc -Isystemd-resolved@exe -I. -I.. -Isrc/basic -I../src/basic -Isrc/boot -I../src/boot -Isrc/shared -I../src/shared -Isrc/systemd -I../src/systemd -Isrc/journal -I../src/journal -Isrc/journal-remote -I../src/journal-remote -Isrc/nspawn -I../src/nspawn -Isrc/resolve -I../src/resolve -Isrc/timesync -I../src/timesync -I../src/time-wait-sync -Isrc/login -I../src/login -Isrc/udev -I../src/udev -Isrc/libudev -I../src/libudev -Isrc/core -I../src/core -Isrc/shutdown -I../src/shutdown -I../src/libsystemd/sd-bus -I../src/libsystemd/sd-device -I../src/libsystemd/sd-event -I../src/libsystemd/sd-hwdb -I../src/libsystemd/sd-id128 -I../src/libsystemd/sd-netlink -I../src/libsystemd/sd-network -I../src/libsystemd/sd-resolve -Isrc/libsystemd-network -I../src/libsystemd-network -I/usr/include/p11-kit-1 -fdiagnostics-color=always -pipe -D_FILE_OFFSET_BITS=64 -std=gnu99 -Wno-unused-parameter -Wno-missing-field-initializers -Wno-unused-result -Wno-format-signedness -Werror=undef -Wlogical-op -Wmissing-include-dirs -Wold-style-definition -Wpointer-arith -Winit-self -Wfloat-equal -Wsuggest-attribute=noreturn -Werror=missing-prototypes -Werror=implicit-function-declaration -Werror=missing-declarations -Werror=return-type -Werror=incompatible-pointer-types -Werror=format=2 -Wstrict-prototypes -Wredundant-decls -Wmissing-noreturn -Wimplicit-fallthrough=5 -Wshadow -Wendif-labels -Wstrict-aliasing=2 -Wwrite-strings -Werror=overflow -Werror=shift-count-overflow -Werror=shift-overflow=2 -Wdate-time -Wnested-externs -Wno-error=nonnull -Wno-maybe-uninitialized -ffast-math -fno-common -fdiagnostics-show-option -fno-strict-aliasing -fvisibility=hidden -fstack-protector -fstack-protector-strong --param=ssp-buffer-size=4 -ffunction-sections -fdata-sections -Werror=shadow -include config.h -O2 -fwrapv -Wformat -Werror=format-security -gdwarf-4 -fno-debug-types-section -fvar-tracking-assignments -g2 -Wp,-D_FORTIFY_SOURCE=2 -fstack-protector-strong --param=ssp-buffer-size=4 -Werror=trampolines -fomit-frame-pointer -march=i686 -fasynchronous-unwind-tables -mtune=pentium4 -gdwarf-4 -fno-debug-types-section -fvar-tracking-assignments -g2 -pthread -MD -MQ 'systemd-resolved@exe/src_resolve_resolved-bus.c.o' -MF 'systemd-resolved@exe/src_resolve_resolved-bus.c.o.d' -o 'systemd-resolved@exe/src_resolve_resolved-bus.c.o' -c ../src/resolve/resolved-bus.c
FAILED: systemd-resolved@exe/src_resolve_resolved-bus.c.o 
i686-pld-linux-gcc -Isystemd-resolved@exe -I. -I.. -Isrc/basic -I../src/basic -Isrc/boot -I../src/boot -Isrc/shared -I../src/shared -Isrc/systemd -I../src/systemd -Isrc/journal -I../src/journal -Isrc/journal-remote -I../src/journal-remote -Isrc/nspawn -I../src/nspawn -Isrc/resolve -I../src/resolve -Isrc/timesync -I../src/timesync -I../src/time-wait-sync -Isrc/login -I../src/login -Isrc/udev -I../src/udev -Isrc/libudev -I../src/libudev -Isrc/core -I../src/core -Isrc/shutdown -I../src/shutdown -I../src/libsystemd/sd-bus -I../src/libsystemd/sd-device -I../src/libsystemd/sd-event -I../src/libsystemd/sd-hwdb -I../src/libsystemd/sd-id128 -I../src/libsystemd/sd-netlink -I../src/libsystemd/sd-network -I../src/libsystemd/sd-resolve -Isrc/libsystemd-network -I../src/libsystemd-network -I/usr/include/p11-kit-1 -fdiagnostics-color=always -pipe -D_FILE_OFFSET_BITS=64 -std=gnu99 -Wno-unused-parameter -Wno-missing-field-initializers -Wno-unused-result -Wno-format-signedness -Werror=undef -Wlogical-op -Wmissing-include-dirs -Wold-style-definition -Wpointer-arith -Winit-self -Wfloat-equal -Wsuggest-attribute=noreturn -Werror=missing-prototypes -Werror=implicit-function-declaration -Werror=missing-declarations -Werror=return-type -Werror=incompatible-pointer-types -Werror=format=2 -Wstrict-prototypes -Wredundant-decls -Wmissing-noreturn -Wimplicit-fallthrough=5 -Wshadow -Wendif-labels -Wstrict-aliasing=2 -Wwrite-strings -Werror=overflow -Werror=shift-count-overflow -Werror=shift-overflow=2 -Wdate-time -Wnested-externs -Wno-error=nonnull -Wno-maybe-uninitialized -ffast-math -fno-common -fdiagnostics-show-option -fno-strict-aliasing -fvisibility=hidden -fstack-protector -fstack-protector-strong --param=ssp-buffer-size=4 -ffunction-sections -fdata-sections -Werror=shadow -include config.h -O2 -fwrapv -Wformat -Werror=format-security -gdwarf-4 -fno-debug-types-section -fvar-tracking-assignments -g2 -Wp,-D_FORTIFY_SOURCE=2 -fstack-protector-strong --param=ssp-buffer-size=4 -Werror=trampolines -fomit-frame-pointer -march=i686 -fasynchronous-unwind-tables -mtune=pentium4 -gdwarf-4 -fno-debug-types-section -fvar-tracking-assignments -g2 -pthread -MD -MQ 'systemd-resolved@exe/src_resolve_resolved-bus.c.o' -MF 'systemd-resolved@exe/src_resolve_resolved-bus.c.o.d' -o 'systemd-resolved@exe/src_resolve_resolved-bus.c.o' -c ../src/resolve/resolved-bus.c
../src/resolve/resolved-bus.c:1970:1: fatal error: opening dependency file systemd-resolved@exe/src_resolve_resolved-bus.c.o.d: No such file or directory
compilation terminated.
ninja: build stopped: subcommand failed.
[Back to list of logs] [View rpm -qa of builder]