FailedOk

th/SRPMS[OK]
th/x32[OK]
th/i686[OK]
th/x86_64[OK]

ac/SRPMS[OK]
ac/i386[OK]
ac/i586[OK]
ac/i686[OK]
ac/alpha[OK]
ac/amd64[OK]
ac/athlon[OK]
ac/ppc[OK]
ac/sparc[OK]
ac/sparc64[OK]

Advanced Search
main()
Powered by PLD Linux
(c) 2002-2021 PLD Team
$Revision: 1.37 $
Powered by Multics.
Your IP: 3.80.3.192

tf 6d845428-5fc5-439a-8420-de1ca543f70f

Status:Failed
Source URL:https://buildlogs.pld-linux.org/pld/th/i686/FAIL/tf,6d845428-5fc5-439a-8420-de1ca543f70f.bz2
text/plain URL:View!
rpm -qa of builder:View!
Date:2021/09/25 23:27:12
Runtime:0:00:08.849705

Toc:

  • prep
  • Executing(%prep): /bin/sh -e /tmp/B.z0qav90z/BUILD/tmp/rpm-tmp.t2Icny
  • build
  • Executing(%build): /bin/sh -e /tmp/B.z0qav90z/BUILD/tmp/rpm-tmp.NyKFz5
  • error 1
  • collect2: error: ld returned 1 exit status
  • error 2
  • make[1]: *** [Makefile:160: tf] Error 1
  • error 3
  • error: Bad exit status from /tmp/B.z0qav90z/BUILD/tmp/rpm-tmp.NyKFz5 (%build)
  • error 4
  • RPM build errors:
  • error 5
  • error: No files produced.

Content:

request from: baggins
checking if we should skip the build
started at: Sat Sep 25 23:27:01 2021
killing old processes on a builder
sending signal 9 to pid -1
cleaning up /tmp
fetching https://srcbuilder.pld-linux.org/th//srpms/6d845428-5fc5-439a-8420-de1ca543f70f/tf-50b8-6.src.rpm
fetched 907629 bytes, 1974.4 K/s
installing srpm: tf-50b8-6.src.rpm
+ install -d /tmp/B.z0qav90z/BUILD /tmp/B.z0qav90z/RPMS
+ LC_ALL=en_US.UTF-8
+ rpm -qp --changelog tf-50b8-6.src.rpm
* Sat Sep 25 2021 PLD Linux Team <feedback@pld-linux.org>
- For complete changelog see: http://git.pld-linux.org/?p=packages/tf.git;a=log;h=master
* Sat Sep 15 2018 Arkadiusz Miśkiewicz <arekm@maven.pl> ba7e191
- release 6 (by relup.sh) * Sat Dec 05 2015 Arkadiusz Miśkiewicz <arekm@maven.pl> 9019d7c
- ncurses rebuild - release 5 (by relup.sh) * Wed Mar 28 2012 Artur Frysiak <artur@frysiak.net> 0659945
- fix build with pcre 8.30 - rel. 4 * Wed Mar 28 2012 Arkadiusz Miśkiewicz <arekm@maven.pl> aa672c1
- release 3 * Mon Apr 12 2010 Arkadiusz Miśkiewicz <arekm@maven.pl> 72a0772
- release 2 * Wed May 06 2009 amateja <amateja@pld-linux.org> 5c6a76a
- fixed SourceX-md5 * Wed May 06 2009 amateja <amateja@pld-linux.org> 140b4b0
- updated to 50b8 * Mon Feb 12 2007 Elan Ruusamäe <glen@pld-linux.org> b36ba29
- tabs in preamble * Mon Feb 12 2007 Jan Rękorajski <baggins@pld-linux.org> 5c15808
- converted to UTF-8 * Sat Apr 22 2006 Jan Rękorajski <baggins@pld-linux.org> 2d536ae
- orphaned, outdated * Sun Oct 09 2005 snurf <snurf@pld-linux.org> 246143f
- up to 50b7 * Tue Jul 05 2005 darekr <darekr@pld-linux.org> 8785633
- simplify %setup * Sun Oct 31 2004 paladine <paladine@pld-linux.org> b683216
- spaces->tabs * Mon Aug 09 2004 snurf <snurf@pld-linux.org> a44b100
- updated to 50b6 * Mon Aug 09 2004 snurf <snurf@pld-linux.org> c47a3bf
- multistatus patch for tf 50b6 * Wed Aug 04 2004 snurf <snurf@pld-linux.org> 9653d1f
- updated to 50b5 * Wed Aug 04 2004 snurf <snurf@pld-linux.org> d2a59d3
- multistatus patch for tf-50b5, from http://www.ingwar.eu.org/index_download.html * Fri Jul 30 2004 snurf <snurf@pld-linux.org> ee5f277
- added missing br (tf builds and works without ncurses-devel, but terminal codes are hardcoded - that couses strange behaviour with f.e. keybindings) * Mon Jul 12 2004 snurf <snurf@pld-linux.org> 8ed1122
- updated * up to 50b4 * release 1 (reported to work fine) * added mc tf syntax hilighting by Karol Lassak (ingwar at go2 dot pl) * added missing BR * Thu Feb 19 2004 tommat <tommat@pld-linux.org> 91e2b92
- help source tar.gz have . in directory tree - forced tar to extract files with absolute path, now it builds. + rpm -Uhv --nodeps --define '_topdir /tmp/B.z0qav90z' --define '_specdir %{_topdir}' --define '_sourcedir %{_specdir}' --define '_rpmdir %{_topdir}/RPMS' --define '_builddir %{_topdir}/BUILD' tf-50b8-6.src.rpm Updating / installing... tf-50b8-6 ######################################## + rm -f tf-50b8-6.src.rpm + install -m 700 -d /tmp/B.z0qav90z/BUILD/tmp + TMPDIR=/tmp/B.z0qav90z/BUILD/tmp + exec nice -n 0 rpmbuild -bp --short-circuit --nodeps --define '_topdir /tmp/B.z0qav90z' --define '_specdir %{_topdir}' --define '_sourcedir %{_specdir}' --define '_rpmdir %{_topdir}/RPMS' --define '_builddir %{_topdir}/BUILD' --target i686-pld-linux --define 'prep exit 0' /tmp/B.z0qav90z/tf.spec warning: Could not canonicalize hostname: nereid Building target platforms: i686-pld-linux Building for target i686-pld-linux checking BuildConflict-ing packages rpm: warning: Could not canonicalize hostname: nereid rpm: Building target platforms: i686-pld-linux rpm: Building for target i686-pld-linux no BuildConflicts found checking BR rpm: warning: Could not canonicalize hostname: nereid rpm: Building target platforms: i686-pld-linux rpm: Building for target i686-pld-linux no BR needed building RPM using: set -ex; : build-id: 6d845428-5fc5-439a-8420-de1ca543f70f; TMPDIR=/tmp/B.z0qav90z/BUILD/tmp exec nice -n 0 rpmbuild -bb --define '_smp_mflags -j9' --define '_make_opts -Otarget' --define '_pld_builder 1' --define '_topdir /tmp/B.z0qav90z' --define '_specdir %{_topdir}' --define '_sourcedir %{_specdir}' --define '_rpmdir %{_topdir}/RPMS' --define '_builddir %{_topdir}/BUILD' --target i686-pld-linux /tmp/B.z0qav90z/tf.spec + : build-id: 6d845428-5fc5-439a-8420-de1ca543f70f + TMPDIR=/tmp/B.z0qav90z/BUILD/tmp + exec nice -n 0 rpmbuild -bb --define '_smp_mflags -j9' --define '_make_opts -Otarget' --define '_pld_builder 1' --define '_topdir /tmp/B.z0qav90z' --define '_specdir %{_topdir}' --define '_sourcedir %{_specdir}' --define '_rpmdir %{_topdir}/RPMS' --define '_builddir %{_topdir}/BUILD' --target i686-pld-linux /tmp/B.z0qav90z/tf.spec warning: Could not canonicalize hostname: nereid Building target platforms: i686-pld-linux Building for target i686-pld-linux Executing(%prep): /bin/sh -e /tmp/B.z0qav90z/BUILD/tmp/rpm-tmp.t2Icny + umask 022 + cd /tmp/B.z0qav90z/BUILD + cd /tmp/B.z0qav90z/BUILD + rm -rf tf-50b8 + /bin/gzip -dc /tmp/B.z0qav90z/tf-50b8.tar.gz + /bin/tar -xof - + STATUS=0 + '[' 0 -ne 0 ']' + cd tf-50b8 + /bin/chmod -Rf a+rX,u+w,g-w,o-w . + tar xzPf /tmp/B.z0qav90z/tf-50b8-help.tar.gz + cp /tmp/B.z0qav90z/tf.syntax.gz . + echo 'Patch #0 (pcre.patch):' Patch #0 (pcre.patch): + </tmp/B.z0qav90z/pcre.patch + /usr/bin/patch -s -p1 '--fuzz=0' + RPM_EC=0 + jobs -p + exit 0 Executing(%build): /bin/sh -e /tmp/B.z0qav90z/BUILD/tmp/rpm-tmp.NyKFz5 TMP=/home/users/builder/tmp HOME=/home/users/builder PATH=/home/users/builder/GNUstep/Tools:/bin:/usr/bin:/usr/local/bin:/home/users/builder/bin TMPDIR=/tmp/B.z0qav90z/BUILD/tmp + umask 022 + cd /tmp/B.z0qav90z/BUILD + cd tf-50b8 + autoconf configure.in:25: warning: The macro `AC_CONFIG_HEADER' is obsolete. configure.in:25: You should run autoupdate. ./lib/autoconf/status.m4:719: AC_CONFIG_HEADER is expanded from... configure.in:25: the top level configure.in:378: warning: The macro `AC_HEADER_STDC' is obsolete. configure.in:378: You should run autoupdate. ./lib/autoconf/headers.m4:704: AC_HEADER_STDC is expanded from... configure.in:378: the top level configure.in:416: warning: AC_CHECK_HEADERS($f): you should use literals ./lib/autoconf/headers.m4:217: AC_CHECK_HEADERS is expanded from... configure.in:397: TF_SEARCH_HEADERS is expanded from... configure.in:416: the top level configure.in:420: warning: AC_CHECK_HEADERS($f): you should use literals ./lib/autoconf/headers.m4:217: AC_CHECK_HEADERS is expanded from... configure.in:397: TF_SEARCH_HEADERS is expanded from... configure.in:420: the top level configure.in:426: warning: AC_CHECK_HEADERS($f): you should use literals ./lib/autoconf/headers.m4:217: AC_CHECK_HEADERS is expanded from... configure.in:397: TF_SEARCH_HEADERS is expanded from... configure.in:426: the top level configure.in:430: warning: The macro `AC_TRY_COMPILE' is obsolete. configure.in:430: You should run autoupdate. ./lib/autoconf/general.m4:2847: AC_TRY_COMPILE is expanded from... configure.in:430: the top level configure.in:475: warning: The macro `AC_TYPE_SIGNAL' is obsolete. configure.in:475: You should run autoupdate. ./lib/autoconf/types.m4:776: AC_TYPE_SIGNAL is expanded from... configure.in:475: the top level configure.in:531: warning: The macro `AC_TRY_COMPILE' is obsolete. configure.in:531: You should run autoupdate. ./lib/autoconf/general.m4:2847: AC_TRY_COMPILE is expanded from... configure.in:531: the top level configure.in:717: warning: AC_OUTPUT should be used without arguments. configure.in:717: You should run autoupdate. + ./configure 'LDFLAGS=-Wl,--as-needed -Wl,--no-copy-dt-needed-entries -Wl,-z,relro -Wl,-z,combreloc ' 'CFLAGS=-O2 -fwrapv -pipe -Wformat -Werror=format-security -gdwarf-4 -fno-debug-types-section -fvar-tracking-assignments -g2 -Wp,-D_FORTIFY_SOURCE=2 -fstack-protector-strong --param=ssp-buffer-size=4 -Werror=trampolines -fomit-frame-pointer -march=i686 -fasynchronous-unwind-tables -mtune=pentium4 -gdwarf-4 -fno-debug-types-section -fvar-tracking-assignments -g2 ' 'CXXFLAGS=-O2 -fwrapv -pipe -Wformat -Werror=format-security -gdwarf-4 -fno-debug-types-section -fvar-tracking-assignments -g2 -Wp,-D_FORTIFY_SOURCE=2 -fstack-protector-strong --param=ssp-buffer-size=4 -Werror=trampolines -fomit-frame-pointer -march=i686 -fasynchronous-unwind-tables -mtune=pentium4 -gdwarf-4 -fno-debug-types-section -fvar-tracking-assignments -g2 ' 'FFLAGS=-O2 -fwrapv -pipe -Wformat -Werror=format-security -gdwarf-4 -fno-debug-types-section -fvar-tracking-assignments -g2 -Wp,-D_FORTIFY_SOURCE=2 -fstack-protector-strong --param=ssp-buffer-size=4 -Werror=trampolines -fomit-frame-pointer -march=i686 -fasynchronous-unwind-tables -mtune=pentium4 -gdwarf-4 -fno-debug-types-section -fvar-tracking-assignments -g2 ' 'FCFLAGS=-O2 -fwrapv -pipe -Wformat -Werror=format-security -gdwarf-4 -fno-debug-types-section -fvar-tracking-assignments -g2 -Wp,-D_FORTIFY_SOURCE=2 -fstack-protector-strong --param=ssp-buffer-size=4 -Werror=trampolines -fomit-frame-pointer -march=i686 -fasynchronous-unwind-tables -mtune=pentium4 -gdwarf-4 -fno-debug-types-section -fvar-tracking-assignments -g2 ' 'CPPFLAGS=' 'CC=i686-pld-linux-gcc' 'CXX=i686-pld-linux-g++' '--host=i686-pld-linux' '--build=i686-pld-linux' '--prefix=/usr' '--exec-prefix=/usr' '--bindir=/usr/bin' '--sbindir=/usr/sbin' '--sysconfdir=/etc' '--datadir=/usr/share' '--includedir=/usr/include' '--libdir=/usr/lib' '--libexecdir=/usr/libexec' '--localstatedir=/var' '--sharedstatedir=/var/lib' '--mandir=/usr/share/man' '--infodir=/usr/share/info' '--x-libraries=/usr/lib' configure: Configuring TinyFugue version 5.0 beta 8 configure: configure: Core dumps disabled. checking for i686-pld-linux-gcc... i686-pld-linux-gcc checking whether the C compiler works... yes checking for C compiler default output file name... a.out checking for suffix of executables... checking whether we are cross compiling... no checking for suffix of object files... o checking whether the compiler supports GNU C... yes checking whether i686-pld-linux-gcc accepts -g... yes checking for i686-pld-linux-gcc option to enable C11 features... none needed checking how to run the C preprocessor... i686-pld-linux-gcc -E checking for grep that handles long lines and -e... /bin/grep checking for egrep... /bin/grep -E checking whether i686-pld-linux-gcc needs -traditional... no checking whether make sets $(MAKE)... yes checking for ranlib... ranlib checking for stdio.h... yes checking for stdlib.h... yes checking for string.h... yes checking for inttypes.h... yes checking for stdint.h... yes checking for strings.h... yes checking for sys/stat.h... yes checking for sys/types.h... yes checking for unistd.h... yes checking size of short... 2 checking size of int... 4 checking size of long... 4 checking for inline... yes checking for library containing select... none required checking for library containing gethostbyname... none required checking for main in -linet... no checking for main in -lnet... yes checking for library containing connect... none required checking for library containing setlocale... none required checking for libcrypto and libssl... yes checking for ssl kerberos dependency... no checking for openssl/ssl.h... yes checking for library containing tgetent... -lncurses checking for library containing sqrt... -lm checking for inflate in -lz... yes checking for pcre_compile in -lpcre... yes checking for egrep... (cached) /bin/grep -E checking for unistd.h... (cached) yes checking for memory.h... yes checking for sys/select.h... yes checking for sys/wait.h that is POSIX.1 compatible... yes checking for locale.h... yes checking for pwd.h... yes checking for zlib.h... yes checking for netinet/in.h... yes checking for arpa/inet.h... yes checking for netdb.h... yes checking whether struct sockaddr has sa_len... no checking for termios.h... yes checking return type of signal handlers... void checking for pid_t... yes checking for size_t... yes checking for time_t... yes checking for socklen_t... yes checking for strftime... yes checking for h_errno... no checking for strstr... yes checking for strtol... yes checking for bcopy... yes checking for bzero... yes checking for connect... yes checking for fileno... yes checking for getcwd... yes checking for gethostname... yes checking for gethostbyname... yes checking for getipnodebyname... no checking for getpwnam... yes checking for gettimeofday... yes checking for getwd... yes checking for hstrerror... yes checking for index... yes checking for inet_aton... yes checking for getaddrinfo... yes checking for gai_strerror... yes checking for kill... yes checking for memcpy... yes checking for memset... yes checking for raise... yes checking for setlocale... yes checking for setrlimit... yes checking for sigaction... yes checking for srand... yes checking for srandom... yes checking for strcasecmp... yes checking for strchr... yes checking for strcmpi... no checking for strcspn... yes checking for strerror... yes checking for stricmp... no checking for strtod... yes checking for tzset... yes checking for waitpid... yes checking for IPv6 address structure... in6_addr checking location of mail directory... /var/mail configure: creating ./config.status config.status: creating Makefile config.status: creating unix/vars.mak config.status: WARNING: 'unix/vars.mak.in' seems to ignore the --datarootdir setting config.status: creating src/tfdefs.h config.status: creating src/tfconfig.h config.status: executing default commands configure: ##################################################### ## prefix: /usr ## exec_prefix: /usr ## bindir: /usr/bin ## datadir: /usr/share ## executable: ${bindir}/tf ## library: ${datadir}/tf-lib ## ## TinyFugue configuration successful. ## Use "make" to build. + /usr/bin/make -Otarget -j9 make[1]: Entering directory '/tmp/B.z0qav90z/BUILD/tf-50b8/src' i686-pld-linux-gcc -O2 -fwrapv -pipe -Wformat -Werror=format-security -gdwarf-4 -fno-debug-types-section -fvar-tracking-assignments -g2 -Wp,-D_FORTIFY_SOURCE=2 -fstack-protector-strong --param=ssp-buffer-size=4 -Werror=trampolines -fomit-frame-pointer -march=i686 -fasynchronous-unwind-tables -mtune=pentium4 -gdwarf-4 -fno-debug-types-section -fvar-tracking-assignments -g2 -DDATADIR=/usr/share -c -o help.o help.c make[1]: Leaving directory '/tmp/B.z0qav90z/BUILD/tf-50b8/src' make[1]: Entering directory '/tmp/B.z0qav90z/BUILD/tf-50b8/src' i686-pld-linux-gcc -O2 -fwrapv -pipe -Wformat -Werror=format-security -gdwarf-4 -fno-debug-types-section -fvar-tracking-assignments -g2 -Wp,-D_FORTIFY_SOURCE=2 -fstack-protector-strong --param=ssp-buffer-size=4 -Werror=trampolines -fomit-frame-pointer -march=i686 -fasynchronous-unwind-tables -mtune=pentium4 -gdwarf-4 -fno-debug-types-section -fvar-tracking-assignments -g2 -DDATADIR=/usr/share -c -o main.o main.c make[1]: Leaving directory '/tmp/B.z0qav90z/BUILD/tf-50b8/src' make[1]: Entering directory '/tmp/B.z0qav90z/BUILD/tf-50b8/src' i686-pld-linux-gcc -O2 -fwrapv -pipe -Wformat -Werror=format-security -gdwarf-4 -fno-debug-types-section -fvar-tracking-assignments -g2 -Wp,-D_FORTIFY_SOURCE=2 -fstack-protector-strong --param=ssp-buffer-size=4 -Werror=trampolines -fomit-frame-pointer -march=i686 -fasynchronous-unwind-tables -mtune=pentium4 -gdwarf-4 -fno-debug-types-section -fvar-tracking-assignments -g2 -DDATADIR=/usr/share -c -o dstring.o dstring.c make[1]: Leaving directory '/tmp/B.z0qav90z/BUILD/tf-50b8/src' make[1]: Entering directory '/tmp/B.z0qav90z/BUILD/tf-50b8/src' i686-pld-linux-gcc -O2 -fwrapv -pipe -Wformat -Werror=format-security -gdwarf-4 -fno-debug-types-section -fvar-tracking-assignments -g2 -Wp,-D_FORTIFY_SOURCE=2 -fstack-protector-strong --param=ssp-buffer-size=4 -Werror=trampolines -fomit-frame-pointer -march=i686 -fasynchronous-unwind-tables -mtune=pentium4 -gdwarf-4 -fno-debug-types-section -fvar-tracking-assignments -g2 -DDATADIR=/usr/share -c -o keyboard.o keyboard.c keyboard.c: In function 'do_kbword': keyboard.c:388:52: warning: argument 1 null where non-null expected [-Wnonnull] 388 | #define is_inword(c) (is_alnum(c) || (wordpunct && strchr(wordpunct, (c)))) | ^~~~~~ keyboard.c:396:30: note: in expansion of macro 'is_inword' 396 | while (place != stop && !is_inword(keybuf->data[place])) place += dir; | ^~~~~~~~~ In file included from port.h:85, from keyboard.c:16: /usr/include/string.h:230:14: note: in a call to function 'strchr' declared 'nonnull' 230 | extern char *strchr (const char *__s, int __c) | ^~~~~~ keyboard.c:388:52: warning: argument 1 null where non-null expected [-Wnonnull] 388 | #define is_inword(c) (is_alnum(c) || (wordpunct && strchr(wordpunct, (c)))) | ^~~~~~ keyboard.c:397:29: note: in expansion of macro 'is_inword' 397 | while (place != stop && is_inword(keybuf->data[place])) place += dir; | ^~~~~~~~~ In file included from port.h:85, from keyboard.c:16: /usr/include/string.h:230:14: note: in a call to function 'strchr' declared 'nonnull' 230 | extern char *strchr (const char *__s, int __c) | ^~~~~~ make[1]: Leaving directory '/tmp/B.z0qav90z/BUILD/tf-50b8/src' make[1]: Entering directory '/tmp/B.z0qav90z/BUILD/tf-50b8/src' i686-pld-linux-gcc -O2 -fwrapv -pipe -Wformat -Werror=format-security -gdwarf-4 -fno-debug-types-section -fvar-tracking-assignments -g2 -Wp,-D_FORTIFY_SOURCE=2 -fstack-protector-strong --param=ssp-buffer-size=4 -Werror=trampolines -fomit-frame-pointer -march=i686 -fasynchronous-unwind-tables -mtune=pentium4 -gdwarf-4 -fno-debug-types-section -fvar-tracking-assignments -g2 -DDATADIR=/usr/share -c -o attr.o attr.c make[1]: Leaving directory '/tmp/B.z0qav90z/BUILD/tf-50b8/src' make[1]: Entering directory '/tmp/B.z0qav90z/BUILD/tf-50b8/src' i686-pld-linux-gcc -O2 -fwrapv -pipe -Wformat -Werror=format-security -gdwarf-4 -fno-debug-types-section -fvar-tracking-assignments -g2 -Wp,-D_FORTIFY_SOURCE=2 -fstack-protector-strong --param=ssp-buffer-size=4 -Werror=trampolines -fomit-frame-pointer -march=i686 -fasynchronous-unwind-tables -mtune=pentium4 -gdwarf-4 -fno-debug-types-section -fvar-tracking-assignments -g2 -DDATADIR=/usr/share -c -o malloc.o malloc.c make[1]: Leaving directory '/tmp/B.z0qav90z/BUILD/tf-50b8/src' make[1]: Entering directory '/tmp/B.z0qav90z/BUILD/tf-50b8/src' i686-pld-linux-gcc -O2 -fwrapv -pipe -Wformat -Werror=format-security -gdwarf-4 -fno-debug-types-section -fvar-tracking-assignments -g2 -Wp,-D_FORTIFY_SOURCE=2 -fstack-protector-strong --param=ssp-buffer-size=4 -Werror=trampolines -fomit-frame-pointer -march=i686 -fasynchronous-unwind-tables -mtune=pentium4 -gdwarf-4 -fno-debug-types-section -fvar-tracking-assignments -g2 -DDATADIR=/usr/share -c -o history.o history.c make[1]: Leaving directory '/tmp/B.z0qav90z/BUILD/tf-50b8/src' make[1]: Entering directory '/tmp/B.z0qav90z/BUILD/tf-50b8/src' i686-pld-linux-gcc -O2 -fwrapv -pipe -Wformat -Werror=format-security -gdwarf-4 -fno-debug-types-section -fvar-tracking-assignments -g2 -Wp,-D_FORTIFY_SOURCE=2 -fstack-protector-strong --param=ssp-buffer-size=4 -Werror=trampolines -fomit-frame-pointer -march=i686 -fasynchronous-unwind-tables -mtune=pentium4 -gdwarf-4 -fno-debug-types-section -fvar-tracking-assignments -g2 -DDATADIR=/usr/share -c -o command.o command.c command.c: In function 'handle_echo_func': command.c:363:9: warning: ignoring return value of 'write' declared with attribute 'warn_unused_result' [-Wunused-result] 363 | write(STDOUT_FILENO, src->data, src->len); | ^~~~~~~~~~~~~~~~~~~~~~~~~~~~~~~~~~~~~~~~~ make[1]: Leaving directory '/tmp/B.z0qav90z/BUILD/tf-50b8/src' make[1]: Entering directory '/tmp/B.z0qav90z/BUILD/tf-50b8/src' i686-pld-linux-gcc -O2 -fwrapv -pipe -Wformat -Werror=format-security -gdwarf-4 -fno-debug-types-section -fvar-tracking-assignments -g2 -Wp,-D_FORTIFY_SOURCE=2 -fstack-protector-strong --param=ssp-buffer-size=4 -Werror=trampolines -fomit-frame-pointer -march=i686 -fasynchronous-unwind-tables -mtune=pentium4 -gdwarf-4 -fno-debug-types-section -fvar-tracking-assignments -g2 -DDATADIR=/usr/share -c -o pattern.o pattern.c make[1]: Leaving directory '/tmp/B.z0qav90z/BUILD/tf-50b8/src' make[1]: Entering directory '/tmp/B.z0qav90z/BUILD/tf-50b8/src' i686-pld-linux-gcc -O2 -fwrapv -pipe -Wformat -Werror=format-security -gdwarf-4 -fno-debug-types-section -fvar-tracking-assignments -g2 -Wp,-D_FORTIFY_SOURCE=2 -fstack-protector-strong --param=ssp-buffer-size=4 -Werror=trampolines -fomit-frame-pointer -march=i686 -fasynchronous-unwind-tables -mtune=pentium4 -gdwarf-4 -fno-debug-types-section -fvar-tracking-assignments -g2 -DDATADIR=/usr/share -c -o process.o process.c make[1]: Leaving directory '/tmp/B.z0qav90z/BUILD/tf-50b8/src' make[1]: Entering directory '/tmp/B.z0qav90z/BUILD/tf-50b8/src' i686-pld-linux-gcc -O2 -fwrapv -pipe -Wformat -Werror=format-security -gdwarf-4 -fno-debug-types-section -fvar-tracking-assignments -g2 -Wp,-D_FORTIFY_SOURCE=2 -fstack-protector-strong --param=ssp-buffer-size=4 -Werror=trampolines -fomit-frame-pointer -march=i686 -fasynchronous-unwind-tables -mtune=pentium4 -gdwarf-4 -fno-debug-types-section -fvar-tracking-assignments -g2 -DDATADIR=/usr/share -c -o signals.o signals.c signals.c: In function 'init_exename': signals.c:437:5: warning: ignoring return value of 'getcwd' declared with attribute 'warn_unused_result' [-Wunused-result] 437 | getcwd(initial_dir, PATH_MAX); | ^~~~~~~~~~~~~~~~~~~~~~~~~~~~~ signals.c: In function 'debugger_dump': signals.c:508:33: warning: '%.*s' directive writing up to 2147483647 bytes into a region of size between 0 and 1024 [-Wformat-overflow=] 508 | sprintf(exebuf, "%s/%.*s/%s", initial_dir, len, dir, argv0); | ^~~~ signals.c:508:29: note: assuming directive output of 1 byte 508 | sprintf(exebuf, "%s/%.*s/%s", initial_dir, len, dir, argv0); | ^~~~~~~~~~~~ In file included from /usr/include/stdio.h:888, from port.h:66, from signals.c:15: /usr/include/bits/stdio2.h:38:10: note: '__builtin___sprintf_chk' output 3 or more bytes (assuming 1028) into a destination of size 1025 38 | return __builtin___sprintf_chk (__s, __USE_FORTIFY_LEVEL - 1, | ^~~~~~~~~~~~~~~~~~~~~~~~~~~~~~~~~~~~~~~~~~~~~~~~~~~~~~ 39 | __glibc_objsize (__s), __fmt, | ~~~~~~~~~~~~~~~~~~~~~~~~~~~~~ 40 | __va_arg_pack ()); | ~~~~~~~~~~~~~~~~~ signals.c:497:31: warning: '__builtin___sprintf_chk' may write a terminating nul past the end of the destination [-Wformat-overflow=] 497 | sprintf(exebuf, "%s/%s", initial_dir, argv0); | ^ In file included from /usr/include/stdio.h:888, from port.h:66, from signals.c:15: /usr/include/bits/stdio2.h:38:10: note: '__builtin___sprintf_chk' output 2 or more bytes (assuming 1026) into a destination of size 1025 38 | return __builtin___sprintf_chk (__s, __USE_FORTIFY_LEVEL - 1, | ^~~~~~~~~~~~~~~~~~~~~~~~~~~~~~~~~~~~~~~~~~~~~~~~~~~~~~ 39 | __glibc_objsize (__s), __fmt, | ~~~~~~~~~~~~~~~~~~~~~~~~~~~~~ 40 | __va_arg_pack ()); | ~~~~~~~~~~~~~~~~~ signals.c:548:65: warning: '%s' directive writing up to 1024 bytes into a region of size between 960 and 2014 [-Wformat-overflow=] 548 | sprintf(cmd, "chmod go-rwx %s; gdb -n -batch -x %s '%s' %d " | ^~ In file included from /usr/include/stdio.h:888, from port.h:66, from signals.c:15: /usr/include/bits/stdio2.h:38:10: note: '__builtin___sprintf_chk' output between 46 and 2165 bytes into a destination of size 2048 38 | return __builtin___sprintf_chk (__s, __USE_FORTIFY_LEVEL - 1, | ^~~~~~~~~~~~~~~~~~~~~~~~~~~~~~~~~~~~~~~~~~~~~~~~~~~~~~ 39 | __glibc_objsize (__s), __fmt, | ~~~~~~~~~~~~~~~~~~~~~~~~~~~~~ 40 | __va_arg_pack ()); | ~~~~~~~~~~~~~~~~~ make[1]: Leaving directory '/tmp/B.z0qav90z/BUILD/tf-50b8/src' make[1]: Entering directory '/tmp/B.z0qav90z/BUILD/tf-50b8/src' i686-pld-linux-gcc -O2 -fwrapv -pipe -Wformat -Werror=format-security -gdwarf-4 -fno-debug-types-section -fvar-tracking-assignments -g2 -Wp,-D_FORTIFY_SOURCE=2 -fstack-protector-strong --param=ssp-buffer-size=4 -Werror=trampolines -fomit-frame-pointer -march=i686 -fasynchronous-unwind-tables -mtune=pentium4 -gdwarf-4 -fno-debug-types-section -fvar-tracking-assignments -g2 -DDATADIR=/usr/share -c -o search.o search.c make[1]: Leaving directory '/tmp/B.z0qav90z/BUILD/tf-50b8/src' make[1]: Entering directory '/tmp/B.z0qav90z/BUILD/tf-50b8/src' i686-pld-linux-gcc -O2 -fwrapv -pipe -Wformat -Werror=format-security -gdwarf-4 -fno-debug-types-section -fvar-tracking-assignments -g2 -Wp,-D_FORTIFY_SOURCE=2 -fstack-protector-strong --param=ssp-buffer-size=4 -Werror=trampolines -fomit-frame-pointer -march=i686 -fasynchronous-unwind-tables -mtune=pentium4 -gdwarf-4 -fno-debug-types-section -fvar-tracking-assignments -g2 -DDATADIR=/usr/share -c -o tty.o tty.c make[1]: Leaving directory '/tmp/B.z0qav90z/BUILD/tf-50b8/src' make[1]: Entering directory '/tmp/B.z0qav90z/BUILD/tf-50b8/src' i686-pld-linux-gcc -O2 -fwrapv -pipe -Wformat -Werror=format-security -gdwarf-4 -fno-debug-types-section -fvar-tracking-assignments -g2 -Wp,-D_FORTIFY_SOURCE=2 -fstack-protector-strong --param=ssp-buffer-size=4 -Werror=trampolines -fomit-frame-pointer -march=i686 -fasynchronous-unwind-tables -mtune=pentium4 -gdwarf-4 -fno-debug-types-section -fvar-tracking-assignments -g2 -DDATADIR=/usr/share -c -o tfio.o tfio.c tfio.c: In function 'tfgetS': tfio.c:831:9: warning: implicit declaration of function 'main_loop' [-Wimplicit-function-declaration] 831 | main_loop(); | ^~~~~~~~~ tfio.c: In function 'igetchar': tfio.c:770:5: warning: ignoring return value of 'read' declared with attribute 'warn_unused_result' [-Wunused-result] 770 | read(STDIN_FILENO, &c, 1); | ^~~~~~~~~~~~~~~~~~~~~~~~~ make[1]: Leaving directory '/tmp/B.z0qav90z/BUILD/tf-50b8/src' if test -d ../help; then cd ../help; /usr/bin/make tf-help; fi make[1]: Entering directory '/tmp/B.z0qav90z/BUILD/tf-50b8/src' i686-pld-linux-gcc -O2 -fwrapv -pipe -Wformat -Werror=format-security -gdwarf-4 -fno-debug-types-section -fvar-tracking-assignments -g2 -Wp,-D_FORTIFY_SOURCE=2 -fstack-protector-strong --param=ssp-buffer-size=4 -Werror=trampolines -fomit-frame-pointer -march=i686 -fasynchronous-unwind-tables -mtune=pentium4 -gdwarf-4 -fno-debug-types-section -fvar-tracking-assignments -g2 -DDATADIR=/usr/share -c -o macro.o macro.c make[1]: Leaving directory '/tmp/B.z0qav90z/BUILD/tf-50b8/src' make[1]: Entering directory '/tmp/B.z0qav90z/BUILD/tf-50b8/src' if test -d ../help; then cp ../help/tf-help ../tf-lib; fi make[1]: Leaving directory '/tmp/B.z0qav90z/BUILD/tf-50b8/src' make[1]: Entering directory '/tmp/B.z0qav90z/BUILD/tf-50b8/src' i686-pld-linux-gcc -O2 -fwrapv -pipe -Wformat -Werror=format-security -gdwarf-4 -fno-debug-types-section -fvar-tracking-assignments -g2 -Wp,-D_FORTIFY_SOURCE=2 -fstack-protector-strong --param=ssp-buffer-size=4 -Werror=trampolines -fomit-frame-pointer -march=i686 -fasynchronous-unwind-tables -mtune=pentium4 -gdwarf-4 -fno-debug-types-section -fvar-tracking-assignments -g2 -DDATADIR=/usr/share -o makehelp makehelp.c make[1]: Leaving directory '/tmp/B.z0qav90z/BUILD/tf-50b8/src' /usr/bin/make -f ../unix/unix.mak CC='i686-pld-linux-gcc' CFLAGS='-O2 -fwrapv -pipe -Wformat -Werror=format-security -gdwarf-4 -fno-debug-types-section -fvar-tracking-assignments -g2 -Wp,-D_FORTIFY_SOURCE=2 -fstack-protector-strong --param=ssp-buffer-size=4 -Werror=trampolines -fomit-frame-pointer -march=i686 -fasynchronous-unwind-tables -mtune=pentium4 -gdwarf-4 -fno-debug-types-section -fvar-tracking-assignments -g2 -DDATADIR=/usr/share' makehelp make[2]: 'makehelp' is up to date. make[1]: Entering directory '/tmp/B.z0qav90z/BUILD/tf-50b8/src' ./makehelp < ../tf-lib/tf-help > ../tf-lib/tf-help.idx make[1]: Leaving directory '/tmp/B.z0qav90z/BUILD/tf-50b8/src' make[1]: Entering directory '/tmp/B.z0qav90z/BUILD/tf-50b8/src' i686-pld-linux-gcc -O2 -fwrapv -pipe -Wformat -Werror=format-security -gdwarf-4 -fno-debug-types-section -fvar-tracking-assignments -g2 -Wp,-D_FORTIFY_SOURCE=2 -fstack-protector-strong --param=ssp-buffer-size=4 -Werror=trampolines -fomit-frame-pointer -march=i686 -fasynchronous-unwind-tables -mtune=pentium4 -gdwarf-4 -fno-debug-types-section -fvar-tracking-assignments -g2 -DDATADIR=/usr/share -c -o expand.o expand.c make[1]: Leaving directory '/tmp/B.z0qav90z/BUILD/tf-50b8/src' make[1]: Entering directory '/tmp/B.z0qav90z/BUILD/tf-50b8/src' i686-pld-linux-gcc -O2 -fwrapv -pipe -Wformat -Werror=format-security -gdwarf-4 -fno-debug-types-section -fvar-tracking-assignments -g2 -Wp,-D_FORTIFY_SOURCE=2 -fstack-protector-strong --param=ssp-buffer-size=4 -Werror=trampolines -fomit-frame-pointer -march=i686 -fasynchronous-unwind-tables -mtune=pentium4 -gdwarf-4 -fno-debug-types-section -fvar-tracking-assignments -g2 -DDATADIR=/usr/share -c -o world.o world.c make[1]: Leaving directory '/tmp/B.z0qav90z/BUILD/tf-50b8/src' make[1]: Entering directory '/tmp/B.z0qav90z/BUILD/tf-50b8/src' i686-pld-linux-gcc -O2 -fwrapv -pipe -Wformat -Werror=format-security -gdwarf-4 -fno-debug-types-section -fvar-tracking-assignments -g2 -Wp,-D_FORTIFY_SOURCE=2 -fstack-protector-strong --param=ssp-buffer-size=4 -Werror=trampolines -fomit-frame-pointer -march=i686 -fasynchronous-unwind-tables -mtune=pentium4 -gdwarf-4 -fno-debug-types-section -fvar-tracking-assignments -g2 -DDATADIR=/usr/share -c -o util.o util.c In file included from util.c:29: util.c: In function 'ch_mailfile': util.h:32:37: warning: argument 1 null where non-null expected [-Wnonnull] 32 | #define STRDUP(src) STRNDUP((src), strlen(src)) | ^~~~~~ util.h:31:28: note: in definition of macro 'STRNDUP' 31 | (strcpy(xmalloc(NULL, (len) + 1, __FILE__, __LINE__), (src))) | ^~~ util.c:640:42: note: in expansion of macro 'STRDUP' 640 | newlist = add_mail_file(newlist, STRDUP(MAIL)); | ^~~~~~ In file included from port.h:85, from util.c:27: /usr/include/string.h:391:15: note: in a call to function 'strlen' declared 'nonnull' 391 | extern size_t strlen (const char *__s) | ^~~~~~ In file included from util.c:29: util.h:31:6: warning: argument 2 null where non-null expected [-Wnonnull] 31 | (strcpy(xmalloc(NULL, (len) + 1, __FILE__, __LINE__), (src))) | ^~~~~~ util.h:32:22: note: in expansion of macro 'STRNDUP' 32 | #define STRDUP(src) STRNDUP((src), strlen(src)) | ^~~~~~~ util.c:640:42: note: in expansion of macro 'STRDUP' 640 | newlist = add_mail_file(newlist, STRDUP(MAIL)); | ^~~~~~ In file included from /usr/include/features.h:488, from /usr/include/assert.h:35, from tfconfig.h:106, from util.c:20: /usr/include/bits/string_fortified.h:77:1: note: in a call to function 'strcpy' declared 'nonnull' 77 | __NTH (strcpy (char *__restrict __dest, const char *__restrict __src)) | ^~~~~ make[1]: Leaving directory '/tmp/B.z0qav90z/BUILD/tf-50b8/src' make[1]: Entering directory '/tmp/B.z0qav90z/BUILD/tf-50b8/src' i686-pld-linux-gcc -O2 -fwrapv -pipe -Wformat -Werror=format-security -gdwarf-4 -fno-debug-types-section -fvar-tracking-assignments -g2 -Wp,-D_FORTIFY_SOURCE=2 -fstack-protector-strong --param=ssp-buffer-size=4 -Werror=trampolines -fomit-frame-pointer -march=i686 -fasynchronous-unwind-tables -mtune=pentium4 -gdwarf-4 -fno-debug-types-section -fvar-tracking-assignments -g2 -DDATADIR=/usr/share -c -o variable.o variable.c make[1]: Leaving directory '/tmp/B.z0qav90z/BUILD/tf-50b8/src' make[1]: Entering directory '/tmp/B.z0qav90z/BUILD/tf-50b8/src' i686-pld-linux-gcc -O2 -fwrapv -pipe -Wformat -Werror=format-security -gdwarf-4 -fno-debug-types-section -fvar-tracking-assignments -g2 -Wp,-D_FORTIFY_SOURCE=2 -fstack-protector-strong --param=ssp-buffer-size=4 -Werror=trampolines -fomit-frame-pointer -march=i686 -fasynchronous-unwind-tables -mtune=pentium4 -gdwarf-4 -fno-debug-types-section -fvar-tracking-assignments -g2 -DDATADIR=/usr/share -c -o expr.o expr.c make[1]: Leaving directory '/tmp/B.z0qav90z/BUILD/tf-50b8/src' make[1]: Entering directory '/tmp/B.z0qav90z/BUILD/tf-50b8/src' i686-pld-linux-gcc -O2 -fwrapv -pipe -Wformat -Werror=format-security -gdwarf-4 -fno-debug-types-section -fvar-tracking-assignments -g2 -Wp,-D_FORTIFY_SOURCE=2 -fstack-protector-strong --param=ssp-buffer-size=4 -Werror=trampolines -fomit-frame-pointer -march=i686 -fasynchronous-unwind-tables -mtune=pentium4 -gdwarf-4 -fno-debug-types-section -fvar-tracking-assignments -g2 -DDATADIR=/usr/share -c -o output.o output.c output.c: In function 'init_term': output.c:547:13: warning: argument 1 null where non-null expected [-Wnonnull] 547 | if (strcmp(TERM, "xterm") == 0) { | ^~~~~~ In file included from port.h:85, from output.c:23: /usr/include/string.h:140:12: note: in a call to function 'strcmp' declared 'nonnull' 140 | extern int strcmp (const char *__s1, const char *__s2) | ^~~~~~ output.c:555:13: warning: argument 1 null where non-null expected [-Wnonnull] 555 | if (strcmp(TERM, "linux") == 0) { | ^~~~~~ In file included from port.h:85, from output.c:23: /usr/include/string.h:140:12: note: in a call to function 'strcmp' declared 'nonnull' 140 | extern int strcmp (const char *__s1, const char *__s2) | ^~~~~~ make[1]: Leaving directory '/tmp/B.z0qav90z/BUILD/tf-50b8/src' make[1]: Entering directory '/tmp/B.z0qav90z/BUILD/tf-50b8/src' i686-pld-linux-gcc -O2 -fwrapv -pipe -Wformat -Werror=format-security -gdwarf-4 -fno-debug-types-section -fvar-tracking-assignments -g2 -Wp,-D_FORTIFY_SOURCE=2 -fstack-protector-strong --param=ssp-buffer-size=4 -Werror=trampolines -fomit-frame-pointer -march=i686 -fasynchronous-unwind-tables -mtune=pentium4 -gdwarf-4 -fno-debug-types-section -fvar-tracking-assignments -g2 -DDATADIR=/usr/share -c -o socket.o socket.c In file included from socket.c:64: socket.c: In function 'opensock': util.h:32:37: warning: argument 1 null where non-null expected [-Wnonnull] 32 | #define STRDUP(src) STRNDUP((src), strlen(src)) | ^~~~~~ util.h:31:28: note: in definition of macro 'STRNDUP' 31 | (strcpy(xmalloc(NULL, (len) + 1, __FILE__, __LINE__), (src))) | ^~~ socket.c:1285:23: note: in expansion of macro 'STRDUP' 1285 | xsock->host = STRDUP(proxy_host); | ^~~~~~ In file included from port.h:85, from socket.c:62: /usr/include/string.h:391:15: note: in a call to function 'strlen' declared 'nonnull' 391 | extern size_t strlen (const char *__s) | ^~~~~~ In file included from socket.c:64: util.h:31:6: warning: argument 2 null where non-null expected [-Wnonnull] 31 | (strcpy(xmalloc(NULL, (len) + 1, __FILE__, __LINE__), (src))) | ^~~~~~ util.h:32:22: note: in expansion of macro 'STRNDUP' 32 | #define STRDUP(src) STRNDUP((src), strlen(src)) | ^~~~~~~ socket.c:1285:23: note: in expansion of macro 'STRDUP' 1285 | xsock->host = STRDUP(proxy_host); | ^~~~~~ In file included from /usr/include/features.h:488, from /usr/include/assert.h:35, from tfconfig.h:106, from socket.c:21: /usr/include/bits/string_fortified.h:77:1: note: in a call to function 'strcpy' declared 'nonnull' 77 | __NTH (strcpy (char *__restrict __dest, const char *__restrict __src)) | ^~~~~ In file included from socket.c:64: util.h:32:37: warning: argument 1 null where non-null expected [-Wnonnull] 32 | #define STRDUP(src) STRNDUP((src), strlen(src)) | ^~~~~~ util.h:31:28: note: in definition of macro 'STRNDUP' 31 | (strcpy(xmalloc(NULL, (len) + 1, __FILE__, __LINE__), (src))) | ^~~ socket.c:1299:25: note: in expansion of macro 'STRDUP' 1299 | xsock->myhost = STRDUP(tfhost); | ^~~~~~ In file included from port.h:85, from socket.c:62: /usr/include/string.h:391:15: note: in a call to function 'strlen' declared 'nonnull' 391 | extern size_t strlen (const char *__s) | ^~~~~~ In file included from socket.c:64: util.h:31:6: warning: argument 2 null where non-null expected [-Wnonnull] 31 | (strcpy(xmalloc(NULL, (len) + 1, __FILE__, __LINE__), (src))) | ^~~~~~ util.h:32:22: note: in expansion of macro 'STRNDUP' 32 | #define STRDUP(src) STRNDUP((src), strlen(src)) | ^~~~~~~ socket.c:1299:25: note: in expansion of macro 'STRDUP' 1299 | xsock->myhost = STRDUP(tfhost); | ^~~~~~ In file included from /usr/include/features.h:488, from /usr/include/assert.h:35, from tfconfig.h:106, from socket.c:21: /usr/include/bits/string_fortified.h:77:1: note: in a call to function 'strcpy' declared 'nonnull' 77 | __NTH (strcpy (char *__restrict __dest, const char *__restrict __src)) | ^~~~~ socket.c: In function 'handle_socket_lines': socket.c:2603:27: warning: assignment to 'String *' from incompatible pointer type 'conString *' [-Wincompatible-pointer-types] 2603 | incoming_text = line; | ^ socket.c: In function 'openconn': socket.c:1468:13: warning: ignoring return value of 'read' declared with attribute 'warn_unused_result' [-Wunused-result] 1468 | read(xsock->fd, (char*)xsock->addrs, info.size); | ^~~~~~~~~~~~~~~~~~~~~~~~~~~~~~~~~~~~~~~~~~~~~~~ socket.c: In function 'waitforhostname': socket.c:1794:9: warning: ignoring return value of 'writev' declared with attribute 'warn_unused_result' [-Wunused-result] 1794 | writev(fd, iov, niov); | ^~~~~~~~~~~~~~~~~~~~~ socket.c:1798:9: warning: ignoring return value of 'write' declared with attribute 'warn_unused_result' [-Wunused-result] 1798 | write(fd, &hdr, sizeof(hdr)); | ^~~~~~~~~~~~~~~~~~~~~~~~~~~~ make[1]: Leaving directory '/tmp/B.z0qav90z/BUILD/tf-50b8/src' make[1]: Entering directory '/tmp/B.z0qav90z/BUILD/tf-50b8/src' i686-pld-linux-gcc -Wl,--as-needed -Wl,--no-copy-dt-needed-entries -Wl,-z,relro -Wl,-z,combreloc -o tf attr.o command.o dstring.o expand.o expr.o help.o history.o keyboard.o macro.o main.o malloc.o output.o pattern.o process.o search.o signals.o socket.o tfio.o tty.o util.o variable.o world.o -lz -lm -lncurses -lnet -lssl -lcrypto -lpcre /usr/bin/ld: expand.o:/tmp/B.z0qav90z/BUILD/tf-50b8/src/socket.h:24: multiple definition of `world_decl'; command.o:/tmp/B.z0qav90z/BUILD/tf-50b8/src/socket.h:24: first defined here /usr/bin/ld: expr.o:/tmp/B.z0qav90z/BUILD/tf-50b8/src/socket.h:24: multiple definition of `world_decl'; command.o:/tmp/B.z0qav90z/BUILD/tf-50b8/src/socket.h:24: first defined here /usr/bin/ld: history.o:/tmp/B.z0qav90z/BUILD/tf-50b8/src/socket.h:24: multiple definition of `world_decl'; command.o:/tmp/B.z0qav90z/BUILD/tf-50b8/src/socket.h:24: first defined here /usr/bin/ld: macro.o:/tmp/B.z0qav90z/BUILD/tf-50b8/src/socket.h:24: multiple definition of `world_decl'; command.o:/tmp/B.z0qav90z/BUILD/tf-50b8/src/socket.h:24: first defined here /usr/bin/ld: main.o:/tmp/B.z0qav90z/BUILD/tf-50b8/src/socket.h:24: multiple definition of `world_decl'; command.o:/tmp/B.z0qav90z/BUILD/tf-50b8/src/socket.h:24: first defined here /usr/bin/ld: output.o:/tmp/B.z0qav90z/BUILD/tf-50b8/src/socket.h:24: multiple definition of `world_decl'; command.o:/tmp/B.z0qav90z/BUILD/tf-50b8/src/socket.h:24: first defined here /usr/bin/ld: process.o:/tmp/B.z0qav90z/BUILD/tf-50b8/src/socket.h:24: multiple definition of `world_decl'; command.o:/tmp/B.z0qav90z/BUILD/tf-50b8/src/socket.h:24: first defined here /usr/bin/ld: socket.o:/tmp/B.z0qav90z/BUILD/tf-50b8/src/socket.h:24: multiple definition of `world_decl'; command.o:/tmp/B.z0qav90z/BUILD/tf-50b8/src/socket.h:24: first defined here /usr/bin/ld: variable.o:/tmp/B.z0qav90z/BUILD/tf-50b8/src/socket.h:24: multiple definition of `world_decl'; command.o:/tmp/B.z0qav90z/BUILD/tf-50b8/src/socket.h:24: first defined here /usr/bin/ld: world.o:/tmp/B.z0qav90z/BUILD/tf-50b8/src/socket.h:24: multiple definition of `world_decl'; command.o:/tmp/B.z0qav90z/BUILD/tf-50b8/src/socket.h:24: first defined here collect2: error: ld returned 1 exit status make[1]: *** [Makefile:160: tf] Error 1 make[1]: Leaving directory '/tmp/B.z0qav90z/BUILD/tf-50b8/src' make: *** [Makefile:18: files] Error 2 error: Bad exit status from /tmp/B.z0qav90z/BUILD/tmp/rpm-tmp.NyKFz5 (%build) RPM build errors: Could not canonicalize hostname: nereid Bad exit status from /tmp/B.z0qav90z/BUILD/tmp/rpm-tmp.NyKFz5 (%build) ended at: Sat Sep 25 23:27:12 2021, done in 0:00:08.849705 error: No files produced. + chmod -R u+rwX /tmp/B.z0qav90z/BUILD + rm -rf /tmp/B.z0qav90z/tmp /tmp/B.z0qav90z/BUILD + rm -rf /tmp/B.z0qav90z Begin-PLD-Builder-Info Build-Time: user:17.75s sys:2.86s real:10.75s (faults io:1 non-io:765534) End-PLD-Builder-Info
[Back to list of logs] [View rpm -qa of builder]