FailedOk

th/SRPMS[OK]
th/x32[OK]
th/i686[OK]
th/x86_64[OK]

ac/SRPMS[OK]
ac/i386[OK]
ac/i586[OK]
ac/i686[OK]
ac/alpha[OK]
ac/amd64[OK]
ac/athlon[OK]
ac/ppc[OK]
ac/sparc[OK]
ac/sparc64[OK]

Advanced Search
main()
Powered by PLD Linux
(c) 2002-2021 PLD Team
$Revision: 1.37 $
Powered by electricity.
Your IP: 3.80.3.192

vacm 8257b1c0-5905-4c32-8a8f-163742e51f6d

Status:Failed
Source URL:https://buildlogs.pld-linux.org/pld/th/i686/FAIL/vacm,8257b1c0-5905-4c32-8a8f-163742e51f6d.bz2
text/plain URL:View!
full text:View!
rpm -qa of builder:View!
Date:2021/09/25 23:30:56
Runtime:0:00:23.524631

Toc:

  • error 1
  • /tmp/B.eksdgqn8/BUILD/vacm-2.0.5a/nexxus/nexxus_modules/emp/emp_thread.c:777: undefined reference to `pthread_mutexattr_setkind_np'
  • error 2
  • collect2: error: ld returned 1 exit status
  • error 3
  • make[5]: *** [Makefile:481: emp.loose] Error 1
  • error 4
  • make[4]: *** [Makefile:538: all-recursive] Error 1
  • error 5
  • make[3]: *** [Makefile:388: all-recursive] Error 1
  • error 6
  • make[2]: *** [Makefile:539: all-recursive] Error 1
  • error 7
  • make[1]: *** [Makefile:444: all-recursive] Error 1
  • error 8
  • error: Bad exit status from /tmp/B.eksdgqn8/BUILD/tmp/rpm-tmp.JKgUcr (%build)
  • error 9
  • RPM build errors:
  • error 10
  • error: No files produced.

Content:

      |         ^~~~~~~~
In file included from emp_thread.c:54:
./include/emp_sel.h:35:3: warning: 'packed' attribute ignored for field of type 'unsigned char' [-Wattributes]
   35 |   unsigned char  cc      __attribute__ ((packed));
      |   ^~~~~~~~
./include/emp_sel.h:42:3: warning: 'packed' attribute ignored for field of type 'unsigned char' [-Wattributes]
   42 |   unsigned char  clr0    __attribute__ ((packed));
      |   ^~~~~~~~
./include/emp_sel.h:43:3: warning: 'packed' attribute ignored for field of type 'unsigned char' [-Wattributes]
   43 |   unsigned char  clr1    __attribute__ ((packed));
      |   ^~~~~~~~
./include/emp_sel.h:44:3: warning: 'packed' attribute ignored for field of type 'unsigned char' [-Wattributes]
   44 |   unsigned char  clr2    __attribute__ ((packed));
      |   ^~~~~~~~
./include/emp_sel.h:45:3: warning: 'packed' attribute ignored for field of type 'unsigned char' [-Wattributes]
   45 |   unsigned char  op      __attribute__ ((packed));
      |   ^~~~~~~~
./include/emp_sel.h:59:3: warning: 'packed' attribute ignored for field of type 'unsigned char' [-Wattributes]
   59 |   unsigned char         completion_code __attribute__ ((packed));
      |   ^~~~~~~~
./include/emp_sel.h:62:3: warning: 'packed' attribute ignored for field of type 'unsigned char' [-Wattributes]
   62 |   unsigned char         type            __attribute__ ((packed));
      |   ^~~~~~~~
./include/emp_sel.h:71:3: warning: 'packed' attribute ignored for field of type 'unsigned char' [-Wattributes]
   71 |   unsigned char         evmrev          __attribute__ ((packed));
      |   ^~~~~~~~
./include/emp_sel.h:72:3: warning: 'packed' attribute ignored for field of type 'unsigned char' [-Wattributes]
   72 |   unsigned char         sensortype      __attribute__ ((packed));
      |   ^~~~~~~~
./include/emp_sel.h:73:3: warning: 'packed' attribute ignored for field of type 'unsigned char' [-Wattributes]
   73 |   unsigned char         sensornum       __attribute__ ((packed));
      |   ^~~~~~~~
./include/emp_sel.h:74:3: warning: 'packed' attribute ignored for field of type 'unsigned char' [-Wattributes]
   74 |   unsigned char         event_type      __attribute__ ((packed));
      |   ^~~~~~~~
./include/emp_sel.h:75:3: warning: 'packed' attribute ignored for field of type 'unsigned char[3]' [-Wattributes]
   75 |   unsigned char         event_data[3]   __attribute__ ((packed));
      |   ^~~~~~~~
./include/emp_sel.h:80:3: warning: 'packed' attribute ignored for field of type 'unsigned char' [-Wattributes]
   80 |   unsigned char   cc                        __attribute__ ((packed));
      |   ^~~~~~~~
./include/emp_sel.h:81:3: warning: 'packed' attribute ignored for field of type 'unsigned char' [-Wattributes]
   81 |   unsigned char   sel_ver                   __attribute__ ((packed));
      |   ^~~~~~~~
./include/emp_sel.h:96:3: warning: 'packed' attribute ignored for field of type 'unsigned char' [-Wattributes]
   96 |   unsigned char   cc                        __attribute__ ((packed));
      |   ^~~~~~~~
./include/emp_sel.h:101:3: warning: 'packed' attribute ignored for field of type 'unsigned char' [-Wattributes]
  101 |   unsigned char   maximum_record_size       __attribute__ ((packed));
      |   ^~~~~~~~
In file included from emp_thread.c:55:
./include/emp_sensor_events.h:53:3: warning: 'packed' attribute ignored for field of type 'unsigned char' [-Wattributes]
   53 |   unsigned char trigger_reading             __attribute__ ((packed));
      |   ^~~~~~~~
./include/emp_sensor_events.h:56:3: warning: 'packed' attribute ignored for field of type 'unsigned char' [-Wattributes]
   56 |   unsigned char threshold_value             __attribute__ ((packed));
      |   ^~~~~~~~
./include/emp_sensor_events.h:76:3: warning: 'packed' attribute ignored for field of type 'unsigned char' [-Wattributes]
   76 |   unsigned char oem_code                    __attribute__ ((packed));
      |   ^~~~~~~~
./include/emp_sensor_events.h:98:3: warning: 'packed' attribute ignored for field of type 'unsigned char' [-Wattributes]
   98 |   unsigned char oem_code                    __attribute__ ((packed));
      |   ^~~~~~~~
emp_thread.c: In function 'thread_start':
emp_thread.c:218:9: warning: implicit declaration of function '_pthread_cleanup_push'; did you mean 'pthread_cleanup_push'? [-Wimplicit-function-declaration]
  218 |         _pthread_cleanup_push(&_buff, thread_cleanup, (void *) ctx);
      |         ^~~~~~~~~~~~~~~~~~~~~
      |         pthread_cleanup_push
emp_thread.c: In function 'emp_engage':
emp_thread.c:777:9: warning: implicit declaration of function 'pthread_mutexattr_setkind_np'; did you mean 'pthread_rwlockattr_setkind_np'? [-Wimplicit-function-declaration]
  777 |         pthread_mutexattr_setkind_np(&mutex_attr, PTHREAD_MUTEX_ERRORCHECK_NP);
      |         ^~~~~~~~~~~~~~~~~~~~~~~~~~~~
      |         pthread_rwlockattr_setkind_np
emp_thread.c: In function 'parse_sel_entry':
emp_thread.c:4415:31: warning: cast from pointer to integer of different size [-Wpointer-to-int-cast]
 4415 |            (description[0] != (char) NULL ? description : "No Description Available"))));
      |                               ^
emp_thread.c: In function 'thread_start':
emp_thread.c:1217:76: warning: '%s' directive writing up to 254 bytes into a region of size between 227 and 247 [-Wformat-overflow=]
 1217 |                                                                 "%d:%d:FOR:%s",
      |                                                                            ^~
......
 1220 |                                                                 sensor_msg);
      |                                                                 ~~~~~~~~~~  
In file included from /usr/include/stdio.h:888,
                 from emp_thread.c:25:
/usr/include/bits/stdio2.h:38:10: note: '__builtin___sprintf_chk' output between 9 and 283 bytes into a destination of size 255
   38 |   return __builtin___sprintf_chk (__s, __USE_FORTIFY_LEVEL - 1,
      |          ^~~~~~~~~~~~~~~~~~~~~~~~~~~~~~~~~~~~~~~~~~~~~~~~~~~~~~
   39 |                                   __glibc_objsize (__s), __fmt,
      |                                   ~~~~~~~~~~~~~~~~~~~~~~~~~~~~~
   40 |                                   __va_arg_pack ());
      |                                   ~~~~~~~~~~~~~~~~~
mv -f .deps/emp_thread.Tpo .deps/emp_thread.Po
make[5]: Leaving directory '/tmp/B.eksdgqn8/BUILD/vacm-2.0.5a/nexxus/nexxus_modules/emp'
make[5]: Entering directory '/tmp/B.eksdgqn8/BUILD/vacm-2.0.5a/nexxus/nexxus_modules/emp'
/bin/sh ../../../libtool  --tag=CC   --mode=link i686-pld-linux-gcc  -O2 -fwrapv -pipe -Wformat -Werror=format-security -gdwarf-4 -fno-debug-types-section -fvar-tracking-assignments -g2 -Wp,-D_FORTIFY_SOURCE=2 -fstack-protector-strong --param=ssp-buffer-size=4 -Werror=trampolines -fomit-frame-pointer -march=i686 -fasynchronous-unwind-tables -mtune=pentium4 -gdwarf-4 -fno-debug-types-section -fvar-tracking-assignments -g2  -rdynamic -Wl,--as-needed -Wl,--no-copy-dt-needed-entries -Wl,-z,relro -Wl,-z,combreloc  -o emp.loose emp_module_harness.o emp_slave.o emp_slave_machine.o emp_slave_context.o emp_thread.o emp_driver.o emp_sensor.o emp_thread_common.o ../../../nexxus/nexxus_modules/libloose/libloose.la -L/usr/lib -L/usr/lib -lpthread -ldl -lssl -lcrypto -Wl,--as-needed -Wl,--no-copy-dt-needed-entries -Wl,-z,relro -Wl,-z,combreloc  -lm  -Wl,--as-needed -Wl,--no-copy-dt-needed-entries -Wl,-z,relro -Wl,-z,combreloc  -lm 
libtool: link: i686-pld-linux-gcc -O2 -fwrapv -pipe -Wformat -Werror=format-security -gdwarf-4 -fno-debug-types-section -fvar-tracking-assignments -g2 -Wp,-D_FORTIFY_SOURCE=2 -fstack-protector-strong --param=ssp-buffer-size=4 -Werror=trampolines -fomit-frame-pointer -march=i686 -fasynchronous-unwind-tables -mtune=pentium4 -gdwarf-4 -fno-debug-types-section -fvar-tracking-assignments -g2 -rdynamic -Wl,--as-needed -Wl,--no-copy-dt-needed-entries -Wl,-z -Wl,relro -Wl,-z -Wl,combreloc -o .libs/emp.loose emp_module_harness.o emp_slave.o emp_slave_machine.o emp_slave_context.o emp_thread.o emp_driver.o emp_sensor.o emp_thread_common.o -Wl,--as-needed -Wl,--no-copy-dt-needed-entries -Wl,-z -Wl,relro -Wl,-z -Wl,combreloc -Wl,--as-needed -Wl,--no-copy-dt-needed-entries -Wl,-z -Wl,relro -Wl,-z -Wl,combreloc  ../../../nexxus/nexxus_modules/libloose/.libs/libloose.so -L/usr/lib -lpthread -ldl -lssl -lcrypto -lm
/usr/bin/ld: emp_thread.o: in function `emp_engage':
/tmp/B.eksdgqn8/BUILD/vacm-2.0.5a/nexxus/nexxus_modules/emp/emp_thread.c:777: undefined reference to `pthread_mutexattr_setkind_np'
collect2: error: ld returned 1 exit status
make[5]: *** [Makefile:481: emp.loose] Error 1
make[5]: Leaving directory '/tmp/B.eksdgqn8/BUILD/vacm-2.0.5a/nexxus/nexxus_modules/emp'
make[4]: *** [Makefile:538: all-recursive] Error 1
make[3]: *** [Makefile:388: all-recursive] Error 1
make[2]: *** [Makefile:539: all-recursive] Error 1
make[1]: *** [Makefile:444: all-recursive] Error 1
make: *** [Makefile:372: all] Error 2
error: Bad exit status from /tmp/B.eksdgqn8/BUILD/tmp/rpm-tmp.JKgUcr (%build)


RPM build errors:
    Could not canonicalize hostname: nereid
    Bad exit status from /tmp/B.eksdgqn8/BUILD/tmp/rpm-tmp.JKgUcr (%build)
ended at: Sat Sep 25 23:30:56 2021, done in 0:00:23.524631
error: No files produced.
+ chmod -R u+rwX /tmp/B.eksdgqn8/BUILD
+ rm -rf /tmp/B.eksdgqn8/tmp /tmp/B.eksdgqn8/BUILD
+ rm -rf /tmp/B.eksdgqn8
Begin-PLD-Builder-Info
Build-Time: user:22.75s sys:5.60s real:25.53s (faults io:4 non-io:1553196)

End-PLD-Builder-Info
[Back to list of logs] [View rpm -qa of builder]