FailedOk

th/SRPMS[OK]
th/x32[OK]
th/i686[OK]
th/x86_64[OK]

ac/SRPMS[OK]
ac/i386[OK]
ac/i586[OK]
ac/i686[OK]
ac/alpha[OK]
ac/amd64[OK]
ac/athlon[OK]
ac/ppc[OK]
ac/sparc[OK]
ac/sparc64[OK]

Advanced Search
main()
Powered by PLD Linux
(c) 2002-2017 PLD Team
$Revision: 1.37 $
Powered by sfistak.
Your IP: 23.20.103.97

vpb-driver b6b65614-97ee-4635-8a73-7f117eda0cc6

Status:Failed
Source URL:ftp://buildlogs.pld-linux.org/th/i686/FAIL/vpb-driver,b6b65614-97ee-4635-8a73-7f117eda0cc6.bz2
text/plain URL:View!
full text:View!
rpm -qa of builder:View!
Date:2017/07/31 19:53:06
Runtime:0:00:14.069462

Toc:

  • error 1
  • /tmp/B.39EvIN/BUILD/vpb-driver-4.2.58/src/vpb/vpb.c:457:8: error: implicit declaration of function 'copy_from_user' [-Werror=implicit-function-declaration]
  • error 2
  • /tmp/B.39EvIN/BUILD/vpb-driver-4.2.58/src/vpb/vpb.c:475:9: error: implicit declaration of function 'copy_to_user' [-Werror=implicit-function-declaration]
  • error 3
  • error: Bad exit status from /tmp/B.39EvIN/BUILD/tmp/rpm-tmp.38760 (%build)
  • error 4
  • RPM build errors:
  • error 5
  • error: No files produced.

Content:

no BR needed
building RPM using: set -ex; : build-id: b6b65614-97ee-4635-8a73-7f117eda0cc6; TMPDIR=/tmp/B.39EvIN/BUILD/tmp exec nice -n 0 rpmbuild -bb --define '_smp_mflags -j9' --define '_make_opts -Otarget' --define '_pld_builder 1' --define '_topdir /tmp/B.39EvIN' --define '_specdir %{_topdir}' --define '_sourcedir %{_specdir}' --define '_rpmdir %{_topdir}/RPMS' --define '_builddir %{_topdir}/BUILD'  --without userspace --target i686-pld-linux --define 'build_kernels head,4.9,4.4,4.1' /tmp/B.39EvIN/vpb-driver.spec
+ : build-id: b6b65614-97ee-4635-8a73-7f117eda0cc6
+ TMPDIR=/tmp/B.39EvIN/BUILD/tmp
+ exec nice -n 0 rpmbuild -bb --define '_smp_mflags -j9' --define '_make_opts -Otarget' --define '_pld_builder 1' --define '_topdir /tmp/B.39EvIN' --define '_specdir %{_topdir}' --define '_sourcedir %{_specdir}' --define '_rpmdir %{_topdir}/RPMS' --define '_builddir %{_topdir}/BUILD' --without userspace --target i686-pld-linux --define 'build_kernels head,4.9,4.4,4.1' /tmp/B.39EvIN/vpb-driver.spec
Building target platforms: i686-pld-linux
Executing(%prep): /bin/sh -e /tmp/B.39EvIN/BUILD/tmp/rpm-tmp.95838
+ umask 022
+ cd /tmp/B.39EvIN/BUILD
+ cd /tmp/B.39EvIN/BUILD
+ rm -rf vpb-driver-4.2.58
+ /usr/bin/gzip -dc /tmp/B.39EvIN/vpb-driver-4.2.58.tar.gz
+ /bin/tar -xf -
+ STATUS=0 
+ '[' 0 -ne 0 ']'
+ cd vpb-driver-4.2.58
+ /bin/id -u
+ '[' 1001 '=' 0 ']'
+ /bin/id -u
+ '[' 1001 '=' 0 ']'
+ /bin/chmod -Rf a+rX,u+w,g-w,o-w .
+ echo 'Patch #0 (vpb-driver-make.patch):'
Patch #0 (vpb-driver-make.patch):
+ '[' -f /tmp/B.39EvIN/vpb-driver-make.patch ']'
+ /bin/cat /tmp/B.39EvIN/vpb-driver-make.patch
+ /usr/bin/patch -s -p1
+ /bin/sed -i -e 's,subdirs = libtoneg libvpb utils,,' src/Makefile.in
+ exit 0
Executing(%build): /bin/sh -e /tmp/B.39EvIN/BUILD/tmp/rpm-tmp.38760
TMP=/home/users/builder/tmp
HOME=/home/users/builder
PATH=/home/users/builder/GNUstep/Tools:/usr/local/bin:/usr/bin:/bin:/home/users/builder/bin
TMPDIR=/tmp/B.39EvIN/BUILD/tmp
+ umask 022
+ cd /tmp/B.39EvIN/BUILD
+ cd vpb-driver-4.2.58
+ aclocal
+ autoconf
+ ./configure 'LDFLAGS=-Wl,--as-needed -Wl,--no-copy-dt-needed-entries -Wl,-z,relro -Wl,-z,combreloc ' 'CFLAGS=-O2 -fwrapv -pipe -Wformat -Werror=format-security -Wp,-D_FORTIFY_SOURCE=2 -fstack-protector-strong --param=ssp-buffer-size=4 -fomit-frame-pointer -march=i686 -fasynchronous-unwind-tables -mtune=pentium4 ' 'CXXFLAGS=-O2 -fwrapv -pipe -Wformat -Werror=format-security -Wp,-D_FORTIFY_SOURCE=2 -fstack-protector-strong --param=ssp-buffer-size=4 -fomit-frame-pointer -march=i686 -fasynchronous-unwind-tables -mtune=pentium4 ' 'FFLAGS=-O2 -fwrapv -pipe -Wformat -Werror=format-security -Wp,-D_FORTIFY_SOURCE=2 -fstack-protector-strong --param=ssp-buffer-size=4 -fomit-frame-pointer -march=i686 -fasynchronous-unwind-tables -mtune=pentium4 ' 'FCFLAGS=-O2 -fwrapv -pipe -Wformat -Werror=format-security -Wp,-D_FORTIFY_SOURCE=2 -fstack-protector-strong --param=ssp-buffer-size=4 -fomit-frame-pointer -march=i686 -fasynchronous-unwind-tables -mtune=pentium4 ' 'CPPFLAGS=' 'CC=i686-pld-linux-gcc' 'CXX=i686-pld-linux-g++' '--host=i686-pld-linux' '--build=i686-pld-linux' '--prefix=/usr' '--exec-prefix=/usr' '--bindir=/usr/bin' '--sbindir=/usr/sbin' '--sysconfdir=/etc' '--datadir=/usr/share' '--includedir=/usr/include' '--libdir=/usr/lib' '--libexecdir=/usr/lib' '--localstatedir=/var' '--sharedstatedir=/var/lib' '--mandir=/usr/share/man' '--infodir=/usr/share/info' '--x-libraries=/usr/lib' --enable-shared
checking build system type... i686-pld-linux-gnu
checking host system type... i686-pld-linux-gnu
checking for i686-pld-linux-gcc... i686-pld-linux-gcc
checking whether the C compiler works... yes
checking for C compiler default output file name... a.out
checking for suffix of executables... 
checking whether we are cross compiling... no
checking for suffix of object files... o
checking whether we are using the GNU C compiler... yes
checking whether i686-pld-linux-gcc accepts -g... yes
checking for i686-pld-linux-gcc option to accept ISO C89... none needed
checking how to run the C preprocessor... i686-pld-linux-gcc -E
checking whether we are using the GNU C++ compiler... yes
checking whether i686-pld-linux-g++ accepts -g... yes
checking how to run the C++ preprocessor... i686-pld-linux-g++ -E
checking for i686-pld-linux-ar... no
checking for ar... ar
checking for pthread_create in -lpthread... yes
checking for gzopen in -lz... yes
checking for pci_read_block in -lpci... yes
checking for an ANSI C-conforming const... yes
configure: creating ./config.status
config.status: creating Version
config.status: creating Makefile
config.status: creating Makefile.common
config.status: creating src/Makefile
config.status: creating src/libtoneg/Makefile
config.status: creating src/libvpb/Makefile
config.status: creating src/libvpb/doc/doxyconf
config.status: creating src/utils/Makefile
config.status: creating vpb-detect/Makefile
config.status: creating src/utils/VpbConfigurator

Configured vpb-driver 4.2.58:

  library linkage:  shared
  using pri:        no
  using debug mode: no

+ /usr/bin/make -Otarget -j9 -C src/vtcore 'KSRC=/usr/src/linux'
/usr/bin/make -C /usr/src/linux M=/tmp/B.39EvIN/BUILD/vpb-driver-4.2.58/src/vtcore VT_VERSION=4.2.58 modules
  CC [M]  /tmp/B.39EvIN/BUILD/vpb-driver-4.2.58/src/vtcore/mu-alaw.o
  CC [M]  /tmp/B.39EvIN/BUILD/vpb-driver-4.2.58/src/vtcore/vtopenswitch.o
  CC [M]  /tmp/B.39EvIN/BUILD/vpb-driver-4.2.58/src/vtcore/vtcore_main.o
  LD [M]  /tmp/B.39EvIN/BUILD/vpb-driver-4.2.58/src/vtcore/vtcore.o
  CC [M]  /tmp/B.39EvIN/BUILD/vpb-driver-4.2.58/src/vtcore/vtopenpci.o
make[1]: Entering directory '/usr/src/linux-4.12.4'
  Building modules, stage 2.
make[1]: Leaving directory '/usr/src/linux-4.12.4'
  MODPOST 3 modules
  CC      /tmp/B.39EvIN/BUILD/vpb-driver-4.2.58/src/vtcore/vtcore.mod.o
  LD [M]  /tmp/B.39EvIN/BUILD/vpb-driver-4.2.58/src/vtcore/vtcore.ko
  CC      /tmp/B.39EvIN/BUILD/vpb-driver-4.2.58/src/vtcore/vtopenpci.mod.o
  CC      /tmp/B.39EvIN/BUILD/vpb-driver-4.2.58/src/vtcore/vtopenswitch.mod.o
  LD [M]  /tmp/B.39EvIN/BUILD/vpb-driver-4.2.58/src/vtcore/vtopenpci.ko
  LD [M]  /tmp/B.39EvIN/BUILD/vpb-driver-4.2.58/src/vtcore/vtopenswitch.ko
+ /usr/bin/make -Otarget -j9 -C src/vpb 'KSRC=/usr/src/linux'
/usr/bin/make -C /usr/src/linux M=/tmp/B.39EvIN/BUILD/vpb-driver-4.2.58/src/vpb VT_VERSION=4.2.58 modules
  CC [M]  /tmp/B.39EvIN/BUILD/vpb-driver-4.2.58/src/vpb/vpb.o
/tmp/B.39EvIN/BUILD/vpb-driver-4.2.58/src/vpb/vpb.c: In function 'vpb_ioctl':
/tmp/B.39EvIN/BUILD/vpb-driver-4.2.58/src/vpb/vpb.c:457:8: error: implicit declaration of function 'copy_from_user' [-Werror=implicit-function-declaration]
  ret = copy_from_user(&vpb_data, (void*)arg, sizeof(VPB_DATA));
        ^~~~~~~~~~~~~~
/tmp/B.39EvIN/BUILD/vpb-driver-4.2.58/src/vpb/vpb.c:475:9: error: implicit declaration of function 'copy_to_user' [-Werror=implicit-function-declaration]
   ret = copy_to_user(data, &numPCI, sizeof(int));
         ^~~~~~~~~~~~
cc1: some warnings being treated as errors
make[2]: *** [scripts/Makefile.build:309: /tmp/B.39EvIN/BUILD/vpb-driver-4.2.58/src/vpb/vpb.o] Error 1
make[1]: *** [Makefile:1515: _module_/tmp/B.39EvIN/BUILD/vpb-driver-4.2.58/src/vpb] Error 2
make: *** [Makefile:39: all] Error 2
error: Bad exit status from /tmp/B.39EvIN/BUILD/tmp/rpm-tmp.38760 (%build)


RPM build errors:
    Bad exit status from /tmp/B.39EvIN/BUILD/tmp/rpm-tmp.38760 (%build)
ended at: Mon Jul 31 19:53:06 2017, done in 0:00:14.069462
error: No files produced.
+ chmod -R u+rwX /tmp/B.39EvIN/BUILD
+ rm -rf /tmp/B.39EvIN/tmp /tmp/B.39EvIN/BUILD
+ rm -rf /tmp/B.39EvIN
Begin-PLD-Builder-Info
Build-Time: user:11.89s sys:1.24s real:24.44s (faults io:0 non-io:644393)

End-PLD-Builder-Info
[Back to list of logs] [View rpm -qa of builder]