FailedOk

th/SRPMS[OK]
th/x32[OK]
th/i686[OK]
th/x86_64[OK]

ac/SRPMS[OK]
ac/i386[OK]
ac/i586[OK]
ac/i686[OK]
ac/alpha[OK]
ac/amd64[OK]
ac/athlon[OK]
ac/ppc[OK]
ac/sparc[OK]
ac/sparc64[OK]

Advanced Search
main()
Powered by PLD Linux
(c) 2002-2017 PLD Team
$Revision: 1.37 $
Powered by Unix conspiracy.
Your IP: 54.221.73.186

wl c13ff16e-a3dc-460e-a13f-aa0eb3973f41

Status:Failed
Source URL:ftp://buildlogs.pld-linux.org/th/i686/FAIL/wl,c13ff16e-a3dc-460e-a13f-aa0eb3973f41.bz2
text/plain URL:View!
rpm -qa of builder:View!
Date:2017/08/01 21:25:15
Runtime:0:00:06.214183

Toc:

  • prep
  • Executing(%prep): /bin/sh -e /tmp/B.ENka5q/BUILD/tmp/rpm-tmp.82677
  • build
  • Executing(%build): /bin/sh -e /tmp/B.ENka5q/BUILD/tmp/rpm-tmp.82677
  • error 1
  • /tmp/B.ENka5q/BUILD/wl-6.30.223.271/wl/src/wl/sys/wl_cfg80211_hybrid.c:1804:25: error: initialization from incompatible pointer type [-Werror=incompatible-pointer-types]
  • error 2
  • /tmp/B.ENka5q/BUILD/wl-6.30.223.271/wl/src/wl/sys/wl_cfg80211_hybrid.c:2412:4: error: passing argument 2 of 'cfg80211_roamed' from incompatible pointer type [-Werror=incompatible-pointer-types]
  • error 3
  • /tmp/B.ENka5q/BUILD/wl-6.30.223.271/wl/src/wl/sys/wl_cfg80211_hybrid.c:2410:2: error: too many arguments to function 'cfg80211_roamed'
  • error 4
  • error: Bad exit status from /tmp/B.ENka5q/BUILD/tmp/rpm-tmp.82677 (%build)
  • error 5
  • RPM build errors:
  • error 6
  • error: No files produced.

Content:

request from: baggins
checking if we should skip the build
started at: Tue Aug  1 21:25:01 2017
fetching https://srcbuilder.pld-linux.org/th//srpms/c13ff16e-a3dc-460e-a13f-aa0eb3973f41/wl-kernel-nopae-6.30.223.271-6%404.12.4.nopae_1.src.rpm
fetched 5775532 bytes, 1385.3 K/s
installing srpm: wl-kernel-nopae-6.30.223.271-6@4.12.4.nopae_1.src.rpm
+ install -d /tmp/B.ENka5q/BUILD /tmp/B.ENka5q/RPMS
+ LC_ALL=en_US.UTF-8
+ rpm -qp --changelog wl-kernel-nopae-6.30.223.271-6@4.12.4.nopae_1.src.rpm
* Tue Aug 01 2017 PLD Linux Team <feedback@pld-linux.org>
- For complete changelog see: http://git.pld-linux.org/?p=packages/wl.git;a=log;h=auto/th/wl-6.30.223.271-6
* Tue May 09 2017 Jan Rękorajski <baggins@pld-linux.org> 94191af
- fix building with kerbel 4.11 - rel 6 * Thu Jan 19 2017 Jan Rękorajski <baggins@pld-linux.org> f316d7d
- * added 17-fix-kernel-warnings.patch from Debian (avoid useless kernel warnings and possibly add better tracibility of bogus auth failures) - rel 5 * Tue Dec 27 2016 Jan Rękorajski <baggins@pld-linux.org> 18f1113
- rel 4 * Mon Nov 21 2016 Jan Rękorajski <baggins@pld-linux.org> f36814b
- updated URL * Mon Oct 10 2016 Jan Rękorajski <baggins@pld-linux.org> 0e2168f
- added patches from Debian to fix old crash and new one on linux 4.8 - rel 3 + rpm -Uhv --nodeps --define '_topdir /tmp/B.ENka5q' --define '_specdir %{_topdir}' --define '_sourcedir %{_specdir}' --define '_rpmdir %{_topdir}/RPMS' --define '_builddir %{_topdir}/BUILD' --without userspace --define 'alt_kernel nopae' --define 'build_kernels nopae' wl-kernel-nopae-6.30.223.271-6@4.12.4.nopae_1.src.rpm Preparing... ################################################## wl-kernel-nopae ################################################## + rm -f wl-kernel-nopae-6.30.223.271-6@4.12.4.nopae_1.src.rpm + install -m 700 -d /tmp/B.ENka5q/BUILD/tmp + TMPDIR=/tmp/B.ENka5q/BUILD/tmp + exec nice -n 0 rpmbuild -bp --short-circuit --nodeps --define '_topdir /tmp/B.ENka5q' --define '_specdir %{_topdir}' --define '_sourcedir %{_specdir}' --define '_rpmdir %{_topdir}/RPMS' --define '_builddir %{_topdir}/BUILD' --without userspace --define 'alt_kernel nopae' --target i686-pld-linux --define 'build_kernels nopae' --define 'prep exit 0' /tmp/B.ENka5q/wl.spec Building target platforms: i686-pld-linux checking BuildConflict-ing packages no BuildConflicts found checking BR rpm: Building target platforms: i686-pld-linux no BR needed building RPM using: set -ex; : build-id: c13ff16e-a3dc-460e-a13f-aa0eb3973f41; TMPDIR=/tmp/B.ENka5q/BUILD/tmp exec nice -n 0 rpmbuild -bb --define '_smp_mflags -j9' --define '_make_opts -Otarget' --define '_pld_builder 1' --define '_topdir /tmp/B.ENka5q' --define '_specdir %{_topdir}' --define '_sourcedir %{_specdir}' --define '_rpmdir %{_topdir}/RPMS' --define '_builddir %{_topdir}/BUILD' --without userspace --define 'alt_kernel nopae' --target i686-pld-linux --define 'build_kernels nopae' /tmp/B.ENka5q/wl.spec + : build-id: c13ff16e-a3dc-460e-a13f-aa0eb3973f41 + TMPDIR=/tmp/B.ENka5q/BUILD/tmp + exec nice -n 0 rpmbuild -bb --define '_smp_mflags -j9' --define '_make_opts -Otarget' --define '_pld_builder 1' --define '_topdir /tmp/B.ENka5q' --define '_specdir %{_topdir}' --define '_sourcedir %{_specdir}' --define '_rpmdir %{_topdir}/RPMS' --define '_builddir %{_topdir}/BUILD' --without userspace --define 'alt_kernel nopae' --target i686-pld-linux --define 'build_kernels nopae' /tmp/B.ENka5q/wl.spec Building target platforms: i686-pld-linux Executing(%prep): /bin/sh -e /tmp/B.ENka5q/BUILD/tmp/rpm-tmp.82677 + umask 022 + cd /tmp/B.ENka5q/BUILD + cd /tmp/B.ENka5q/BUILD + rm -rf wl-6.30.223.271 + /bin/mkdir -p wl-6.30.223.271 + cd wl-6.30.223.271 + /usr/bin/gzip -dc /tmp/B.ENka5q/hybrid-v35-nodebug-pcoem-6_30_223_271.tar.gz + /bin/tar -xf - + STATUS=0 + '[' 0 -ne 0 ']' + /bin/id -u + '[' 1001 '=' 0 ']' + /bin/id -u + '[' 1001 '=' 0 ']' + /bin/chmod -Rf a+rX,u+w,g-w,o-w . + echo 'Patch #0 (13-broadcom-sta-6.30.223.248-linux-3.18-null-pointer-crash.patch):' Patch #0 (13-broadcom-sta-6.30.223.248-linux-3.18-null-pointer-crash.patch): + '[' -f /tmp/B.ENka5q/13-broadcom-sta-6.30.223.248-linux-3.18-null-pointer-crash.patch ']' + /bin/cat /tmp/B.ENka5q/13-broadcom-sta-6.30.223.248-linux-3.18-null-pointer-crash.patch + /usr/bin/patch -s -p1 + echo 'Patch #1 (gcc-4.9.patch):' Patch #1 (gcc-4.9.patch): + '[' -f /tmp/B.ENka5q/gcc-4.9.patch ']' + /bin/cat /tmp/B.ENka5q/gcc-4.9.patch + /usr/bin/patch -s -p1 + echo 'Patch #2 (no-dead-code.patch):' Patch #2 (no-dead-code.patch): + '[' -f /tmp/B.ENka5q/no-dead-code.patch ']' + /bin/cat /tmp/B.ENka5q/no-dead-code.patch + /usr/bin/patch -s -p1 + echo 'Patch #3 (linux-4.7.patch):' Patch #3 (linux-4.7.patch): + '[' -f /tmp/B.ENka5q/linux-4.7.patch ']' + /bin/cat /tmp/B.ENka5q/linux-4.7.patch + /usr/bin/patch -s -p1 + echo 'Patch #4 (linux-4.8.patch):' Patch #4 (linux-4.8.patch): + '[' -f /tmp/B.ENka5q/linux-4.8.patch ']' + /bin/cat /tmp/B.ENka5q/linux-4.8.patch + /usr/bin/patch -s -p1 + echo 'Patch #5 (17-fix-kernel-warnings.patch):' Patch #5 (17-fix-kernel-warnings.patch): + '[' -f /tmp/B.ENka5q/17-fix-kernel-warnings.patch ']' + /bin/cat /tmp/B.ENka5q/17-fix-kernel-warnings.patch + /usr/bin/patch -s -p2 + echo 'Patch #6 (linux-4.11.patch):' Patch #6 (linux-4.11.patch): + '[' -f /tmp/B.ENka5q/linux-4.11.patch ']' + /bin/cat /tmp/B.ENka5q/linux-4.11.patch + /usr/bin/patch -s -p1 + mkdir wl + mv lib src Makefile wl/ + cp -p /tmp/B.ENka5q/README.txt . + find '(' -name '*~' -o -name '*.orig' ')' -print0 + xargs -0 -r -l512 rm -f + exit 0 Executing(%build): /bin/sh -e /tmp/B.ENka5q/BUILD/tmp/rpm-tmp.82677 TMP=/home/users/builder/tmp HOME=/home/users/builder PATH=/home/users/builder/GNUstep/Tools:/usr/local/bin:/usr/bin:/bin:/home/users/builder/bin TMPDIR=/tmp/B.ENka5q/BUILD/tmp + umask 022 + cd /tmp/B.ENka5q/BUILD + cd wl-6.30.223.271 + /usr/bin/make -Otarget -j9 -C wl 'KERNELRELEASE=4.12.4.nopae-1' 'KBUILD_DIR=/usr/src/linux-nopae' clean make: Entering directory '/tmp/B.ENka5q/BUILD/wl-6.30.223.271/wl' Wireless Extension is the only possible API for this kernel version Using Wireless Extension API make: Leaving directory '/tmp/B.ENka5q/BUILD/wl-6.30.223.271/wl' make: Entering directory '/tmp/B.ENka5q/BUILD/wl-6.30.223.271/wl' KBUILD_NOPEDANTIC=1 make -C /usr/src/linux-nopae M=`pwd` clean make[1]: Entering directory '/usr/src/linux-nopae-4.12.4' make[1]: warning: jobserver unavailable: using -j1. Add '+' to parent make rule. make[1]: Leaving directory '/usr/src/linux-nopae-4.12.4' make[1]: Entering directory '/usr/src/linux-nopae-4.12.4' CFG80211 API is prefered for this kernel version /tmp/B.ENka5q/BUILD/wl-6.30.223.271/wl/Makefile:85: Neither CFG80211 nor Wireless Extension is enabled in kernel make[1]: Leaving directory '/usr/src/linux-nopae-4.12.4' make: Leaving directory '/tmp/B.ENka5q/BUILD/wl-6.30.223.271/wl' + /usr/bin/make -Otarget -j9 -C wl 'KERNELRELEASE=4.12.4.nopae-1' 'KBUILD_DIR=/usr/src/linux-nopae' make: Entering directory '/tmp/B.ENka5q/BUILD/wl-6.30.223.271/wl' Wireless Extension is the only possible API for this kernel version Using Wireless Extension API make: Leaving directory '/tmp/B.ENka5q/BUILD/wl-6.30.223.271/wl' make: Entering directory '/tmp/B.ENka5q/BUILD/wl-6.30.223.271/wl' KBUILD_NOPEDANTIC=1 make -C /usr/src/linux-nopae M=`pwd` make[1]: Entering directory '/usr/src/linux-nopae-4.12.4' make[1]: warning: jobserver unavailable: using -j1. Add '+' to parent make rule. make[1]: Leaving directory '/usr/src/linux-nopae-4.12.4' make[1]: Entering directory '/usr/src/linux-nopae-4.12.4' CFG80211 API is prefered for this kernel version Using CFG80211 API LD /tmp/B.ENka5q/BUILD/wl-6.30.223.271/wl/built-in.o CC [M] /tmp/B.ENka5q/BUILD/wl-6.30.223.271/wl/src/shared/linux_osl.o CC [M] /tmp/B.ENka5q/BUILD/wl-6.30.223.271/wl/src/wl/sys/wl_linux.o /tmp/B.ENka5q/BUILD/wl-6.30.223.271/wl/src/wl/sys/wl_linux.c: In function 'wl_pci_probe': /tmp/B.ENka5q/BUILD/wl-6.30.223.271/wl/src/wl/sys/wl_linux.c:779:2: warning: this 'if' clause does not guard... [-Wmisleading-indentation] if ((val & 0x0000ff00) != 0) ^~ /tmp/B.ENka5q/BUILD/wl-6.30.223.271/wl/src/wl/sys/wl_linux.c:781:3: note: ...this statement, but the latter is misleadingly indented as if it is guarded by the 'if' bar1_size = pci_resource_len(pdev, 2); ^~~~~~~~~ CC [M] /tmp/B.ENka5q/BUILD/wl-6.30.223.271/wl/src/wl/sys/wl_iw.o CC [M] /tmp/B.ENka5q/BUILD/wl-6.30.223.271/wl/src/wl/sys/wl_cfg80211_hybrid.o /tmp/B.ENka5q/BUILD/wl-6.30.223.271/wl/src/wl/sys/wl_cfg80211_hybrid.c:1804:25: error: initialization from incompatible pointer type [-Werror=incompatible-pointer-types] .change_virtual_intf = wl_cfg80211_change_iface, ^~~~~~~~~~~~~~~~~~~~~~~~ /tmp/B.ENka5q/BUILD/wl-6.30.223.271/wl/src/wl/sys/wl_cfg80211_hybrid.c:1804:25: note: (near initialization for 'wl_cfg80211_ops.change_virtual_intf') /tmp/B.ENka5q/BUILD/wl-6.30.223.271/wl/src/wl/sys/wl_cfg80211_hybrid.c: In function 'wl_bss_roaming_done': /tmp/B.ENka5q/BUILD/wl-6.30.223.271/wl/src/wl/sys/wl_cfg80211_hybrid.c:2412:4: error: passing argument 2 of 'cfg80211_roamed' from incompatible pointer type [-Werror=incompatible-pointer-types] &wl->conf->channel, ^ In file included from /tmp/B.ENka5q/BUILD/wl-6.30.223.271/wl/src/wl/sys/wl_cfg80211_hybrid.c:36:0: ./include/net/cfg80211.h:5435:6: note: expected 'struct cfg80211_roam_info *' but argument is of type 'struct ieee80211_channel *' void cfg80211_roamed(struct net_device *dev, struct cfg80211_roam_info *info, ^~~~~~~~~~~~~~~ /tmp/B.ENka5q/BUILD/wl-6.30.223.271/wl/src/wl/sys/wl_cfg80211_hybrid.c:2414:4: warning: passing argument 3 of 'cfg80211_roamed' makes integer from pointer without a cast [-Wint-conversion] (u8 *)&wl->bssid, ^ In file included from /tmp/B.ENka5q/BUILD/wl-6.30.223.271/wl/src/wl/sys/wl_cfg80211_hybrid.c:36:0: ./include/net/cfg80211.h:5435:6: note: expected 'gfp_t {aka unsigned int}' but argument is of type 'u8 * {aka unsigned char *}' void cfg80211_roamed(struct net_device *dev, struct cfg80211_roam_info *info, ^~~~~~~~~~~~~~~ /tmp/B.ENka5q/BUILD/wl-6.30.223.271/wl/src/wl/sys/wl_cfg80211_hybrid.c:2410:2: error: too many arguments to function 'cfg80211_roamed' cfg80211_roamed(ndev, ^~~~~~~~~~~~~~~ In file included from /tmp/B.ENka5q/BUILD/wl-6.30.223.271/wl/src/wl/sys/wl_cfg80211_hybrid.c:36:0: ./include/net/cfg80211.h:5435:6: note: declared here void cfg80211_roamed(struct net_device *dev, struct cfg80211_roam_info *info, ^~~~~~~~~~~~~~~ cc1: some warnings being treated as errors make[2]: *** [scripts/Makefile.build:303: /tmp/B.ENka5q/BUILD/wl-6.30.223.271/wl/src/wl/sys/wl_cfg80211_hybrid.o] Error 1 make[1]: *** [Makefile:1515: _module_/tmp/B.ENka5q/BUILD/wl-6.30.223.271/wl] Error 2 make[1]: Leaving directory '/usr/src/linux-nopae-4.12.4' make: *** [Makefile:159: all] Error 2 make: Leaving directory '/tmp/B.ENka5q/BUILD/wl-6.30.223.271/wl' error: Bad exit status from /tmp/B.ENka5q/BUILD/tmp/rpm-tmp.82677 (%build) RPM build errors: Bad exit status from /tmp/B.ENka5q/BUILD/tmp/rpm-tmp.82677 (%build) ended at: Tue Aug 1 21:25:15 2017, done in 0:00:06.214183 error: No files produced. + chmod -R u+rwX /tmp/B.ENka5q/BUILD + rm -rf /tmp/B.ENka5q/tmp /tmp/B.ENka5q/BUILD + rm -rf /tmp/B.ENka5q Begin-PLD-Builder-Info Build-Time: user:5.97s sys:0.75s real:14.00s (faults io:0 non-io:353938) End-PLD-Builder-Info
[Back to list of logs] [View rpm -qa of builder]