FailedOk

th/SRPMS[OK]
th/x32[OK]
th/i686[OK]
th/x86_64[OK]

ac/SRPMS[OK]
ac/i386[OK]
ac/i586[OK]
ac/i686[OK]
ac/alpha[OK]
ac/amd64[OK]
ac/athlon[OK]
ac/ppc[OK]
ac/sparc[OK]
ac/sparc64[OK]

Advanced Search
main()
Powered by PLD Linux
(c) 2002-2017 PLD Team
$Revision: 1.37 $
Powered by php.
Your IP: 54.225.47.94

xtables-addons 23a369a5-06b4-40c4-80a5-2ac7e83c23f9

Status:Failed
Source URL:ftp://buildlogs.pld-linux.org/th/i686/FAIL/xtables-addons,23a369a5-06b4-40c4-80a5-2ac7e83c23f9.bz2
text/plain URL:View!
rpm -qa of builder:View!
Date:2017/07/31 19:57:16
Runtime:0:00:07.665724

Toc:

  • prep
  • Executing(%prep): /bin/sh -e /tmp/B.9aa05Z/BUILD/tmp/rpm-tmp.44580
  • build
  • Executing(%build): /bin/sh -e /tmp/B.9aa05Z/BUILD/tmp/rpm-tmp.44580
  • error 1
  • /tmp/B.9aa05Z/BUILD/xtables-addons-2.12/extensions/xt_LOGMARK.c:90:11: error: implicit declaration of function 'nf_ct_is_untracked' [-Werror=implicit-function-declaration]
  • error 2
  • error: Bad exit status from /tmp/B.9aa05Z/BUILD/tmp/rpm-tmp.44580 (%build)
  • error 3
  • RPM build errors:
  • error 4
  • error: No files produced.

Content:

request from: baggins
checking if we should skip the build
started at: Mon Jul 31 19:56:59 2017
fetching https://srcbuilder.pld-linux.org/th//srpms/23a369a5-06b4-40c4-80a5-2ac7e83c23f9/xtables-addons-kernel-2.12-2%404.12.4_1.src.rpm
fetched 330417 bytes, 270.9 K/s
installing srpm: xtables-addons-kernel-2.12-2@4.12.4_1.src.rpm
+ install -d /tmp/B.9aa05Z/BUILD /tmp/B.9aa05Z/RPMS
+ LC_ALL=en_US.UTF-8
+ rpm -qp --changelog xtables-addons-kernel-2.12-2@4.12.4_1.src.rpm
* Mon Jul 31 2017 PLD Linux Team <feedback@pld-linux.org>
- For complete changelog see: http://git.pld-linux.org/?p=packages/xtables-addons.git;a=log;h=master
* Sun Mar 26 2017 Jakub Bogusz <qboosh@pld-linux.org> 4f3fc9f
- release 2 (rebuild userspace with iptables 1.6.1) * Sat Jan 21 2017 Jan Rękorajski <baggins@pld-linux.org> b351b59
- up to 2.12 + rpm -Uhv --nodeps --define '_topdir /tmp/B.9aa05Z' --define '_specdir %{_topdir}' --define '_sourcedir %{_specdir}' --define '_rpmdir %{_topdir}/RPMS' --define '_builddir %{_topdir}/BUILD' --without userspace --define 'build_kernels head,4.9,4.4,4.1' xtables-addons-kernel-2.12-2@4.12.4_1.src.rpm Preparing... ################################################## xtables-addons-kernel ################################################## + rm -f xtables-addons-kernel-2.12-2@4.12.4_1.src.rpm + install -m 700 -d /tmp/B.9aa05Z/BUILD/tmp + TMPDIR=/tmp/B.9aa05Z/BUILD/tmp + exec nice -n 0 rpmbuild -bp --short-circuit --nodeps --define '_topdir /tmp/B.9aa05Z' --define '_specdir %{_topdir}' --define '_sourcedir %{_specdir}' --define '_rpmdir %{_topdir}/RPMS' --define '_builddir %{_topdir}/BUILD' --without userspace --target i686-pld-linux --define 'build_kernels head,4.9,4.4,4.1' --define 'prep exit 0' /tmp/B.9aa05Z/xtables-addons.spec Building target platforms: i686-pld-linux checking BuildConflict-ing packages no BuildConflicts found checking BR rpm: Building target platforms: i686-pld-linux no BR needed building RPM using: set -ex; : build-id: 23a369a5-06b4-40c4-80a5-2ac7e83c23f9; TMPDIR=/tmp/B.9aa05Z/BUILD/tmp exec nice -n 0 rpmbuild -bb --define '_smp_mflags -j9' --define '_make_opts -Otarget' --define '_pld_builder 1' --define '_topdir /tmp/B.9aa05Z' --define '_specdir %{_topdir}' --define '_sourcedir %{_specdir}' --define '_rpmdir %{_topdir}/RPMS' --define '_builddir %{_topdir}/BUILD' --without userspace --target i686-pld-linux --define 'build_kernels head,4.9,4.4,4.1' /tmp/B.9aa05Z/xtables-addons.spec + : build-id: 23a369a5-06b4-40c4-80a5-2ac7e83c23f9 + TMPDIR=/tmp/B.9aa05Z/BUILD/tmp + exec nice -n 0 rpmbuild -bb --define '_smp_mflags -j9' --define '_make_opts -Otarget' --define '_pld_builder 1' --define '_topdir /tmp/B.9aa05Z' --define '_specdir %{_topdir}' --define '_sourcedir %{_specdir}' --define '_rpmdir %{_topdir}/RPMS' --define '_builddir %{_topdir}/BUILD' --without userspace --target i686-pld-linux --define 'build_kernels head,4.9,4.4,4.1' /tmp/B.9aa05Z/xtables-addons.spec Building target platforms: i686-pld-linux Executing(%prep): /bin/sh -e /tmp/B.9aa05Z/BUILD/tmp/rpm-tmp.44580 + umask 022 + cd /tmp/B.9aa05Z/BUILD + cd /tmp/B.9aa05Z/BUILD + rm -rf xtables-addons-2.12 + /usr/bin/xz -dc /tmp/B.9aa05Z/xtables-addons-2.12.tar.xz + /bin/tar -xf - + STATUS=0 + '[' 0 -ne 0 ']' + cd xtables-addons-2.12 + /bin/id -u + '[' 1001 '=' 0 ']' + /bin/id -u + '[' 1001 '=' 0 ']' + /bin/chmod -Rf a+rX,u+w,g-w,o-w . + exit 0 Executing(%build): /bin/sh -e /tmp/B.9aa05Z/BUILD/tmp/rpm-tmp.44580 TMP=/home/users/builder/tmp HOME=/home/users/builder PATH=/home/users/builder/GNUstep/Tools:/usr/local/bin:/usr/bin:/bin:/home/users/builder/bin TMPDIR=/tmp/B.9aa05Z/BUILD/tmp + umask 022 + cd /tmp/B.9aa05Z/BUILD + cd xtables-addons-2.12 + ./configure 'LDFLAGS=-Wl,--as-needed -Wl,--no-copy-dt-needed-entries -Wl,-z,relro -Wl,-z,combreloc ' 'CFLAGS=-O2 -fwrapv -pipe -Wformat -Werror=format-security -Wp,-D_FORTIFY_SOURCE=2 -fstack-protector-strong --param=ssp-buffer-size=4 -fomit-frame-pointer -march=i686 -fasynchronous-unwind-tables -mtune=pentium4 ' 'CXXFLAGS=-O2 -fwrapv -pipe -Wformat -Werror=format-security -Wp,-D_FORTIFY_SOURCE=2 -fstack-protector-strong --param=ssp-buffer-size=4 -fomit-frame-pointer -march=i686 -fasynchronous-unwind-tables -mtune=pentium4 ' 'FFLAGS=-O2 -fwrapv -pipe -Wformat -Werror=format-security -Wp,-D_FORTIFY_SOURCE=2 -fstack-protector-strong --param=ssp-buffer-size=4 -fomit-frame-pointer -march=i686 -fasynchronous-unwind-tables -mtune=pentium4 ' 'FCFLAGS=-O2 -fwrapv -pipe -Wformat -Werror=format-security -Wp,-D_FORTIFY_SOURCE=2 -fstack-protector-strong --param=ssp-buffer-size=4 -fomit-frame-pointer -march=i686 -fasynchronous-unwind-tables -mtune=pentium4 ' 'CPPFLAGS=' 'CC=i686-pld-linux-gcc' 'CXX=i686-pld-linux-g++' '--host=i686-pld-linux' '--build=i686-pld-linux' '--prefix=/usr' '--exec-prefix=/usr' '--bindir=/usr/bin' '--sbindir=/usr/sbin' '--sysconfdir=/etc' '--datadir=/usr/share' '--includedir=/usr/include' '--libdir=/usr/lib' '--libexecdir=/usr/lib' '--localstatedir=/var' '--sharedstatedir=/var/lib' '--mandir=/usr/share/man' '--infodir=/usr/share/info' '--x-libraries=/usr/lib' --without-kbuild checking for a BSD-compatible install... /usr/bin/install -c checking whether build environment is sane... yes checking for a thread-safe mkdir -p... /bin/mkdir -p checking for gawk... gawk checking whether make sets $(MAKE)... yes checking whether make supports nested variables... yes checking whether make supports nested variables... (cached) yes checking for i686-pld-linux-gcc... i686-pld-linux-gcc checking whether the C compiler works... yes checking for C compiler default output file name... a.out checking for suffix of executables... checking whether we are cross compiling... no checking for suffix of object files... o checking whether we are using the GNU C compiler... yes checking whether i686-pld-linux-gcc accepts -g... yes checking for i686-pld-linux-gcc option to accept ISO C89... none needed checking for style of include used by make... GNU checking dependency style of i686-pld-linux-gcc... gcc3 checking whether i686-pld-linux-gcc and cc understand -c and -o together... yes checking for i686-pld-linux-ar... no checking for i686-pld-linux-lib... no checking for i686-pld-linux-link... no checking for ar... ar checking the archiver (ar) interface... ar checking build system type... i686-pld-linux-gnu checking host system type... i686-pld-linux-gnu checking how to print strings... print -r checking for a sed that does not truncate output... /bin/sed checking for grep that handles long lines and -e... /bin/grep checking for egrep... /bin/grep -E checking for fgrep... /bin/grep -F checking for ld used by i686-pld-linux-gcc... /usr/bin/ld checking if the linker (/usr/bin/ld) is GNU ld... yes checking for BSD- or MS-compatible name lister (nm)... /usr/bin/nm -B checking the name lister (/usr/bin/nm -B) interface... BSD nm checking whether ln -s works... yes checking the maximum length of command line arguments... 1572864 checking whether the shell understands some XSI constructs... yes checking whether the shell understands "+="... yes checking how to convert i686-pld-linux-gnu file names to i686-pld-linux-gnu format... func_convert_file_noop checking how to convert i686-pld-linux-gnu file names to toolchain format... func_convert_file_noop checking for /usr/bin/ld option to reload object files... -r checking for i686-pld-linux-objdump... no checking for objdump... objdump checking how to recognize dependent libraries... pass_all checking for i686-pld-linux-dlltool... no checking for dlltool... no checking how to associate runtime and link libraries... print -r -- checking for i686-pld-linux-ar... ar checking for archiver @FILE support... @ checking for i686-pld-linux-strip... no checking for strip... strip checking for i686-pld-linux-ranlib... no checking for ranlib... ranlib checking command to parse /usr/bin/nm -B output from i686-pld-linux-gcc object... ok checking for sysroot... no checking for i686-pld-linux-mt... no checking for mt... no checking if : is a manifest tool... no checking how to run the C preprocessor... i686-pld-linux-gcc -E checking for ANSI C header files... yes checking for sys/types.h... yes checking for sys/stat.h... yes checking for stdlib.h... yes checking for string.h... yes checking for memory.h... yes checking for strings.h... yes checking for inttypes.h... yes checking for stdint.h... yes checking for unistd.h... yes checking for dlfcn.h... yes checking for objdir... .libs checking if i686-pld-linux-gcc supports -fno-rtti -fno-exceptions... no checking for i686-pld-linux-gcc option to produce PIC... -fPIC -DPIC checking if i686-pld-linux-gcc PIC flag -fPIC -DPIC works... yes checking if i686-pld-linux-gcc static flag -static works... yes checking if i686-pld-linux-gcc supports -c -o file.o... yes checking if i686-pld-linux-gcc supports -c -o file.o... (cached) yes checking whether the i686-pld-linux-gcc linker (/usr/bin/ld) supports shared libraries... yes checking whether -lc should be explicitly linked in... no checking dynamic linker characteristics... GNU/Linux ld.so checking how to hardcode library paths into programs... immediate checking whether stripping libraries is possible... yes checking if libtool supports shared libraries... yes checking whether to build shared libraries... yes checking whether to build static libraries... no checking linux/netfilter/x_tables.h usability... yes checking linux/netfilter/x_tables.h presence... yes checking for linux/netfilter/x_tables.h... yes checking for i686-pld-linux-pkg-config... no checking for pkg-config... /usr/bin/pkg-config checking pkg-config is at least version 0.9.0... yes checking for libxtables... yes checking Xtables module directory... /usr/lib/xtables checking that generated files are newer than configure... done configure: creating ./config.status config.status: creating Makefile config.status: creating Makefile.iptrules config.status: creating Makefile.mans config.status: creating geoip/Makefile config.status: creating extensions/Makefile config.status: creating extensions/ACCOUNT/Makefile config.status: creating extensions/pknock/Makefile config.status: creating config.h config.status: executing depfiles commands config.status: executing libtool commands + srcdir=/tmp/B.9aa05Z/BUILD/xtables-addons-2.12 + cd extensions + compile 'XA_ABSTOPSRCDIR=/tmp/B.9aa05Z/BUILD/xtables-addons-2.12' + typeset 'L=<' PATCH_SH + set -e -x + '[' -r /usr/src/linux/.config ']' + rm -rf o + install -d o/include/linux o/include/generated o/arch/x86/include o/arch/powerpc/lib + ln -sf /usr/src/linux/.config o/.config + ln -sf /usr/src/linux/Module.symvers o/Module.symvers + '[' -f /usr/src/linux/include/generated/autoconf.h ']' + ln -sf /usr/src/linux/include/generated/autoconf.h o/include/generated/autoconf.h + ln -s ../generated/autoconf.h o/include/linux/autoconf.h + '[' -d /usr/src/linux/arch/x86/include/generated ']' + ln -s /usr/src/linux/arch/x86/include/generated o/arch/x86/include + set +x + install -d o/include/config + touch o/include/config/MARKER + ln -sf /usr/src/linux/include/config/auto.conf o/include/config/auto.conf + ln -sf /usr/src/linux/scripts o/scripts + /usr/bin/make -Otarget -j9 -C /usr/src/linux clean 'RCS_FIND_IGNORE=-name '\''*.[ks]o'\'' -o' 'XA_ABSTOPSRCDIR=/tmp/B.9aa05Z/BUILD/xtables-addons-2.12' 'M=/tmp/B.9aa05Z/BUILD/xtables-addons-2.12/extensions' 'HOSTCC=i686-pld-linux-gcc' 'SYSSRC=/usr/src/linux' 'SYSOUT=/tmp/B.9aa05Z/BUILD/xtables-addons-2.12/extensions/o' 'CC=i686-pld-linux-gcc' + /usr/bin/make -Otarget -j9 -C /usr/src/linux modules 'XA_ABSTOPSRCDIR=/tmp/B.9aa05Z/BUILD/xtables-addons-2.12' 'M=/tmp/B.9aa05Z/BUILD/xtables-addons-2.12/extensions' 'CONSTIFY_PLUGIN=' 'HOSTCC=i686-pld-linux-gcc' 'SYSSRC=/usr/src/linux' 'SYSOUT=/tmp/B.9aa05Z/BUILD/xtables-addons-2.12/extensions/o' 'CC=i686-pld-linux-gcc' CC [M] /tmp/B.9aa05Z/BUILD/xtables-addons-2.12/extensions/xt_LOGMARK.o /tmp/B.9aa05Z/BUILD/xtables-addons-2.12/extensions/xt_LOGMARK.c: In function 'logmark_tg': /tmp/B.9aa05Z/BUILD/xtables-addons-2.12/extensions/xt_LOGMARK.c:90:11: error: implicit declaration of function 'nf_ct_is_untracked' [-Werror=implicit-function-declaration] else if (nf_ct_is_untracked(ct)) ^~~~~~~~~~~~~~~~~~ cc1: some warnings being treated as errors make[1]: *** [scripts/Makefile.build:308: /tmp/B.9aa05Z/BUILD/xtables-addons-2.12/extensions/xt_LOGMARK.o] Error 1 make[1]: *** Waiting for unfinished jobs.... CC [M] /tmp/B.9aa05Z/BUILD/xtables-addons-2.12/extensions/xt_DELUDE.o CC [M] /tmp/B.9aa05Z/BUILD/xtables-addons-2.12/extensions/xt_CHAOS.o CC [M] /tmp/B.9aa05Z/BUILD/xtables-addons-2.12/extensions/xt_ECHO.o CC [M] /tmp/B.9aa05Z/BUILD/xtables-addons-2.12/extensions/compat_xtables.o CC [M] /tmp/B.9aa05Z/BUILD/xtables-addons-2.12/extensions/xt_DHCPMAC.o CC [M] /tmp/B.9aa05Z/BUILD/xtables-addons-2.12/extensions/xt_SYSRQ.o CC [M] /tmp/B.9aa05Z/BUILD/xtables-addons-2.12/extensions/xt_DNETMAP.o CC [M] /tmp/B.9aa05Z/BUILD/xtables-addons-2.12/extensions/xt_IPMARK.o make: *** [Makefile:1515: _module_/tmp/B.9aa05Z/BUILD/xtables-addons-2.12/extensions] Error 2 error: Bad exit status from /tmp/B.9aa05Z/BUILD/tmp/rpm-tmp.44580 (%build) RPM build errors: Bad exit status from /tmp/B.9aa05Z/BUILD/tmp/rpm-tmp.44580 (%build) ended at: Mon Jul 31 19:57:16 2017, done in 0:00:07.665724 error: No files produced. + chmod -R u+rwX /tmp/B.9aa05Z/BUILD + rm -rf /tmp/B.9aa05Z/tmp /tmp/B.9aa05Z/BUILD + rm -rf /tmp/B.9aa05Z Begin-PLD-Builder-Info Build-Time: user:12.27s sys:1.74s real:17.27s (faults io:0 non-io:774871) End-PLD-Builder-Info
[Back to list of logs] [View rpm -qa of builder]