FailedOk

th/SRPMS[OK]
th/x32[OK]
th/i686[OK]
th/x86_64[OK]

ac/SRPMS[OK]
ac/i386[OK]
ac/i586[OK]
ac/i686[OK]
ac/alpha[OK]
ac/amd64[OK]
ac/athlon[OK]
ac/ppc[OK]
ac/sparc[OK]
ac/sparc64[OK]

Advanced Search
main()
Powered by PLD Linux
(c) 2002-2021 PLD Team
$Revision: 1.37 $
Powered by Ken.
Your IP: 3.239.192.241

xtables-addons 240c887b-afe8-4b74-9875-09228fe22d44

Status:Failed
Source URL:https://buildlogs.pld-linux.org/pld/th/i686/FAIL/xtables-addons,240c887b-afe8-4b74-9875-09228fe22d44.bz2
text/plain URL:View!
full text:View!
rpm -qa of builder:View!
Date:2021/02/23 01:40:12
Runtime:0:00:06.867566

Toc:

  • error 1
  • /tmp/B.r1cUsm/BUILD/xtables-addons-3.13/extensions/xt_ECHO.c:100:55: error: passing argument 2 of 'security_skb_classify_flow' from incompatible pointer type [-Werror=incompatible-pointer-types]
  • error 2
  • make[1]: *** [scripts/Makefile.build:279: /tmp/B.r1cUsm/BUILD/xtables-addons-3.13/extensions/xt_ECHO.o] Error 1
  • error 3
  • /tmp/B.r1cUsm/BUILD/xtables-addons-3.13/extensions/pknock/xt_pknock.c:251:20: error: implicit declaration of function 'get_seconds' [-Werror=implicit-function-declaration]
  • error 4
  • make[2]: *** [scripts/Makefile.build:279: /tmp/B.r1cUsm/BUILD/xtables-addons-3.13/extensions/pknock/xt_pknock.o] Error 1
  • error 5
  • make[1]: *** [scripts/Makefile.build:496: /tmp/B.r1cUsm/BUILD/xtables-addons-3.13/extensions/pknock] Error 2
  • error 6
  • error: Bad exit status from /tmp/B.r1cUsm/BUILD/tmp/rpm-tmp.47GxKb (%build)
  • error 7
  • RPM build errors:
  • error 8
  • error: No files produced.

Content:

checking the name lister (/usr/bin/nm -B) interface... BSD nm
checking whether ln -s works... yes
checking the maximum length of command line arguments... 1572864
checking how to convert i686-pld-linux-gnu file names to i686-pld-linux-gnu format... func_convert_file_noop
checking how to convert i686-pld-linux-gnu file names to toolchain format... func_convert_file_noop
checking for /usr/bin/ld option to reload object files... -r
checking for i686-pld-linux-gnu-objdump... no
checking for objdump... objdump
checking how to recognize dependent libraries... pass_all
checking for i686-pld-linux-gnu-dlltool... no
checking for dlltool... no
checking how to associate runtime and link libraries... print -r --
checking for i686-pld-linux-gnu-ar... ar
checking for archiver @FILE support... @
checking for i686-pld-linux-gnu-strip... no
checking for strip... strip
checking for i686-pld-linux-gnu-ranlib... no
checking for ranlib... ranlib
checking command to parse /usr/bin/nm -B output from i686-pld-linux-gcc object... ok
checking for sysroot... no
checking for a working dd... /bin/dd
checking how to truncate binary pipes... /bin/dd bs=4096 count=1
checking for i686-pld-linux-gnu-mt... no
checking for mt... no
checking if : is a manifest tool... no
checking how to run the C preprocessor... i686-pld-linux-gcc -E
checking for ANSI C header files... yes
checking for sys/types.h... yes
checking for sys/stat.h... yes
checking for stdlib.h... yes
checking for string.h... yes
checking for memory.h... yes
checking for strings.h... yes
checking for inttypes.h... yes
checking for stdint.h... yes
checking for unistd.h... yes
checking for dlfcn.h... yes
checking for objdir... .libs
checking if i686-pld-linux-gcc supports -fno-rtti -fno-exceptions... no
checking for i686-pld-linux-gcc option to produce PIC... -fPIC -DPIC
checking if i686-pld-linux-gcc PIC flag -fPIC -DPIC works... yes
checking if i686-pld-linux-gcc static flag -static works... yes
checking if i686-pld-linux-gcc supports -c -o file.o... yes
checking if i686-pld-linux-gcc supports -c -o file.o... (cached) yes
checking whether the i686-pld-linux-gcc linker (/usr/bin/ld) supports shared libraries... yes
checking whether -lc should be explicitly linked in... no
checking dynamic linker characteristics... GNU/Linux ld.so
checking how to hardcode library paths into programs... immediate
checking whether stripping libraries is possible... yes
checking if libtool supports shared libraries... yes
checking whether to build shared libraries... yes
checking whether to build static libraries... no
checking linux/netfilter/x_tables.h usability... yes
checking linux/netfilter/x_tables.h presence... yes
checking for linux/netfilter/x_tables.h... yes
checking for i686-pld-linux-gnu-pkg-config... /usr/bin/i686-pld-linux-gnu-pkg-config
checking pkg-config is at least version 0.9.0... yes
checking for libxtables... yes
checking Xtables module directory... /usr/lib/xtables
checking that generated files are newer than configure... done
configure: creating ./config.status
config.status: creating Makefile
config.status: creating Makefile.iptrules
config.status: creating Makefile.mans
config.status: creating geoip/Makefile
config.status: creating extensions/Makefile
config.status: creating extensions/ACCOUNT/Makefile
config.status: creating extensions/pknock/Makefile
config.status: creating config.h
config.status: executing depfiles commands
config.status: executing libtool commands
+ srcdir=/tmp/B.r1cUsm/BUILD/xtables-addons-3.13 
+ cd extensions
+ compile 'XA_ABSTOPSRCDIR=/tmp/B.r1cUsm/BUILD/xtables-addons-3.13'
+ typeset 'L=<' PATCH_SH
+ set -e -x
+ '[' -r /usr/src/linux/.config ']'
+ rm -rf o
+ install -d o/include/linux o/include/generated o/arch/x86/include o/arch/powerpc/lib
+ ln -sf /usr/src/linux/.config o/.config
+ ln -sf /usr/src/linux/Module.symvers o/Module.symvers
+ '[' -f /usr/src/linux/include/generated/autoconf.h ']'
+ ln -sf /usr/src/linux/include/generated/autoconf.h o/include/generated/autoconf.h
+ ln -s ../generated/autoconf.h o/include/linux/autoconf.h
+ '[' -d /usr/src/linux/arch/x86/include/generated ']'
+ ln -s /usr/src/linux/arch/x86/include/generated o/arch/x86/include
+ set +x
+ install -d o/include/config
+ touch o/include/config/MARKER
+ ln -sf /usr/src/linux/include/config/auto.conf o/include/config/auto.conf
+ ln -sf /usr/src/linux/scripts o/scripts
+ /usr/bin/make -Otarget -j9 -C /usr/src/linux clean 'RCS_FIND_IGNORE=-name '\''*.[ks]o'\'' -o' 'XA_ABSTOPSRCDIR=/tmp/B.r1cUsm/BUILD/xtables-addons-3.13' 'M=/tmp/B.r1cUsm/BUILD/xtables-addons-3.13/extensions' 'HOSTCC=i686-pld-linux-gcc' 'SYSSRC=/usr/src/linux' 'SYSOUT=/tmp/B.r1cUsm/BUILD/xtables-addons-3.13/extensions/o' 'ARCH=i386'
+ CC=i686-pld-linux-gcc 
+ /usr/bin/make -Otarget -j9 -C /usr/src/linux modules 'XA_ABSTOPSRCDIR=/tmp/B.r1cUsm/BUILD/xtables-addons-3.13' 'M=/tmp/B.r1cUsm/BUILD/xtables-addons-3.13/extensions' 'CONSTIFY_PLUGIN=' 'HOSTCC=i686-pld-linux-gcc' 'SYSSRC=/usr/src/linux' 'SYSOUT=/tmp/B.r1cUsm/BUILD/xtables-addons-3.13/extensions/o' 'ARCH=i386'
  CC [M]  /tmp/B.r1cUsm/BUILD/xtables-addons-3.13/extensions/xt_IPMARK.o
  CC [M]  /tmp/B.r1cUsm/BUILD/xtables-addons-3.13/extensions/xt_CHAOS.o
  CC [M]  /tmp/B.r1cUsm/BUILD/xtables-addons-3.13/extensions/xt_DHCPMAC.o
  CC [M]  /tmp/B.r1cUsm/BUILD/xtables-addons-3.13/extensions/xt_ECHO.o
/tmp/B.r1cUsm/BUILD/xtables-addons-3.13/extensions/xt_ECHO.c: In function 'echo_tg6':
/tmp/B.r1cUsm/BUILD/xtables-addons-3.13/extensions/xt_ECHO.c:100:55: error: passing argument 2 of 'security_skb_classify_flow' from incompatible pointer type [-Werror=incompatible-pointer-types]
  100 |  security_skb_classify_flow((struct sk_buff *)oldskb, flowi6_to_flowi(&fl));
      |                                                       ^~~~~~~~~~~~~~~~~~~~
      |                                                       |
      |                                                       struct flowi *
In file included from ./include/net/scm.h:8,
                 from ./include/linux/netlink.h:9,
                 from ./include/uapi/linux/neighbour.h:6,
                 from ./include/linux/netdevice.h:45,
                 from ./include/net/inet_sock.h:19,
                 from ./include/linux/udp.h:16,
                 from /tmp/B.r1cUsm/BUILD/xtables-addons-3.13/extensions/xt_ECHO.c:15:
./include/linux/security.h:1647:75: note: expected 'struct flowi_common *' but argument is of type 'struct flowi *'
 1647 | void security_skb_classify_flow(struct sk_buff *skb, struct flowi_common *flic);
      |                                                      ~~~~~~~~~~~~~~~~~~~~~^~~~
cc1: some warnings being treated as errors
make[1]: *** [scripts/Makefile.build:279: /tmp/B.r1cUsm/BUILD/xtables-addons-3.13/extensions/xt_ECHO.o] Error 1
make[1]: *** Waiting for unfinished jobs....
  CC [M]  /tmp/B.r1cUsm/BUILD/xtables-addons-3.13/extensions/pknock/xt_pknock.o
In file included from ./include/linux/kernel.h:15,
                 from ./include/linux/list.h:9,
                 from ./include/linux/module.h:12,
                 from /tmp/B.r1cUsm/BUILD/xtables-addons-3.13/extensions/pknock/xt_pknock.c:10:
/tmp/B.r1cUsm/BUILD/xtables-addons-3.13/extensions/pknock/xt_pknock.c: In function 'pknock_seq_show':
/tmp/B.r1cUsm/BUILD/xtables-addons-3.13/extensions/pknock/xt_pknock.c:251:20: error: implicit declaration of function 'get_seconds' [-Werror=implicit-function-declaration]
  251 |    if (time_before(get_seconds(), peer->login_sec +
      |                    ^~~~~~~~~~~
./include/linux/typecheck.h:11:9: note: in definition of macro 'typecheck'
   11 |  typeof(x) __dummy2; \
      |         ^
./include/linux/jiffies.h:108:26: note: in expansion of macro 'time_after'
  108 | #define time_before(a,b) time_after(b,a)
      |                          ^~~~~~~~~~
/tmp/B.r1cUsm/BUILD/xtables-addons-3.13/extensions/pknock/xt_pknock.c:251:8: note: in expansion of macro 'time_before'
  251 |    if (time_before(get_seconds(), peer->login_sec +
      |        ^~~~~~~~~~~
./include/linux/typecheck.h:12:18: warning: comparison of distinct pointer types lacks a cast
   12 |  (void)(&__dummy == &__dummy2); \
      |                  ^~
./include/linux/jiffies.h:106:3: note: in expansion of macro 'typecheck'
  106 |   typecheck(unsigned long, b) && \
      |   ^~~~~~~~~
./include/linux/jiffies.h:108:26: note: in expansion of macro 'time_after'
  108 | #define time_before(a,b) time_after(b,a)
      |                          ^~~~~~~~~~
/tmp/B.r1cUsm/BUILD/xtables-addons-3.13/extensions/pknock/xt_pknock.c:251:8: note: in expansion of macro 'time_before'
  251 |    if (time_before(get_seconds(), peer->login_sec +
      |        ^~~~~~~~~~~
/tmp/B.r1cUsm/BUILD/xtables-addons-3.13/extensions/pknock/xt_pknock.c: In function 'autoclose_time_passed':
./include/linux/typecheck.h:12:18: warning: comparison of distinct pointer types lacks a cast
   12 |  (void)(&__dummy == &__dummy2); \
      |                  ^~
./include/linux/jiffies.h:105:3: note: in expansion of macro 'typecheck'
  105 |  (typecheck(unsigned long, a) && \
      |   ^~~~~~~~~
/tmp/B.r1cUsm/BUILD/xtables-addons-3.13/extensions/pknock/xt_pknock.c:315:48: note: in expansion of macro 'time_after'
  315 |  return peer != NULL && autoclose_time != 0 && time_after(get_seconds(),
      |                                                ^~~~~~~~~~
cc1: some warnings being treated as errors
make[2]: *** [scripts/Makefile.build:279: /tmp/B.r1cUsm/BUILD/xtables-addons-3.13/extensions/pknock/xt_pknock.o] Error 1
make[1]: *** [scripts/Makefile.build:496: /tmp/B.r1cUsm/BUILD/xtables-addons-3.13/extensions/pknock] Error 2
  CC [M]  /tmp/B.r1cUsm/BUILD/xtables-addons-3.13/extensions/xt_DELUDE.o
  CC [M]  /tmp/B.r1cUsm/BUILD/xtables-addons-3.13/extensions/xt_DNETMAP.o
  CC [M]  /tmp/B.r1cUsm/BUILD/xtables-addons-3.13/extensions/ACCOUNT/xt_ACCOUNT.o
  CC [M]  /tmp/B.r1cUsm/BUILD/xtables-addons-3.13/extensions/compat_xtables.o
  CC [M]  /tmp/B.r1cUsm/BUILD/xtables-addons-3.13/extensions/xt_LOGMARK.o
  CC [M]  /tmp/B.r1cUsm/BUILD/xtables-addons-3.13/extensions/xt_PROTO.o
  CC [M]  /tmp/B.r1cUsm/BUILD/xtables-addons-3.13/extensions/xt_SYSRQ.o
make: *** [Makefile:1800: /tmp/B.r1cUsm/BUILD/xtables-addons-3.13/extensions] Error 2
error: Bad exit status from /tmp/B.r1cUsm/BUILD/tmp/rpm-tmp.47GxKb (%build)


RPM build errors:
    line 46: It's not recommended to have unversioned Obsoletes: Obsoletes:	iptables-ipp2p
    Could not canonicalize hostname: nereid
    Bad exit status from /tmp/B.r1cUsm/BUILD/tmp/rpm-tmp.47GxKb (%build)
ended at: Tue Feb 23 01:40:12 2021, done in 0:00:06.867566
error: No files produced.
+ chmod -R u+rwX /tmp/B.r1cUsm/BUILD
+ rm -rf /tmp/B.r1cUsm/tmp /tmp/B.r1cUsm/BUILD
+ rm -rf /tmp/B.r1cUsm
Begin-PLD-Builder-Info
Build-Time: user:18.01s sys:4.27s real:10.97s (faults io:49 non-io:967407)

End-PLD-Builder-Info
[Back to list of logs] [View rpm -qa of builder]