FailedOk

th/SRPMS[OK]
th/x32[OK]
th/i686[OK]
th/x86_64[OK]

ac/SRPMS[OK]
ac/i386[OK]
ac/i586[OK]
ac/i686[OK]
ac/alpha[OK]
ac/amd64[OK]
ac/athlon[OK]
ac/ppc[OK]
ac/sparc[OK]
ac/sparc64[OK]

Advanced Search
main()
Powered by PLD Linux
(c) 2002-2018 PLD Team
$Revision: 1.37 $
Powered by Joe.
Your IP: 54.224.91.58

ykpers 385fe3d4-6f33-45e7-8b4b-a3a6005d08b6

Status:Failed
Source URL:ftp://buildlogs.pld-linux.org/th/i686/FAIL/ykpers,385fe3d4-6f33-45e7-8b4b-a3a6005d08b6.bz2
text/plain URL:View!
full text:View!
rpm -qa of builder:View!
Date:2018/05/10 17:33:42
Runtime:0:00:06.413227

Toc:

  • error 1
  • FAIL: test_json
  • error 2
  • FAIL: test_threaded_calls
  • error 3
  • # XFAIL: 0
  • error 4
  • # FAIL: 2
  • error 5
  • # ERROR: 0
  • error 6
  • make[3]: *** [Makefile:796: test-suite.log] Error 1
  • error 7
  • make[2]: *** [Makefile:904: check-TESTS] Error 2
  • error 8
  • make[1]: *** [Makefile:1024: check-am] Error 2
  • error 9
  • error: Bad exit status from /tmp/B.uannEb/BUILD/tmp/rpm-tmp.53822 (%build)
  • error 10
  • RPM build errors:
  • error 11
  • error: No files produced.

Content:

/bin/sh ./libtool  --tag=CC   --mode=link i686-pld-linux-gcc  -I/usr/include/json-c  -O2 -fwrapv -pipe -Wformat -Werror=format-security -gdwarf-4 -fno-debug-types-section -fvar-tracking-assignments -g2 -Wp,-D_FORTIFY_SOURCE=2 -fstack-protector-strong --param=ssp-buffer-size=4 -fomit-frame-pointer -march=i686 -fasynchronous-unwind-tables -mtune=pentium4 -gdwarf-4 -fno-debug-types-section -fvar-tracking-assignments -g2  -pthread  -Wl,--as-needed -Wl,--no-copy-dt-needed-entries -Wl,-z,relro -Wl,-z,combreloc  -o ykinfo ykinfo.o ./libykpers-1.la -L/usr/lib -lyubikey 
libtool: link: i686-pld-linux-gcc -I/usr/include/json-c -O2 -fwrapv -pipe -Wformat -Werror=format-security -gdwarf-4 -fno-debug-types-section -fvar-tracking-assignments -g2 -Wp,-D_FORTIFY_SOURCE=2 -fstack-protector-strong --param=ssp-buffer-size=4 -fomit-frame-pointer -march=i686 -fasynchronous-unwind-tables -mtune=pentium4 -gdwarf-4 -fno-debug-types-section -fvar-tracking-assignments -g2 -pthread -Wl,--as-needed -Wl,--no-copy-dt-needed-entries -Wl,-z -Wl,relro -Wl,-z -Wl,combreloc -o .libs/ykinfo ykinfo.o  ./.libs/libykpers-1.so -L/usr/lib /usr/lib/libyubikey.so -pthread
make[1]: Leaving directory '/tmp/B.uannEb/BUILD/ykpers-1.18.0'
make[1]: Entering directory '/tmp/B.uannEb/BUILD/ykpers-1.18.0'
/bin/sh ./libtool  --tag=CC   --mode=link i686-pld-linux-gcc  -I/usr/include/json-c  -O2 -fwrapv -pipe -Wformat -Werror=format-security -gdwarf-4 -fno-debug-types-section -fvar-tracking-assignments -g2 -Wp,-D_FORTIFY_SOURCE=2 -fstack-protector-strong --param=ssp-buffer-size=4 -fomit-frame-pointer -march=i686 -fasynchronous-unwind-tables -mtune=pentium4 -gdwarf-4 -fno-debug-types-section -fvar-tracking-assignments -g2  -pthread  -Wl,--as-needed -Wl,--no-copy-dt-needed-entries -Wl,-z,relro -Wl,-z,combreloc  -o ykchalresp ykchalresp.o ./libykpers-1.la -L/usr/lib -lyubikey 
libtool: link: i686-pld-linux-gcc -I/usr/include/json-c -O2 -fwrapv -pipe -Wformat -Werror=format-security -gdwarf-4 -fno-debug-types-section -fvar-tracking-assignments -g2 -Wp,-D_FORTIFY_SOURCE=2 -fstack-protector-strong --param=ssp-buffer-size=4 -fomit-frame-pointer -march=i686 -fasynchronous-unwind-tables -mtune=pentium4 -gdwarf-4 -fno-debug-types-section -fvar-tracking-assignments -g2 -pthread -Wl,--as-needed -Wl,--no-copy-dt-needed-entries -Wl,-z -Wl,relro -Wl,-z -Wl,combreloc -o .libs/ykchalresp ykchalresp.o  ./.libs/libykpers-1.so -L/usr/lib /usr/lib/libyubikey.so -pthread
make[1]: Leaving directory '/tmp/B.uannEb/BUILD/ykpers-1.18.0'
make[1]: Entering directory '/tmp/B.uannEb/BUILD/ykpers-1.18.0'
/bin/sh ./libtool  --tag=CC   --mode=link i686-pld-linux-gcc  -I/usr/include/json-c  -O2 -fwrapv -pipe -Wformat -Werror=format-security -gdwarf-4 -fno-debug-types-section -fvar-tracking-assignments -g2 -Wp,-D_FORTIFY_SOURCE=2 -fstack-protector-strong --param=ssp-buffer-size=4 -fomit-frame-pointer -march=i686 -fasynchronous-unwind-tables -mtune=pentium4 -gdwarf-4 -fno-debug-types-section -fvar-tracking-assignments -g2  -pthread  -Wl,--as-needed -Wl,--no-copy-dt-needed-entries -Wl,-z,relro -Wl,-z,combreloc  -o ykpersonalize ykpersonalize.o ./libykpers-1.la ./libykpers_args.la 
libtool: link: i686-pld-linux-gcc -I/usr/include/json-c -O2 -fwrapv -pipe -Wformat -Werror=format-security -gdwarf-4 -fno-debug-types-section -fvar-tracking-assignments -g2 -Wp,-D_FORTIFY_SOURCE=2 -fstack-protector-strong --param=ssp-buffer-size=4 -fomit-frame-pointer -march=i686 -fasynchronous-unwind-tables -mtune=pentium4 -gdwarf-4 -fno-debug-types-section -fvar-tracking-assignments -g2 -pthread -Wl,--as-needed -Wl,--no-copy-dt-needed-entries -Wl,-z -Wl,relro -Wl,-z -Wl,combreloc -o .libs/ykpersonalize ykpersonalize.o  ./.libs/libykpers-1.so ./.libs/libykpers_args.a /tmp/B.uannEb/BUILD/ykpers-1.18.0/.libs/libykpers-1.so -L/usr/lib /usr/lib/libusb.so /usr/lib/libusb-1.0.so -ludev -ljson-c /usr/lib/libyubikey.so -pthread
make[1]: Leaving directory '/tmp/B.uannEb/BUILD/ykpers-1.18.0'
Making all in tests
make[1]: Nothing to be done for 'all'.
+ export 'LD_LIBRARY_PATH=/tmp/B.uannEb/BUILD/ykpers-1.18.0/.libs'
+ /usr/bin/make -Otarget -j9 check
Making check in ykcore
make[1]: Nothing to be done for 'check'.
Making check in .
make[1]: Nothing to be done for 'check-am'.
Making check in tests
/usr/bin/make  selftest test_args_to_config test_key_generation test_ndef_construction test_threaded_calls test_ykpbkdf2 test_yk_utilities test_json
make[2]: Entering directory '/tmp/B.uannEb/BUILD/ykpers-1.18.0/tests'
i686-pld-linux-gcc -DPACKAGE_NAME=\"yubikey-personalization\" -DPACKAGE_TARNAME=\"ykpers\" -DPACKAGE_VERSION=\"1.18.0\" -DPACKAGE_STRING=\"yubikey-personalization\ 1.18.0\" -DPACKAGE_BUGREPORT=\"yubico-devel@googlegroups.com\" -DPACKAGE_URL=\"https://developers.yubico.com/yubikey-personalization/\" -DPACKAGE=\"ykpers\" -DVERSION=\"1.18.0\" -DHAVE_PTHREAD=1 -DSTDC_HEADERS=1 -DHAVE_SYS_TYPES_H=1 -DHAVE_SYS_STAT_H=1 -DHAVE_STDLIB_H=1 -DHAVE_STRING_H=1 -DHAVE_MEMORY_H=1 -DHAVE_STRINGS_H=1 -DHAVE_INTTYPES_H=1 -DHAVE_STDINT_H=1 -DHAVE_UNISTD_H=1 -DHAVE_DLFCN_H=1 -DLT_OBJDIR=\".libs/\" -DHAVE_LIBYUBIKEY=1 -DHAVE_LIBUSB=1 -DHAVE_JSON_OBJECT_TO_JSON_STRING_EXT=1 -DHAVE_JSON_OBJECT_OBJECT_GET_EX=1 -I.    -I./.. -I./../ykcore  -O2 -fwrapv -pipe -Wformat -Werror=format-security -gdwarf-4 -fno-debug-types-section -fvar-tracking-assignments -g2 -Wp,-D_FORTIFY_SOURCE=2 -fstack-protector-strong --param=ssp-buffer-size=4 -fomit-frame-pointer -march=i686 -fasynchronous-unwind-tables -mtune=pentium4 -gdwarf-4 -fno-debug-types-section -fvar-tracking-assignments -g2  -pthread -MT selftest.o -MD -MP -MF .deps/selftest.Tpo -c -o selftest.o selftest.c
mv -f .deps/selftest.Tpo .deps/selftest.Po
make[2]: Leaving directory '/tmp/B.uannEb/BUILD/ykpers-1.18.0/tests'
make[2]: Entering directory '/tmp/B.uannEb/BUILD/ykpers-1.18.0/tests'
i686-pld-linux-gcc -DPACKAGE_NAME=\"yubikey-personalization\" -DPACKAGE_TARNAME=\"ykpers\" -DPACKAGE_VERSION=\"1.18.0\" -DPACKAGE_STRING=\"yubikey-personalization\ 1.18.0\" -DPACKAGE_BUGREPORT=\"yubico-devel@googlegroups.com\" -DPACKAGE_URL=\"https://developers.yubico.com/yubikey-personalization/\" -DPACKAGE=\"ykpers\" -DVERSION=\"1.18.0\" -DHAVE_PTHREAD=1 -DSTDC_HEADERS=1 -DHAVE_SYS_TYPES_H=1 -DHAVE_SYS_STAT_H=1 -DHAVE_STDLIB_H=1 -DHAVE_STRING_H=1 -DHAVE_MEMORY_H=1 -DHAVE_STRINGS_H=1 -DHAVE_INTTYPES_H=1 -DHAVE_STDINT_H=1 -DHAVE_UNISTD_H=1 -DHAVE_DLFCN_H=1 -DLT_OBJDIR=\".libs/\" -DHAVE_LIBYUBIKEY=1 -DHAVE_LIBUSB=1 -DHAVE_JSON_OBJECT_TO_JSON_STRING_EXT=1 -DHAVE_JSON_OBJECT_OBJECT_GET_EX=1 -I.    -I./.. -I./../ykcore  -O2 -fwrapv -pipe -Wformat -Werror=format-security -gdwarf-4 -fno-debug-types-section -fvar-tracking-assignments -g2 -Wp,-D_FORTIFY_SOURCE=2 -fstack-protector-strong --param=ssp-buffer-size=4 -fomit-frame-pointer -march=i686 -fasynchronous-unwind-tables -mtune=pentium4 -gdwarf-4 -fno-debug-types-section -fvar-tracking-assignments -g2  -pthread -MT test_threaded_calls.o -MD -MP -MF .deps/test_threaded_calls.Tpo -c -o test_threaded_calls.o test_threaded_calls.c
mv -f .deps/test_threaded_calls.Tpo .deps/test_threaded_calls.Po
make[2]: Leaving directory '/tmp/B.uannEb/BUILD/ykpers-1.18.0/tests'
make[2]: Entering directory '/tmp/B.uannEb/BUILD/ykpers-1.18.0/tests'
i686-pld-linux-gcc -DPACKAGE_NAME=\"yubikey-personalization\" -DPACKAGE_TARNAME=\"ykpers\" -DPACKAGE_VERSION=\"1.18.0\" -DPACKAGE_STRING=\"yubikey-personalization\ 1.18.0\" -DPACKAGE_BUGREPORT=\"yubico-devel@googlegroups.com\" -DPACKAGE_URL=\"https://developers.yubico.com/yubikey-personalization/\" -DPACKAGE=\"ykpers\" -DVERSION=\"1.18.0\" -DHAVE_PTHREAD=1 -DSTDC_HEADERS=1 -DHAVE_SYS_TYPES_H=1 -DHAVE_SYS_STAT_H=1 -DHAVE_STDLIB_H=1 -DHAVE_STRING_H=1 -DHAVE_MEMORY_H=1 -DHAVE_STRINGS_H=1 -DHAVE_INTTYPES_H=1 -DHAVE_STDINT_H=1 -DHAVE_UNISTD_H=1 -DHAVE_DLFCN_H=1 -DLT_OBJDIR=\".libs/\" -DHAVE_LIBYUBIKEY=1 -DHAVE_LIBUSB=1 -DHAVE_JSON_OBJECT_TO_JSON_STRING_EXT=1 -DHAVE_JSON_OBJECT_OBJECT_GET_EX=1 -I.    -I./.. -I./../ykcore  -O2 -fwrapv -pipe -Wformat -Werror=format-security -gdwarf-4 -fno-debug-types-section -fvar-tracking-assignments -g2 -Wp,-D_FORTIFY_SOURCE=2 -fstack-protector-strong --param=ssp-buffer-size=4 -fomit-frame-pointer -march=i686 -fasynchronous-unwind-tables -mtune=pentium4 -gdwarf-4 -fno-debug-types-section -fvar-tracking-assignments -g2  -pthread -MT test_key_generation.o -MD -MP -MF .deps/test_key_generation.Tpo -c -o test_key_generation.o test_key_generation.c
mv -f .deps/test_key_generation.Tpo .deps/test_key_generation.Po
make[2]: Leaving directory '/tmp/B.uannEb/BUILD/ykpers-1.18.0/tests'
make[2]: Entering directory '/tmp/B.uannEb/BUILD/ykpers-1.18.0/tests'
i686-pld-linux-gcc -DPACKAGE_NAME=\"yubikey-personalization\" -DPACKAGE_TARNAME=\"ykpers\" -DPACKAGE_VERSION=\"1.18.0\" -DPACKAGE_STRING=\"yubikey-personalization\ 1.18.0\" -DPACKAGE_BUGREPORT=\"yubico-devel@googlegroups.com\" -DPACKAGE_URL=\"https://developers.yubico.com/yubikey-personalization/\" -DPACKAGE=\"ykpers\" -DVERSION=\"1.18.0\" -DHAVE_PTHREAD=1 -DSTDC_HEADERS=1 -DHAVE_SYS_TYPES_H=1 -DHAVE_SYS_STAT_H=1 -DHAVE_STDLIB_H=1 -DHAVE_STRING_H=1 -DHAVE_MEMORY_H=1 -DHAVE_STRINGS_H=1 -DHAVE_INTTYPES_H=1 -DHAVE_STDINT_H=1 -DHAVE_UNISTD_H=1 -DHAVE_DLFCN_H=1 -DLT_OBJDIR=\".libs/\" -DHAVE_LIBYUBIKEY=1 -DHAVE_LIBUSB=1 -DHAVE_JSON_OBJECT_TO_JSON_STRING_EXT=1 -DHAVE_JSON_OBJECT_OBJECT_GET_EX=1 -I.    -I./.. -I./../ykcore  -O2 -fwrapv -pipe -Wformat -Werror=format-security -gdwarf-4 -fno-debug-types-section -fvar-tracking-assignments -g2 -Wp,-D_FORTIFY_SOURCE=2 -fstack-protector-strong --param=ssp-buffer-size=4 -fomit-frame-pointer -march=i686 -fasynchronous-unwind-tables -mtune=pentium4 -gdwarf-4 -fno-debug-types-section -fvar-tracking-assignments -g2  -pthread -MT test_yk_utilities.o -MD -MP -MF .deps/test_yk_utilities.Tpo -c -o test_yk_utilities.o test_yk_utilities.c
mv -f .deps/test_yk_utilities.Tpo .deps/test_yk_utilities.Po
make[2]: Leaving directory '/tmp/B.uannEb/BUILD/ykpers-1.18.0/tests'
make[2]: Entering directory '/tmp/B.uannEb/BUILD/ykpers-1.18.0/tests'
i686-pld-linux-gcc -DPACKAGE_NAME=\"yubikey-personalization\" -DPACKAGE_TARNAME=\"ykpers\" -DPACKAGE_VERSION=\"1.18.0\" -DPACKAGE_STRING=\"yubikey-personalization\ 1.18.0\" -DPACKAGE_BUGREPORT=\"yubico-devel@googlegroups.com\" -DPACKAGE_URL=\"https://developers.yubico.com/yubikey-personalization/\" -DPACKAGE=\"ykpers\" -DVERSION=\"1.18.0\" -DHAVE_PTHREAD=1 -DSTDC_HEADERS=1 -DHAVE_SYS_TYPES_H=1 -DHAVE_SYS_STAT_H=1 -DHAVE_STDLIB_H=1 -DHAVE_STRING_H=1 -DHAVE_MEMORY_H=1 -DHAVE_STRINGS_H=1 -DHAVE_INTTYPES_H=1 -DHAVE_STDINT_H=1 -DHAVE_UNISTD_H=1 -DHAVE_DLFCN_H=1 -DLT_OBJDIR=\".libs/\" -DHAVE_LIBYUBIKEY=1 -DHAVE_LIBUSB=1 -DHAVE_JSON_OBJECT_TO_JSON_STRING_EXT=1 -DHAVE_JSON_OBJECT_OBJECT_GET_EX=1 -I.    -I./.. -I./../ykcore  -O2 -fwrapv -pipe -Wformat -Werror=format-security -gdwarf-4 -fno-debug-types-section -fvar-tracking-assignments -g2 -Wp,-D_FORTIFY_SOURCE=2 -fstack-protector-strong --param=ssp-buffer-size=4 -fomit-frame-pointer -march=i686 -fasynchronous-unwind-tables -mtune=pentium4 -gdwarf-4 -fno-debug-types-section -fvar-tracking-assignments -g2  -pthread -MT test_ykpbkdf2.o -MD -MP -MF .deps/test_ykpbkdf2.Tpo -c -o test_ykpbkdf2.o test_ykpbkdf2.c
mv -f .deps/test_ykpbkdf2.Tpo .deps/test_ykpbkdf2.Po
make[2]: Leaving directory '/tmp/B.uannEb/BUILD/ykpers-1.18.0/tests'
make[2]: Entering directory '/tmp/B.uannEb/BUILD/ykpers-1.18.0/tests'
i686-pld-linux-gcc -DPACKAGE_NAME=\"yubikey-personalization\" -DPACKAGE_TARNAME=\"ykpers\" -DPACKAGE_VERSION=\"1.18.0\" -DPACKAGE_STRING=\"yubikey-personalization\ 1.18.0\" -DPACKAGE_BUGREPORT=\"yubico-devel@googlegroups.com\" -DPACKAGE_URL=\"https://developers.yubico.com/yubikey-personalization/\" -DPACKAGE=\"ykpers\" -DVERSION=\"1.18.0\" -DHAVE_PTHREAD=1 -DSTDC_HEADERS=1 -DHAVE_SYS_TYPES_H=1 -DHAVE_SYS_STAT_H=1 -DHAVE_STDLIB_H=1 -DHAVE_STRING_H=1 -DHAVE_MEMORY_H=1 -DHAVE_STRINGS_H=1 -DHAVE_INTTYPES_H=1 -DHAVE_STDINT_H=1 -DHAVE_UNISTD_H=1 -DHAVE_DLFCN_H=1 -DLT_OBJDIR=\".libs/\" -DHAVE_LIBYUBIKEY=1 -DHAVE_LIBUSB=1 -DHAVE_JSON_OBJECT_TO_JSON_STRING_EXT=1 -DHAVE_JSON_OBJECT_OBJECT_GET_EX=1 -I.    -I./.. -I./../ykcore  -O2 -fwrapv -pipe -Wformat -Werror=format-security -gdwarf-4 -fno-debug-types-section -fvar-tracking-assignments -g2 -Wp,-D_FORTIFY_SOURCE=2 -fstack-protector-strong --param=ssp-buffer-size=4 -fomit-frame-pointer -march=i686 -fasynchronous-unwind-tables -mtune=pentium4 -gdwarf-4 -fno-debug-types-section -fvar-tracking-assignments -g2  -pthread -MT test_json.o -MD -MP -MF .deps/test_json.Tpo -c -o test_json.o test_json.c
mv -f .deps/test_json.Tpo .deps/test_json.Po
make[2]: Leaving directory '/tmp/B.uannEb/BUILD/ykpers-1.18.0/tests'
make[2]: Entering directory '/tmp/B.uannEb/BUILD/ykpers-1.18.0/tests'
i686-pld-linux-gcc -DPACKAGE_NAME=\"yubikey-personalization\" -DPACKAGE_TARNAME=\"ykpers\" -DPACKAGE_VERSION=\"1.18.0\" -DPACKAGE_STRING=\"yubikey-personalization\ 1.18.0\" -DPACKAGE_BUGREPORT=\"yubico-devel@googlegroups.com\" -DPACKAGE_URL=\"https://developers.yubico.com/yubikey-personalization/\" -DPACKAGE=\"ykpers\" -DVERSION=\"1.18.0\" -DHAVE_PTHREAD=1 -DSTDC_HEADERS=1 -DHAVE_SYS_TYPES_H=1 -DHAVE_SYS_STAT_H=1 -DHAVE_STDLIB_H=1 -DHAVE_STRING_H=1 -DHAVE_MEMORY_H=1 -DHAVE_STRINGS_H=1 -DHAVE_INTTYPES_H=1 -DHAVE_STDINT_H=1 -DHAVE_UNISTD_H=1 -DHAVE_DLFCN_H=1 -DLT_OBJDIR=\".libs/\" -DHAVE_LIBYUBIKEY=1 -DHAVE_LIBUSB=1 -DHAVE_JSON_OBJECT_TO_JSON_STRING_EXT=1 -DHAVE_JSON_OBJECT_OBJECT_GET_EX=1 -I.    -I./.. -I./../ykcore  -O2 -fwrapv -pipe -Wformat -Werror=format-security -gdwarf-4 -fno-debug-types-section -fvar-tracking-assignments -g2 -Wp,-D_FORTIFY_SOURCE=2 -fstack-protector-strong --param=ssp-buffer-size=4 -fomit-frame-pointer -march=i686 -fasynchronous-unwind-tables -mtune=pentium4 -gdwarf-4 -fno-debug-types-section -fvar-tracking-assignments -g2  -pthread -MT test_ndef_construction.o -MD -MP -MF .deps/test_ndef_construction.Tpo -c -o test_ndef_construction.o test_ndef_construction.c
mv -f .deps/test_ndef_construction.Tpo .deps/test_ndef_construction.Po
make[2]: Leaving directory '/tmp/B.uannEb/BUILD/ykpers-1.18.0/tests'
make[2]: Entering directory '/tmp/B.uannEb/BUILD/ykpers-1.18.0/tests'
i686-pld-linux-gcc -DPACKAGE_NAME=\"yubikey-personalization\" -DPACKAGE_TARNAME=\"ykpers\" -DPACKAGE_VERSION=\"1.18.0\" -DPACKAGE_STRING=\"yubikey-personalization\ 1.18.0\" -DPACKAGE_BUGREPORT=\"yubico-devel@googlegroups.com\" -DPACKAGE_URL=\"https://developers.yubico.com/yubikey-personalization/\" -DPACKAGE=\"ykpers\" -DVERSION=\"1.18.0\" -DHAVE_PTHREAD=1 -DSTDC_HEADERS=1 -DHAVE_SYS_TYPES_H=1 -DHAVE_SYS_STAT_H=1 -DHAVE_STDLIB_H=1 -DHAVE_STRING_H=1 -DHAVE_MEMORY_H=1 -DHAVE_STRINGS_H=1 -DHAVE_INTTYPES_H=1 -DHAVE_STDINT_H=1 -DHAVE_UNISTD_H=1 -DHAVE_DLFCN_H=1 -DLT_OBJDIR=\".libs/\" -DHAVE_LIBYUBIKEY=1 -DHAVE_LIBUSB=1 -DHAVE_JSON_OBJECT_TO_JSON_STRING_EXT=1 -DHAVE_JSON_OBJECT_OBJECT_GET_EX=1 -I.    -I./.. -I./../ykcore  -O2 -fwrapv -pipe -Wformat -Werror=format-security -gdwarf-4 -fno-debug-types-section -fvar-tracking-assignments -g2 -Wp,-D_FORTIFY_SOURCE=2 -fstack-protector-strong --param=ssp-buffer-size=4 -fomit-frame-pointer -march=i686 -fasynchronous-unwind-tables -mtune=pentium4 -gdwarf-4 -fno-debug-types-section -fvar-tracking-assignments -g2  -pthread -MT test_args_to_config.o -MD -MP -MF .deps/test_args_to_config.Tpo -c -o test_args_to_config.o test_args_to_config.c
mv -f .deps/test_args_to_config.Tpo .deps/test_args_to_config.Po
make[2]: Leaving directory '/tmp/B.uannEb/BUILD/ykpers-1.18.0/tests'
make[2]: Entering directory '/tmp/B.uannEb/BUILD/ykpers-1.18.0/tests'
/bin/sh ../libtool  --tag=CC   --mode=link i686-pld-linux-gcc -I./.. -I./../ykcore  -O2 -fwrapv -pipe -Wformat -Werror=format-security -gdwarf-4 -fno-debug-types-section -fvar-tracking-assignments -g2 -Wp,-D_FORTIFY_SOURCE=2 -fstack-protector-strong --param=ssp-buffer-size=4 -fomit-frame-pointer -march=i686 -fasynchronous-unwind-tables -mtune=pentium4 -gdwarf-4 -fno-debug-types-section -fvar-tracking-assignments -g2  -pthread -no-install  -Wl,--as-needed -Wl,--no-copy-dt-needed-entries -Wl,-z,relro -Wl,-z,combreloc  -o test_threaded_calls test_threaded_calls.o ../libykpers-1.la -L/usr/lib -lyubikey 
libtool: link: i686-pld-linux-gcc -I./.. -I./../ykcore -O2 -fwrapv -pipe -Wformat -Werror=format-security -gdwarf-4 -fno-debug-types-section -fvar-tracking-assignments -g2 -Wp,-D_FORTIFY_SOURCE=2 -fstack-protector-strong --param=ssp-buffer-size=4 -fomit-frame-pointer -march=i686 -fasynchronous-unwind-tables -mtune=pentium4 -gdwarf-4 -fno-debug-types-section -fvar-tracking-assignments -g2 -pthread -Wl,--as-needed -Wl,--no-copy-dt-needed-entries -Wl,-z -Wl,relro -Wl,-z -Wl,combreloc -o test_threaded_calls test_threaded_calls.o  ../.libs/libykpers-1.so -L/usr/lib /usr/lib/libyubikey.so -pthread -Wl,-rpath -Wl,/tmp/B.uannEb/BUILD/ykpers-1.18.0/.libs
make[2]: Leaving directory '/tmp/B.uannEb/BUILD/ykpers-1.18.0/tests'
make[2]: Entering directory '/tmp/B.uannEb/BUILD/ykpers-1.18.0/tests'
/bin/sh ../libtool  --tag=CC   --mode=link i686-pld-linux-gcc -I./.. -I./../ykcore  -O2 -fwrapv -pipe -Wformat -Werror=format-security -gdwarf-4 -fno-debug-types-section -fvar-tracking-assignments -g2 -Wp,-D_FORTIFY_SOURCE=2 -fstack-protector-strong --param=ssp-buffer-size=4 -fomit-frame-pointer -march=i686 -fasynchronous-unwind-tables -mtune=pentium4 -gdwarf-4 -fno-debug-types-section -fvar-tracking-assignments -g2  -pthread -no-install  -Wl,--as-needed -Wl,--no-copy-dt-needed-entries -Wl,-z,relro -Wl,-z,combreloc  -o selftest selftest.o ../libykpers-1.la -L/usr/lib -lyubikey 
libtool: link: i686-pld-linux-gcc -I./.. -I./../ykcore -O2 -fwrapv -pipe -Wformat -Werror=format-security -gdwarf-4 -fno-debug-types-section -fvar-tracking-assignments -g2 -Wp,-D_FORTIFY_SOURCE=2 -fstack-protector-strong --param=ssp-buffer-size=4 -fomit-frame-pointer -march=i686 -fasynchronous-unwind-tables -mtune=pentium4 -gdwarf-4 -fno-debug-types-section -fvar-tracking-assignments -g2 -pthread -Wl,--as-needed -Wl,--no-copy-dt-needed-entries -Wl,-z -Wl,relro -Wl,-z -Wl,combreloc -o selftest selftest.o  ../.libs/libykpers-1.so -L/usr/lib /usr/lib/libyubikey.so -pthread -Wl,-rpath -Wl,/tmp/B.uannEb/BUILD/ykpers-1.18.0/.libs
make[2]: Leaving directory '/tmp/B.uannEb/BUILD/ykpers-1.18.0/tests'
make[2]: Entering directory '/tmp/B.uannEb/BUILD/ykpers-1.18.0/tests'
/bin/sh ../libtool  --tag=CC   --mode=link i686-pld-linux-gcc -I./.. -I./../ykcore  -O2 -fwrapv -pipe -Wformat -Werror=format-security -gdwarf-4 -fno-debug-types-section -fvar-tracking-assignments -g2 -Wp,-D_FORTIFY_SOURCE=2 -fstack-protector-strong --param=ssp-buffer-size=4 -fomit-frame-pointer -march=i686 -fasynchronous-unwind-tables -mtune=pentium4 -gdwarf-4 -fno-debug-types-section -fvar-tracking-assignments -g2  -pthread -no-install  -Wl,--as-needed -Wl,--no-copy-dt-needed-entries -Wl,-z,relro -Wl,-z,combreloc  -o test_key_generation test_key_generation.o ../libykpers-1.la -L/usr/lib -lyubikey 
libtool: link: i686-pld-linux-gcc -I./.. -I./../ykcore -O2 -fwrapv -pipe -Wformat -Werror=format-security -gdwarf-4 -fno-debug-types-section -fvar-tracking-assignments -g2 -Wp,-D_FORTIFY_SOURCE=2 -fstack-protector-strong --param=ssp-buffer-size=4 -fomit-frame-pointer -march=i686 -fasynchronous-unwind-tables -mtune=pentium4 -gdwarf-4 -fno-debug-types-section -fvar-tracking-assignments -g2 -pthread -Wl,--as-needed -Wl,--no-copy-dt-needed-entries -Wl,-z -Wl,relro -Wl,-z -Wl,combreloc -o test_key_generation test_key_generation.o  ../.libs/libykpers-1.so -L/usr/lib /usr/lib/libyubikey.so -pthread -Wl,-rpath -Wl,/tmp/B.uannEb/BUILD/ykpers-1.18.0/.libs
make[2]: Leaving directory '/tmp/B.uannEb/BUILD/ykpers-1.18.0/tests'
make[2]: Entering directory '/tmp/B.uannEb/BUILD/ykpers-1.18.0/tests'
/bin/sh ../libtool  --tag=CC   --mode=link i686-pld-linux-gcc -I./.. -I./../ykcore  -O2 -fwrapv -pipe -Wformat -Werror=format-security -gdwarf-4 -fno-debug-types-section -fvar-tracking-assignments -g2 -Wp,-D_FORTIFY_SOURCE=2 -fstack-protector-strong --param=ssp-buffer-size=4 -fomit-frame-pointer -march=i686 -fasynchronous-unwind-tables -mtune=pentium4 -gdwarf-4 -fno-debug-types-section -fvar-tracking-assignments -g2  -pthread -no-install  -Wl,--as-needed -Wl,--no-copy-dt-needed-entries -Wl,-z,relro -Wl,-z,combreloc  -o test_json test_json.o ../libykpers-1.la -L/usr/lib -lyubikey 
libtool: link: i686-pld-linux-gcc -I./.. -I./../ykcore -O2 -fwrapv -pipe -Wformat -Werror=format-security -gdwarf-4 -fno-debug-types-section -fvar-tracking-assignments -g2 -Wp,-D_FORTIFY_SOURCE=2 -fstack-protector-strong --param=ssp-buffer-size=4 -fomit-frame-pointer -march=i686 -fasynchronous-unwind-tables -mtune=pentium4 -gdwarf-4 -fno-debug-types-section -fvar-tracking-assignments -g2 -pthread -Wl,--as-needed -Wl,--no-copy-dt-needed-entries -Wl,-z -Wl,relro -Wl,-z -Wl,combreloc -o test_json test_json.o  ../.libs/libykpers-1.so -L/usr/lib /usr/lib/libyubikey.so -pthread -Wl,-rpath -Wl,/tmp/B.uannEb/BUILD/ykpers-1.18.0/.libs
make[2]: Leaving directory '/tmp/B.uannEb/BUILD/ykpers-1.18.0/tests'
make[2]: Entering directory '/tmp/B.uannEb/BUILD/ykpers-1.18.0/tests'
/bin/sh ../libtool  --tag=CC   --mode=link i686-pld-linux-gcc -I./.. -I./../ykcore  -O2 -fwrapv -pipe -Wformat -Werror=format-security -gdwarf-4 -fno-debug-types-section -fvar-tracking-assignments -g2 -Wp,-D_FORTIFY_SOURCE=2 -fstack-protector-strong --param=ssp-buffer-size=4 -fomit-frame-pointer -march=i686 -fasynchronous-unwind-tables -mtune=pentium4 -gdwarf-4 -fno-debug-types-section -fvar-tracking-assignments -g2  -pthread -no-install  -Wl,--as-needed -Wl,--no-copy-dt-needed-entries -Wl,-z,relro -Wl,-z,combreloc  -o test_ykpbkdf2 test_ykpbkdf2.o ../libykpers-1.la -L/usr/lib -lyubikey 
libtool: link: i686-pld-linux-gcc -I./.. -I./../ykcore -O2 -fwrapv -pipe -Wformat -Werror=format-security -gdwarf-4 -fno-debug-types-section -fvar-tracking-assignments -g2 -Wp,-D_FORTIFY_SOURCE=2 -fstack-protector-strong --param=ssp-buffer-size=4 -fomit-frame-pointer -march=i686 -fasynchronous-unwind-tables -mtune=pentium4 -gdwarf-4 -fno-debug-types-section -fvar-tracking-assignments -g2 -pthread -Wl,--as-needed -Wl,--no-copy-dt-needed-entries -Wl,-z -Wl,relro -Wl,-z -Wl,combreloc -o test_ykpbkdf2 test_ykpbkdf2.o  ../.libs/libykpers-1.so -L/usr/lib /usr/lib/libyubikey.so -pthread -Wl,-rpath -Wl,/tmp/B.uannEb/BUILD/ykpers-1.18.0/.libs
make[2]: Leaving directory '/tmp/B.uannEb/BUILD/ykpers-1.18.0/tests'
make[2]: Entering directory '/tmp/B.uannEb/BUILD/ykpers-1.18.0/tests'
/bin/sh ../libtool  --tag=CC   --mode=link i686-pld-linux-gcc -I./.. -I./../ykcore  -O2 -fwrapv -pipe -Wformat -Werror=format-security -gdwarf-4 -fno-debug-types-section -fvar-tracking-assignments -g2 -Wp,-D_FORTIFY_SOURCE=2 -fstack-protector-strong --param=ssp-buffer-size=4 -fomit-frame-pointer -march=i686 -fasynchronous-unwind-tables -mtune=pentium4 -gdwarf-4 -fno-debug-types-section -fvar-tracking-assignments -g2  -pthread -no-install  -Wl,--as-needed -Wl,--no-copy-dt-needed-entries -Wl,-z,relro -Wl,-z,combreloc  -o test_yk_utilities test_yk_utilities.o ../libykpers-1.la -L/usr/lib -lyubikey 
libtool: link: i686-pld-linux-gcc -I./.. -I./../ykcore -O2 -fwrapv -pipe -Wformat -Werror=format-security -gdwarf-4 -fno-debug-types-section -fvar-tracking-assignments -g2 -Wp,-D_FORTIFY_SOURCE=2 -fstack-protector-strong --param=ssp-buffer-size=4 -fomit-frame-pointer -march=i686 -fasynchronous-unwind-tables -mtune=pentium4 -gdwarf-4 -fno-debug-types-section -fvar-tracking-assignments -g2 -pthread -Wl,--as-needed -Wl,--no-copy-dt-needed-entries -Wl,-z -Wl,relro -Wl,-z -Wl,combreloc -o test_yk_utilities test_yk_utilities.o  ../.libs/libykpers-1.so -L/usr/lib /usr/lib/libyubikey.so -pthread -Wl,-rpath -Wl,/tmp/B.uannEb/BUILD/ykpers-1.18.0/.libs
make[2]: Leaving directory '/tmp/B.uannEb/BUILD/ykpers-1.18.0/tests'
make[2]: Entering directory '/tmp/B.uannEb/BUILD/ykpers-1.18.0/tests'
/bin/sh ../libtool  --tag=CC   --mode=link i686-pld-linux-gcc -I./.. -I./../ykcore  -O2 -fwrapv -pipe -Wformat -Werror=format-security -gdwarf-4 -fno-debug-types-section -fvar-tracking-assignments -g2 -Wp,-D_FORTIFY_SOURCE=2 -fstack-protector-strong --param=ssp-buffer-size=4 -fomit-frame-pointer -march=i686 -fasynchronous-unwind-tables -mtune=pentium4 -gdwarf-4 -fno-debug-types-section -fvar-tracking-assignments -g2  -pthread -no-install  -Wl,--as-needed -Wl,--no-copy-dt-needed-entries -Wl,-z,relro -Wl,-z,combreloc  -o test_ndef_construction test_ndef_construction.o ../libykpers-1.la -L/usr/lib -lyubikey 
libtool: link: i686-pld-linux-gcc -I./.. -I./../ykcore -O2 -fwrapv -pipe -Wformat -Werror=format-security -gdwarf-4 -fno-debug-types-section -fvar-tracking-assignments -g2 -Wp,-D_FORTIFY_SOURCE=2 -fstack-protector-strong --param=ssp-buffer-size=4 -fomit-frame-pointer -march=i686 -fasynchronous-unwind-tables -mtune=pentium4 -gdwarf-4 -fno-debug-types-section -fvar-tracking-assignments -g2 -pthread -Wl,--as-needed -Wl,--no-copy-dt-needed-entries -Wl,-z -Wl,relro -Wl,-z -Wl,combreloc -o test_ndef_construction test_ndef_construction.o  ../.libs/libykpers-1.so -L/usr/lib /usr/lib/libyubikey.so -pthread -Wl,-rpath -Wl,/tmp/B.uannEb/BUILD/ykpers-1.18.0/.libs
make[2]: Leaving directory '/tmp/B.uannEb/BUILD/ykpers-1.18.0/tests'
make[2]: Entering directory '/tmp/B.uannEb/BUILD/ykpers-1.18.0/tests'
/bin/sh ../libtool  --tag=CC   --mode=link i686-pld-linux-gcc -I./.. -I./../ykcore  -O2 -fwrapv -pipe -Wformat -Werror=format-security -gdwarf-4 -fno-debug-types-section -fvar-tracking-assignments -g2 -Wp,-D_FORTIFY_SOURCE=2 -fstack-protector-strong --param=ssp-buffer-size=4 -fomit-frame-pointer -march=i686 -fasynchronous-unwind-tables -mtune=pentium4 -gdwarf-4 -fno-debug-types-section -fvar-tracking-assignments -g2  -pthread -no-install  -Wl,--as-needed -Wl,--no-copy-dt-needed-entries -Wl,-z,relro -Wl,-z,combreloc  -o test_args_to_config test_args_to_config.o ../libykpers_args.la 
libtool: link: i686-pld-linux-gcc -I./.. -I./../ykcore -O2 -fwrapv -pipe -Wformat -Werror=format-security -gdwarf-4 -fno-debug-types-section -fvar-tracking-assignments -g2 -Wp,-D_FORTIFY_SOURCE=2 -fstack-protector-strong --param=ssp-buffer-size=4 -fomit-frame-pointer -march=i686 -fasynchronous-unwind-tables -mtune=pentium4 -gdwarf-4 -fno-debug-types-section -fvar-tracking-assignments -g2 -pthread -Wl,--as-needed -Wl,--no-copy-dt-needed-entries -Wl,-z -Wl,relro -Wl,-z -Wl,combreloc -o test_args_to_config test_args_to_config.o  ../.libs/libykpers_args.a /tmp/B.uannEb/BUILD/ykpers-1.18.0/.libs/libykpers-1.so -L/usr/lib /usr/lib/libusb.so /usr/lib/libusb-1.0.so -ludev -ljson-c /usr/lib/libyubikey.so -pthread -Wl,-rpath -Wl,/tmp/B.uannEb/BUILD/ykpers-1.18.0/.libs
make[2]: Leaving directory '/tmp/B.uannEb/BUILD/ykpers-1.18.0/tests'
/usr/bin/make  check-TESTS
make[3]: Entering directory '/tmp/B.uannEb/BUILD/ykpers-1.18.0/tests'
PASS: test_key_generation
make[3]: Leaving directory '/tmp/B.uannEb/BUILD/ykpers-1.18.0/tests'
make[3]: Entering directory '/tmp/B.uannEb/BUILD/ykpers-1.18.0/tests'
PASS: selftest
make[3]: Leaving directory '/tmp/B.uannEb/BUILD/ykpers-1.18.0/tests'
make[3]: Entering directory '/tmp/B.uannEb/BUILD/ykpers-1.18.0/tests'
PASS: test_ndef_construction
make[3]: Leaving directory '/tmp/B.uannEb/BUILD/ykpers-1.18.0/tests'
make[3]: Entering directory '/tmp/B.uannEb/BUILD/ykpers-1.18.0/tests'
PASS: test_yk_utilities
make[3]: Leaving directory '/tmp/B.uannEb/BUILD/ykpers-1.18.0/tests'
make[3]: Entering directory '/tmp/B.uannEb/BUILD/ykpers-1.18.0/tests'
FAIL: test_json
make[3]: Leaving directory '/tmp/B.uannEb/BUILD/ykpers-1.18.0/tests'
make[3]: Entering directory '/tmp/B.uannEb/BUILD/ykpers-1.18.0/tests'
PASS: test_args_to_config
make[3]: Leaving directory '/tmp/B.uannEb/BUILD/ykpers-1.18.0/tests'
make[3]: Entering directory '/tmp/B.uannEb/BUILD/ykpers-1.18.0/tests'
FAIL: test_threaded_calls
make[3]: Leaving directory '/tmp/B.uannEb/BUILD/ykpers-1.18.0/tests'
make[3]: Entering directory '/tmp/B.uannEb/BUILD/ykpers-1.18.0/tests'
PASS: test_ykpbkdf2
make[3]: Leaving directory '/tmp/B.uannEb/BUILD/ykpers-1.18.0/tests'
make[3]: Entering directory '/tmp/B.uannEb/BUILD/ykpers-1.18.0/tests'
============================================================================
Testsuite summary for yubikey-personalization 1.18.0
============================================================================
# TOTAL: 8
# PASS:  6
# SKIP:  0
# XFAIL: 0
# FAIL:  2
# XPASS: 0
# ERROR: 0
============================================================================
See tests/test-suite.log
Please report to yubico-devel@googlegroups.com
============================================================================
make[3]: *** [Makefile:796: test-suite.log] Error 1
make[3]: Leaving directory '/tmp/B.uannEb/BUILD/ykpers-1.18.0/tests'
make[2]: *** [Makefile:904: check-TESTS] Error 2
make[1]: *** [Makefile:1024: check-am] Error 2
make: *** [Makefile:931: check-recursive] Error 1
error: Bad exit status from /tmp/B.uannEb/BUILD/tmp/rpm-tmp.53822 (%build)


RPM build errors:
    Bad exit status from /tmp/B.uannEb/BUILD/tmp/rpm-tmp.53822 (%build)
ended at: Thu May 10 17:33:42 2018, done in 0:00:06.413227
error: No files produced.
+ chmod -R u+rwX /tmp/B.uannEb/BUILD
+ rm -rf /tmp/B.uannEb/tmp /tmp/B.uannEb/BUILD
+ rm -rf /tmp/B.uannEb
Begin-PLD-Builder-Info
Build-Time: user:11.30s sys:1.56s real:10.98s (faults io:0 non-io:851166)

End-PLD-Builder-Info
[Back to list of logs] [View rpm -qa of builder]