FailedOk

th/SRPMS[OK]
th/x32[OK]
th/i686[OK]
th/x86_64[OK]

ac/SRPMS[OK]
ac/i386[OK]
ac/i586[OK]
ac/i686[OK]
ac/alpha[OK]
ac/amd64[OK]
ac/athlon[OK]
ac/ppc[OK]
ac/sparc[OK]
ac/sparc64[OK]

Advanced Search
main()
Powered by PLD Linux
(c) 2002-2017 PLD Team
$Revision: 1.37 $
Powered by penguin.
Your IP: 54.198.235.165

zoneminder 9e8498b4-c2d6-46a3-9759-9e64a4984d92

Status:Failed
Source URL:ftp://buildlogs.pld-linux.org/th/i686/FAIL/zoneminder,9e8498b4-c2d6-46a3-9759-9e64a4984d92.bz2
text/plain URL:View!
rpm -qa of builder:View!
Date:2017/04/14 16:06:45
Runtime:0:00:24.427664

Toc:

  • prep
  • Executing(%prep): /bin/sh -e /tmp/B._6255T/BUILD/tmp/rpm-tmp.10826
  • build
  • Executing(%build): /bin/sh -e /tmp/B._6255T/BUILD/tmp/rpm-tmp.10826
  • error 1
  • zm_image.h:125:25: error: expected identifier before numeric constant
  • error 2
  • zm_image.h:125:25: error: expected '}' before numeric constant
  • error 3
  • zm_image.h:125:25: error: expected unqualified-id before numeric constant
  • error 4
  • zm_image.h:110:14: error: 'buffer' was not declared in this scope
  • error 5
  • zm_image.h:110:21: error: 'buffertype' was not declared in this scope
  • error 6
  • zm_image.h:112:3: error: 'allocation' was not declared in this scope
  • error 7
  • zm_image.h:116:6: error: 'buffer' was not declared in this scope
  • error 8
  • zm_image.h:119:3: error: 'buffer' was not declared in this scope
  • error 9
  • zm_image.h:120:3: error: 'buffertype' was not declared in this scope
  • error 10
  • zm_image.h:121:3: error: 'allocation' was not declared in this scope
  • error 11
  • zm_image.h:126:21: error: 'CHAR_HEIGHT' was not declared in this scope
  • error 12
  • zm_image.h:128:1: error: expected unqualified-id before 'protected'
  • error 13
  • zm_image.h:138:1: error: expected unqualified-id before 'protected'
  • error 14
  • zm_image.h:151:1: error: expected unqualified-id before 'protected'
  • error 15
  • zm_image.h:154:1: error: expected unqualified-id before 'public'
  • error 16
  • zm_image.h:156:9: error: expected unqualified-id before 'const'
  • error 17
  • zm_image.h:156:9: error: expected ')' before 'const'
  • error 18
  • zm_image.h:157:9: error: expected unqualified-id before 'int'
  • error 19
  • zm_image.h:157:9: error: expected ')' before 'int'
  • error 20
  • zm_image.h:158:9: error: expected unqualified-id before 'const'
  • error 21
  • zm_image.h:158:9: error: expected ')' before 'const'
  • error 22
  • zm_image.h:159:10: error: expected constructor, destructor, or type conversion before ';' token
  • error 23
  • zm_image.h:161:30: error: non-member function 'unsigned int Width()' cannot have cv-qualifier
  • error 24
  • zm_image.h:161:46: error: 'width' was not declared in this scope
  • error 25
  • zm_image.h:162:31: error: non-member function 'unsigned int Height()' cannot have cv-qualifier
  • error 26
  • zm_image.h:163:31: error: non-member function 'unsigned int Pixels()' cannot have cv-qualifier
  • error 27
  • zm_image.h:164:32: error: non-member function 'unsigned int Colours()' cannot have cv-qualifier
  • error 28
  • zm_image.h:165:38: error: non-member function 'unsigned int SubpixelOrder()' cannot have cv-qualifier
  • error 29
  • zm_image.h:166:29: error: non-member function 'unsigned int Size()' cannot have cv-qualifier
  • error 30
  • zm_image.h:169:33: error: non-member function 'const uint8_t* Buffer()' cannot have cv-qualifier
  • error 31
  • zm_image.h:170:68: error: non-member function 'const uint8_t* Buffer(unsigned int, unsigned int)' cannot have cv-qualifier
  • error 32
  • zm_image.h:170:104: error: 'width' was not declared in this scope
  • error 33
  • zm_image.h:174:28: error: non-member function 'int IsBufferHeld()' cannot have cv-qualifier
  • error 34
  • zm_image.h:179:17: error: 'DumpImgBuffer' was not declared in this scope
  • error 35
  • zm_image.h:181:2: error: 'width' was not declared in this scope
  • error 36
  • zm_image.h:192:46: error: 'Image& operator=(const Image&)' must be a nonstatic member function
  • error 37
  • zm_image.h:197:59: error: 'Image& operator=(const unsigned char*)' must be a nonstatic member function
  • error 38
  • zm_image.h:204:40: error: non-member function 'bool WriteRaw(const char*)' cannot have cv-qualifier
  • error 39
  • zm_image.h:207:65: error: non-member function 'bool WriteJpeg(const char*, int)' cannot have cv-qualifier
  • error 40
  • zm_image.h:209:84: error: non-member function 'bool EncodeJpeg(JOCTET*, int*, int)' cannot have cv-qualifier
  • error 41
  • zm_image.h:213:98: error: non-member function 'bool Zip(Bytef*, long unsigned int*, int)' cannot have cv-qualifier
  • error 42
  • zm_image.h:226:54: error: non-member function 'void Delta(const Image&, Image*)' cannot have cv-qualifier
  • error 43
  • zm_image.h:228:46: error: non-member function 'const Coord centreCoord(const char*)' cannot have cv-qualifier
  • error 44
  • zm_image.h:253:1: error: expected declaration before '}' token
  • error 45
  • zm_image.h:125:25: error: expected identifier before numeric constant
  • error 46
  • zm_image.h:125:25: error: expected '}' before numeric constant
  • error 47
  • zm_image.h:125:25: error: expected unqualified-id before numeric constant
  • error 48
  • zm_image.h:110:14: error: 'buffer' was not declared in this scope
  • error 49
  • zm_image.h:110:21: error: 'buffertype' was not declared in this scope
  • error 50
  • zm_image.h:112:3: error: 'allocation' was not declared in this scope
  • error 51
  • zm_image.h:116:6: error: 'buffer' was not declared in this scope
  • error 52
  • zm_image.h:119:3: error: 'buffer' was not declared in this scope
  • error 53
  • zm_image.h:120:3: error: 'buffertype' was not declared in this scope
  • error 54
  • zm_image.h:121:3: error: 'allocation' was not declared in this scope
  • error 55
  • zm_image.h:126:21: error: 'CHAR_HEIGHT' was not declared in this scope
  • error 56
  • zm_image.h:128:1: error: expected unqualified-id before 'protected'
  • error 57
  • zm_image.h:138:1: error: expected unqualified-id before 'protected'
  • error 58
  • zm_image.h:151:1: error: expected unqualified-id before 'protected'
  • error 59
  • zm_image.h:154:1: error: expected unqualified-id before 'public'
  • error 60
  • zm_image.h:156:9: error: expected unqualified-id before 'const'
  • error 61
  • zm_image.h:156:9: error: expected ')' before 'const'
  • error 62
  • zm_image.h:157:9: error: expected unqualified-id before 'int'
  • error 63
  • zm_image.h:157:9: error: expected ')' before 'int'
  • error 64
  • zm_image.h:158:9: error: expected unqualified-id before 'const'
  • error 65
  • zm_image.h:158:9: error: expected ')' before 'const'
  • error 66
  • zm_image.h:159:10: error: expected constructor, destructor, or type conversion before ';' token
  • error 67
  • zm_image.h:161:30: error: non-member function 'unsigned int Width()' cannot have cv-qualifier
  • error 68
  • zm_image.h:161:46: error: 'width' was not declared in this scope
  • error 69
  • zm_image.h:162:31: error: non-member function 'unsigned int Height()' cannot have cv-qualifier
  • error 70
  • zm_image.h:163:31: error: non-member function 'unsigned int Pixels()' cannot have cv-qualifier
  • error 71
  • zm_image.h:164:32: error: non-member function 'unsigned int Colours()' cannot have cv-qualifier
  • error 72
  • zm_image.h:165:38: error: non-member function 'unsigned int SubpixelOrder()' cannot have cv-qualifier
  • error 73
  • zm_image.h:166:29: error: non-member function 'unsigned int Size()' cannot have cv-qualifier
  • error 74
  • zm_image.h:169:33: error: non-member function 'const uint8_t* Buffer()' cannot have cv-qualifier
  • error 75
  • zm_image.h:170:68: error: non-member function 'const uint8_t* Buffer(unsigned int, unsigned int)' cannot have cv-qualifier
  • error 76
  • zm_image.h:170:104: error: 'width' was not declared in this scope
  • error 77
  • zm_image.h:174:28: error: non-member function 'int IsBufferHeld()' cannot have cv-qualifier
  • error 78
  • zm_image.h:179:17: error: 'DumpImgBuffer' was not declared in this scope
  • error 79
  • zm_image.h:181:2: error: 'width' was not declared in this scope
  • error 80
  • zm_image.h:192:46: error: 'Image& operator=(const Image&)' must be a nonstatic member function
  • error 81
  • zm_image.h:197:59: error: 'Image& operator=(const unsigned char*)' must be a nonstatic member function
  • error 82
  • zm_image.h:204:40: error: non-member function 'bool WriteRaw(const char*)' cannot have cv-qualifier
  • error 83
  • zm_image.h:207:65: error: non-member function 'bool WriteJpeg(const char*, int)' cannot have cv-qualifier
  • error 84
  • zm_image.h:209:84: error: non-member function 'bool EncodeJpeg(JOCTET*, int*, int)' cannot have cv-qualifier
  • error 85
  • zm_image.h:213:98: error: non-member function 'bool Zip(Bytef*, long unsigned int*, int)' cannot have cv-qualifier
  • error 86
  • zm_image.h:226:54: error: non-member function 'void Delta(const Image&, Image*)' cannot have cv-qualifier
  • error 87
  • zm_image.h:228:46: error: non-member function 'const Coord centreCoord(const char*)' cannot have cv-qualifier
  • error 88
  • zm_image.h:253:1: error: expected declaration before '}' token
  • error 89
  • zm_image.h:125:25: error: expected identifier before numeric constant
  • error 90
  • zm_image.h:125:25: error: expected '}' before numeric constant
  • error 91
  • zm_image.h:125:25: error: expected unqualified-id before numeric constant
  • error 92
  • zm_image.h:110:14: error: 'buffer' was not declared in this scope
  • error 93
  • zm_image.h:110:21: error: 'buffertype' was not declared in this scope
  • error 94
  • zm_image.h:112:3: error: 'allocation' was not declared in this scope
  • error 95
  • zm_image.h:116:6: error: 'buffer' was not declared in this scope
  • error 96
  • zm_image.h:119:3: error: 'buffer' was not declared in this scope
  • error 97
  • zm_image.h:120:3: error: 'buffertype' was not declared in this scope
  • error 98
  • zm_image.h:121:3: error: 'allocation' was not declared in this scope
  • error 99
  • zm_image.h:126:21: error: 'CHAR_HEIGHT' was not declared in this scope
  • error 100
  • zm_image.h:128:1: error: expected unqualified-id before 'protected'
  • error 101
  • zm_image.h:138:1: error: expected unqualified-id before 'protected'
  • error 102
  • zm_image.h:151:1: error: expected unqualified-id before 'protected'
  • error 103
  • zm_image.h:154:1: error: expected unqualified-id before 'public'
  • error 104
  • zm_image.h:156:9: error: expected unqualified-id before 'const'
  • error 105
  • zm_image.h:156:9: error: expected ')' before 'const'
  • error 106
  • zm_image.h:157:9: error: expected unqualified-id before 'int'
  • error 107
  • zm_image.h:157:9: error: expected ')' before 'int'
  • error 108
  • zm_image.h:158:9: error: expected unqualified-id before 'const'
  • error 109
  • zm_image.h:158:9: error: expected ')' before 'const'
  • error 110
  • zm_image.h:159:10: error: expected constructor, destructor, or type conversion before ';' token
  • error 111
  • zm_image.h:161:30: error: non-member function 'unsigned int Width()' cannot have cv-qualifier
  • error 112
  • zm_image.h:161:46: error: 'width' was not declared in this scope
  • error 113
  • zm_image.h:162:31: error: non-member function 'unsigned int Height()' cannot have cv-qualifier
  • error 114
  • zm_image.h:163:31: error: non-member function 'unsigned int Pixels()' cannot have cv-qualifier
  • error 115
  • zm_image.h:164:32: error: non-member function 'unsigned int Colours()' cannot have cv-qualifier
  • error 116
  • zm_image.h:165:38: error: non-member function 'unsigned int SubpixelOrder()' cannot have cv-qualifier
  • error 117
  • zm_image.h:166:29: error: non-member function 'unsigned int Size()' cannot have cv-qualifier
  • error 118
  • zm_image.h:169:33: error: non-member function 'const uint8_t* Buffer()' cannot have cv-qualifier
  • error 119
  • zm_image.h:170:68: error: non-member function 'const uint8_t* Buffer(unsigned int, unsigned int)' cannot have cv-qualifier
  • error 120
  • zm_image.h:170:104: error: 'width' was not declared in this scope
  • error 121
  • zm_image.h:174:28: error: non-member function 'int IsBufferHeld()' cannot have cv-qualifier
  • error 122
  • zm_image.h:179:17: error: 'DumpImgBuffer' was not declared in this scope
  • error 123
  • zm_image.h:181:2: error: 'width' was not declared in this scope
  • error 124
  • zm_image.h:192:46: error: 'Image& operator=(const Image&)' must be a nonstatic member function
  • error 125
  • zm_image.h:197:59: error: 'Image& operator=(const unsigned char*)' must be a nonstatic member function
  • error 126
  • zm_image.h:204:40: error: non-member function 'bool WriteRaw(const char*)' cannot have cv-qualifier
  • error 127
  • zm_image.h:207:65: error: non-member function 'bool WriteJpeg(const char*, int)' cannot have cv-qualifier
  • error 128
  • zm_image.h:209:84: error: non-member function 'bool EncodeJpeg(JOCTET*, int*, int)' cannot have cv-qualifier
  • error 129
  • zm_image.h:213:98: error: non-member function 'bool Zip(Bytef*, long unsigned int*, int)' cannot have cv-qualifier
  • error 130
  • zm_image.h:226:54: error: non-member function 'void Delta(const Image&, Image*)' cannot have cv-qualifier
  • error 131
  • zm_image.h:228:46: error: non-member function 'const Coord centreCoord(const char*)' cannot have cv-qualifier
  • error 132
  • zm_image.h:253:1: error: expected declaration before '}' token
  • error 133
  • zm_image.h:125:25: error: expected identifier before numeric constant
  • error 134
  • zm_image.h:125:25: error: expected '}' before numeric constant
  • error 135
  • zm_image.h:125:25: error: expected unqualified-id before numeric constant
  • error 136
  • zm_image.h:110:14: error: 'buffer' was not declared in this scope
  • error 137
  • zm_image.h:110:21: error: 'buffertype' was not declared in this scope
  • error 138
  • zm_image.h:112:3: error: 'allocation' was not declared in this scope
  • error 139
  • zm_image.h:116:6: error: 'buffer' was not declared in this scope
  • error 140
  • zm_image.h:119:3: error: 'buffer' was not declared in this scope
  • error 141
  • zm_image.h:120:3: error: 'buffertype' was not declared in this scope
  • error 142
  • zm_image.h:121:3: error: 'allocation' was not declared in this scope
  • error 143
  • zm_image.h:126:21: error: 'CHAR_HEIGHT' was not declared in this scope
  • error 144
  • zm_image.h:128:1: error: expected unqualified-id before 'protected'
  • error 145
  • zm_image.h:138:1: error: expected unqualified-id before 'protected'
  • error 146
  • zm_image.h:151:1: error: expected unqualified-id before 'protected'
  • error 147
  • zm_image.h:154:1: error: expected unqualified-id before 'public'
  • error 148
  • zm_image.h:156:9: error: expected unqualified-id before 'const'
  • error 149
  • zm_image.h:156:9: error: expected ')' before 'const'
  • error 150
  • zm_image.h:157:9: error: expected unqualified-id before 'int'
  • error 151
  • zm_image.h:157:9: error: expected ')' before 'int'
  • error 152
  • zm_image.h:158:9: error: expected unqualified-id before 'const'
  • error 153
  • zm_image.h:158:9: error: expected ')' before 'const'
  • error 154
  • zm_image.h:159:10: error: expected constructor, destructor, or type conversion before ';' token
  • error 155
  • zm_image.h:161:30: error: non-member function 'unsigned int Width()' cannot have cv-qualifier
  • error 156
  • zm_image.h:161:46: error: 'width' was not declared in this scope
  • error 157
  • zm_image.h:162:31: error: non-member function 'unsigned int Height()' cannot have cv-qualifier
  • error 158
  • zm_image.h:163:31: error: non-member function 'unsigned int Pixels()' cannot have cv-qualifier
  • error 159
  • zm_image.h:164:32: error: non-member function 'unsigned int Colours()' cannot have cv-qualifier
  • error 160
  • zm_image.h:165:38: error: non-member function 'unsigned int SubpixelOrder()' cannot have cv-qualifier
  • error 161
  • zm_image.h:166:29: error: non-member function 'unsigned int Size()' cannot have cv-qualifier
  • error 162
  • zm_image.h:169:33: error: non-member function 'const uint8_t* Buffer()' cannot have cv-qualifier
  • error 163
  • zm_image.h:170:68: error: non-member function 'const uint8_t* Buffer(unsigned int, unsigned int)' cannot have cv-qualifier
  • error 164
  • zm_image.h:170:104: error: 'width' was not declared in this scope
  • error 165
  • zm_image.h:174:28: error: non-member function 'int IsBufferHeld()' cannot have cv-qualifier
  • error 166
  • zm_image.h:179:17: error: 'DumpImgBuffer' was not declared in this scope
  • error 167
  • zm_image.h:181:2: error: 'width' was not declared in this scope
  • error 168
  • zm_image.h:192:46: error: 'Image& operator=(const Image&)' must be a nonstatic member function
  • error 169
  • zm_image.h:197:59: error: 'Image& operator=(const unsigned char*)' must be a nonstatic member function
  • error 170
  • zm_image.h:204:40: error: non-member function 'bool WriteRaw(const char*)' cannot have cv-qualifier
  • error 171
  • zm_image.h:207:65: error: non-member function 'bool WriteJpeg(const char*, int)' cannot have cv-qualifier
  • error 172
  • zm_image.h:209:84: error: non-member function 'bool EncodeJpeg(JOCTET*, int*, int)' cannot have cv-qualifier
  • error 173
  • zm_image.h:213:98: error: non-member function 'bool Zip(Bytef*, long unsigned int*, int)' cannot have cv-qualifier
  • error 174
  • zm_image.h:226:54: error: non-member function 'void Delta(const Image&, Image*)' cannot have cv-qualifier
  • error 175
  • zm_image.h:228:46: error: non-member function 'const Coord centreCoord(const char*)' cannot have cv-qualifier
  • error 176
  • zm_image.h:253:1: error: expected declaration before '}' token
  • error 177
  • error: Bad exit status from /tmp/B._6255T/BUILD/tmp/rpm-tmp.10826 (%build)
  • error 178
  • RPM build errors:
  • error 179
  • error: No files produced.

Content:

request from: qboosh
checking if we should skip the build
started at: Fri Apr 14 16:06:16 2017
fetching https://srcbuilder.pld-linux.org/th//srpms/9e8498b4-c2d6-46a3-9759-9e64a4984d92/zoneminder-1.28.0-3.src.rpm
fetched 3259925 bytes, 2906.0 K/s
installing srpm: zoneminder-1.28.0-3.src.rpm
+ install -d /tmp/B._6255T/BUILD /tmp/B._6255T/RPMS
+ LC_ALL=en_US.UTF-8
+ rpm -qp --changelog zoneminder-1.28.0-3.src.rpm
* Fri Apr 14 2017 PLD Linux Team <feedback@pld-linux.org>
- For complete changelog see: http://git.pld-linux.org/?p=packages/zoneminder.git;a=log;h=master
+ rpm -Uhv --nodeps --define '_topdir /tmp/B._6255T' --define '_specdir %{_topdir}' --define '_sourcedir %{_specdir}' --define '_rpmdir %{_topdir}/RPMS' --define '_builddir %{_topdir}/BUILD' zoneminder-1.28.0-3.src.rpm Preparing... ################################################## zoneminder ################################################## + rm -f zoneminder-1.28.0-3.src.rpm + install -m 700 -d /tmp/B._6255T/BUILD/tmp + TMPDIR=/tmp/B._6255T/BUILD/tmp + exec nice -n 0 rpmbuild -bp --short-circuit --nodeps --define '_topdir /tmp/B._6255T' --define '_specdir %{_topdir}' --define '_sourcedir %{_specdir}' --define '_rpmdir %{_topdir}/RPMS' --define '_builddir %{_topdir}/BUILD' --target i686-pld-linux --define 'prep exit 0' /tmp/B._6255T/zoneminder.spec Building target platforms: i686-pld-linux checking BuildConflict-ing packages no BuildConflicts found checking BR rpm: Building target platforms: i686-pld-linux no BR needed building RPM using: set -ex; : build-id: 9e8498b4-c2d6-46a3-9759-9e64a4984d92; TMPDIR=/tmp/B._6255T/BUILD/tmp exec nice -n 0 rpmbuild -bb --define '_smp_mflags -j9' --define '_make_opts -Otarget' --define '_pld_builder 1' --define '_topdir /tmp/B._6255T' --define '_specdir %{_topdir}' --define '_sourcedir %{_specdir}' --define '_rpmdir %{_topdir}/RPMS' --define '_builddir %{_topdir}/BUILD' --target i686-pld-linux /tmp/B._6255T/zoneminder.spec + : build-id: 9e8498b4-c2d6-46a3-9759-9e64a4984d92 + TMPDIR=/tmp/B._6255T/BUILD/tmp + exec nice -n 0 rpmbuild -bb --define '_smp_mflags -j9' --define '_make_opts -Otarget' --define '_pld_builder 1' --define '_topdir /tmp/B._6255T' --define '_specdir %{_topdir}' --define '_sourcedir %{_specdir}' --define '_rpmdir %{_topdir}/RPMS' --define '_builddir %{_topdir}/BUILD' --target i686-pld-linux /tmp/B._6255T/zoneminder.spec Building target platforms: i686-pld-linux Executing(%prep): /bin/sh -e /tmp/B._6255T/BUILD/tmp/rpm-tmp.10826 + umask 022 + cd /tmp/B._6255T/BUILD + cd /tmp/B._6255T/BUILD + rm -rf ZoneMinder-1.28.0 + /usr/bin/gzip -dc /tmp/B._6255T/v1.28.0.tar.gz + /bin/tar -xf - + STATUS=0 + '[' 0 -ne 0 ']' + cd ZoneMinder-1.28.0 + /usr/bin/bzip2 -dc /tmp/B._6255T/xlib_shm-0.6.3.tar.bz2 + /bin/tar -xf - + STATUS=0 + '[' 0 -ne 0 ']' + /usr/bin/unzip -qq /tmp/B._6255T/jscalendar-1.0.zip + STATUS=0 + '[' 0 -ne 0 ']' + /bin/id -u + '[' 1001 '=' 0 ']' + /bin/id -u + '[' 1001 '=' 0 ']' + /bin/chmod -Rf a+rX,u+w,g-w,o-w . + /bin/sed -i -e 's,\r$,,' scripts/zm.in + cd xlib_shm-0.6.3 + echo 'Patch #1 (zoneminder-xlib_shm.patch):' Patch #1 (zoneminder-xlib_shm.patch): + '[' -f /tmp/B._6255T/zoneminder-xlib_shm.patch ']' + /bin/cat /tmp/B._6255T/zoneminder-xlib_shm.patch + /usr/bin/patch -s -p1 + cd .. + echo 'Patch #2 (zoneminder-build.patch):' Patch #2 (zoneminder-build.patch): + '[' -f /tmp/B._6255T/zoneminder-build.patch ']' + /bin/cat /tmp/B._6255T/zoneminder-build.patch + /usr/bin/patch -s -p1 + echo 'Patch #3 (zoneminder-init.patch):' Patch #3 (zoneminder-init.patch): + '[' -f /tmp/B._6255T/zoneminder-init.patch ']' + /bin/cat /tmp/B._6255T/zoneminder-init.patch + /usr/bin/patch -s -p1 + echo 'Patch #4 (ffmpeg3.patch):' Patch #4 (ffmpeg3.patch): + '[' -f /tmp/B._6255T/ffmpeg3.patch ']' + /bin/cat /tmp/B._6255T/ffmpeg3.patch + /usr/bin/patch -s -p1 + sed -i -e 's#-frepo##g' src/Makefile.am + sed -i -e 's#chown#true#g' -e 's#chmod#true#g' Makefile.am db/Makefile.am misc/Makefile.am scripts/Makefile.am src/Makefile.am web/Makefile.am web/ajax/Makefile.am web/css/Makefile.am web/graphics/Makefile.am web/includes/Makefile.am web/js/Makefile.am web/lang/Makefile.am web/skins/Makefile.am web/tools/Makefile.am web/views/Makefile.am + <<"EOF" + >>db/zm_create.sql.in + cat + install -d jscalendar-doc + mv jscalendar-1.0/bugtest-hidden-selects.html jscalendar-1.0/dayinfo.html jscalendar-1.0/index.html jscalendar-1.0/multiple-dates.html jscalendar-1.0/release-notes.html jscalendar-1.0/simple-1.html jscalendar-1.0/simple-2.html jscalendar-1.0/simple-3.html jscalendar-1.0/test-position.html jscalendar-1.0/calendar.php jscalendar-1.0/test.php jscalendar-1.0/doc/html jscalendar-1.0/doc/reference.pdf jscalendar-1.0/README jscalendar-doc + rm -rf jscalendar-1.0/doc + exit 0 Executing(%build): /bin/sh -e /tmp/B._6255T/BUILD/tmp/rpm-tmp.10826 TMP=/home/users/builder/tmp HOME=/home/users/builder PATH=/home/users/builder/GNUstep/Tools:/usr/local/bin:/usr/bin:/bin:/home/users/builder/bin TMPDIR=/tmp/B._6255T/BUILD/tmp + umask 022 + cd /tmp/B._6255T/BUILD + cd ZoneMinder-1.28.0 + autoheader + aclocal + autoconf + automake -a -c -f --foreign configure.ac:264: installing './compile' configure.ac:14: installing './config.guess' configure.ac:14: installing './config.sub' configure.ac:3: installing './install-sh' configure.ac:3: installing './missing' src/Makefile.am: installing './depcomp' + ./configure 'LDFLAGS=-Wl,--as-needed -Wl,--no-copy-dt-needed-entries -Wl,-z,relro -Wl,-z,combreloc ' 'CFLAGS=-O2 -fwrapv -pipe -Wformat -Werror=format-security -gdwarf-4 -fno-debug-types-section -fvar-tracking-assignments -g2 -Wp,-D_FORTIFY_SOURCE=2 -D__STDC_CONSTANT_MACROS -fstack-protector-strong --param=ssp-buffer-size=4 -fomit-frame-pointer -march=i686 -fasynchronous-unwind-tables -mtune=pentium4 -gdwarf-4 -fno-debug-types-section -fvar-tracking-assignments -g2 ' 'CXXFLAGS=-O2 -fwrapv -pipe -Wformat -Werror=format-security -gdwarf-4 -fno-debug-types-section -fvar-tracking-assignments -g2 -Wp,-D_FORTIFY_SOURCE=2 -D__STDC_CONSTANT_MACROS -fstack-protector-strong --param=ssp-buffer-size=4 -fomit-frame-pointer -march=i686 -fasynchronous-unwind-tables -mtune=pentium4 -gdwarf-4 -fno-debug-types-section -fvar-tracking-assignments -g2 ' 'FFLAGS=-O2 -fwrapv -pipe -Wformat -Werror=format-security -gdwarf-4 -fno-debug-types-section -fvar-tracking-assignments -g2 -Wp,-D_FORTIFY_SOURCE=2 -D__STDC_CONSTANT_MACROS -fstack-protector-strong --param=ssp-buffer-size=4 -fomit-frame-pointer -march=i686 -fasynchronous-unwind-tables -mtune=pentium4 -gdwarf-4 -fno-debug-types-section -fvar-tracking-assignments -g2 ' 'FCFLAGS=-O2 -fwrapv -pipe -Wformat -Werror=format-security -gdwarf-4 -fno-debug-types-section -fvar-tracking-assignments -g2 -Wp,-D_FORTIFY_SOURCE=2 -D__STDC_CONSTANT_MACROS -fstack-protector-strong --param=ssp-buffer-size=4 -fomit-frame-pointer -march=i686 -fasynchronous-unwind-tables -mtune=pentium4 -gdwarf-4 -fno-debug-types-section -fvar-tracking-assignments -g2 ' 'CPPFLAGS=' 'CC=i686-pld-linux-gcc' 'CXX=i686-pld-linux-g++' '--host=i686-pld-linux' '--build=i686-pld-linux' '--prefix=/usr' '--exec-prefix=/usr' '--bindir=/usr/bin' '--sbindir=/usr/sbin' '--sysconfdir=/etc' '--datadir=/usr/share' '--includedir=/usr/include' '--libdir=/usr/lib' '--libexecdir=/usr/lib' '--localstatedir=/var' '--sharedstatedir=/var/lib' '--mandir=/usr/share/man' '--infodir=/usr/share/info' '--x-libraries=/usr/lib' 'ZM_RUNDIR=/var/run/zoneminder' 'ZM_SOCKDIR=/var/run/zoneminder' 'ZM_LOGDIR=/var/log/zoneminder' '--with-libarch=lib' '--enable-mmap=yes' --disable-debug '--with-mysql=/usr' --with-ffmpeg '--with-webgroup=http' '--with-webuser=http' '--with-webdir=/usr/share/zoneminder/www' '--with-cgidir=/usr/lib/zoneminder/cgi-bin' checking for a BSD-compatible install... /usr/bin/install -c checking whether build environment is sane... yes checking for a thread-safe mkdir -p... /bin/mkdir -p checking for mawk... mawk checking whether make sets $(MAKE)... yes checking whether make supports nested variables... yes checking build system type... i686-pld-linux-gnu checking host system type... i686-pld-linux-gnu configure: WARNING: You can call configure with the --with-mariadb option. This tells configure where to find the mariaDB C library and headers if configure cannot locate them automatically. e.g. --with-mariadb=/usr/local or --with-mariadb=/usr configure: WARNING: You can call configure with the --with-polkit option. This tells configure where to place the polkit policy files. checking for i686-pld-linux-pkg-config... no checking for pkg-config... /usr/bin/pkg-config checking pkg-config is at least version 0.9.0... yes checking for polkit-gobject-1... yes configure: WARNING: You can call configure with the --with-extralibs option. Ordinarily you will need to use this option only when your copy of ffmpeg has been built with support for additional formats and you would use this option to detail which additional libraries ffmpeg was built with so that it is able to link successfully with ZoneMinder. You will need to wrap this option in quotes if it contains any spaces. e.g. --with-extralibs="-lmp3lame" configure: WARNING: You can call configure with the --with-webhost option. This tells configure what the host name is for name based virtual hosting. This is only used to populate the sample web/zmHttpd.conf file. e.g. --with-webhost=zm.localdomain checking whether the C++ compiler works... yes checking for C++ compiler default output file name... a.out checking for suffix of executables... checking whether we are cross compiling... no checking for suffix of object files... o checking whether we are using the GNU C++ compiler... yes checking whether i686-pld-linux-g++ accepts -g... yes checking for style of include used by make... GNU checking dependency style of i686-pld-linux-g++... gcc3 checking for i686-pld-linux-gcc... i686-pld-linux-gcc checking whether we are using the GNU C compiler... yes checking whether i686-pld-linux-gcc accepts -g... yes checking for i686-pld-linux-gcc option to accept ISO C89... none needed checking whether i686-pld-linux-gcc understands -c and -o together... yes checking dependency style of i686-pld-linux-gcc... gcc3 checking whether ln -s works... yes checking for i686-pld-linux-ranlib... no checking for ranlib... ranlib checking whether make sets $(MAKE)... (cached) yes checking how to run the C++ preprocessor... i686-pld-linux-g++ -E checking for grep that handles long lines and -e... /bin/grep checking for egrep... /bin/grep -E checking for ANSI C header files... yes checking for sys/types.h... yes checking for sys/stat.h... yes checking for stdlib.h... yes checking for string.h... yes checking for memory.h... yes checking for strings.h... yes checking for inttypes.h... yes checking for stdint.h... yes checking for unistd.h... yes checking for stdbool.h that conforms to C99... no checking for _Bool... no checking for an ANSI C-conforming const... yes checking for uid_t in sys/types.h... yes checking for inline... inline checking for mode_t... yes checking for size_t... yes checking whether time.h and sys/time.h may both be included... yes checking whether struct tm is in sys/time.h or time.h... time.h checking return type of signal handlers... void checking for siginfo_t... yes checking for ucontext_t... yes checking whether i686-pld-linux-gcc needs -traditional... no checking for stdlib.h... (cached) yes checking for GNU libc compatible malloc... yes checking for stdlib.h... (cached) yes checking for unistd.h... (cached) yes checking for sys/param.h... yes checking for getpagesize... yes checking for working mmap... yes checking sys/select.h usability... yes checking sys/select.h presence... yes checking for sys/select.h... yes checking sys/socket.h usability... yes checking sys/socket.h presence... yes checking for sys/socket.h... yes checking types of arguments for select... int,fd_set *,struct timeval * checking whether lstat correctly handles trailing slash... yes checking whether stat accepts an empty string... no checking for strftime... yes checking for working strtod... yes checking for vprintf... yes checking for _doprnt... no checking for gethostbyname... yes checking for gethostname... yes checking for gettimeofday... yes checking for memmove... yes checking for memset... yes checking for mkdir... yes checking for munmap... yes checking for posix_memalign... yes checking for putenv... yes checking for select... yes checking for sendfile... yes checking for socket... yes checking for sqrt... yes checking for strcasecmp... yes checking for strchr... yes checking for strcspn... yes checking for strerror... yes checking for strncasecmp... yes checking for strrchr... yes checking for strspn... yes checking for strstr... yes checking for strtol... yes checking for strtoull... yes checking for syscall... yes checking for sleep... yes checking for usleep... yes checking for ioctl... yes checking for ioctlsocket... no checking for sigaction... yes checking for ffmpeg... no checking for ffmpeg... no checking for pnmscale... yes checking for pnmscale... /usr/bin/pnmscale checking for library containing mysql_init... -lmysqlclient checking for jpeg_start_compress in -ljpeg... yes checking for pthread_create in -lpthread... yes checking for dlsym in -ldl... yes checking gnutls/openssl.h usability... yes checking gnutls/openssl.h presence... yes checking for gnutls/openssl.h... yes checking gnutls/gnutls.h usability... yes checking gnutls/gnutls.h presence... yes checking for gnutls/gnutls.h... yes checking gcrypt.h usability... yes checking gcrypt.h presence... yes checking for gcrypt.h... yes checking for gcry_check_version in -lgcrypt... yes checking for gnutls_fingerprint in -lgnutls... yes checking for MD5 in -lgnutls-openssl... yes checking for pcre_compile in -lpcre... yes checking for zlibVersion in -lz... yes checking for x264_predict_16x16_init in -lx264... yes checking for av_malloc in -lavutil... yes checking for av_image_copy in -lavcore... no checking for avcodec_version in -lavcodec... yes checking for avformat_version in -lavformat... yes checking for avdevice_register_all in -lavdevice... yes checking for sws_scale in -lswscale... yes checking for libvlc_new in -lvlc... yes checking for BZ2_bzCompress in -lbz2... yes checking for compress in -lz... yes checking for curl_global_init in -lcurl... yes checking for working alloca.h... yes checking for alloca... yes checking for ANSI C header files... (cached) yes checking fcntl.h usability... yes checking fcntl.h presence... yes checking for fcntl.h... yes checking limits.h usability... yes checking limits.h presence... yes checking for limits.h... yes checking for memory.h... (cached) yes checking stddef.h usability... yes checking stddef.h presence... yes checking for stddef.h... yes checking for stdlib.h... (cached) yes checking for string.h... (cached) yes checking for strings.h... (cached) yes checking for sys/param.h... (cached) yes checking sys/time.h usability... yes checking sys/time.h presence... yes checking for sys/time.h... yes checking syslog.h usability... yes checking syslog.h presence... yes checking for syslog.h... yes checking for unistd.h... (cached) yes checking values.h usability... yes checking values.h presence... yes checking for values.h... yes checking netdb.h usability... yes checking netdb.h presence... yes checking for netdb.h... yes checking netinet/in.h usability... yes checking netinet/in.h presence... yes checking for netinet/in.h... yes checking arpa/inet.h usability... yes checking arpa/inet.h presence... yes checking for arpa/inet.h... yes checking sys/ioctl.h usability... yes checking sys/ioctl.h presence... yes checking for sys/ioctl.h... yes checking for sys/socket.h... (cached) yes checking sys/un.h usability... yes checking sys/un.h presence... yes checking for sys/un.h... yes checking glob.h usability... yes checking glob.h presence... yes checking for glob.h... yes checking sys/sendfile.h usability... yes checking sys/sendfile.h presence... yes checking for sys/sendfile.h... yes checking execinfo.h usability... yes checking execinfo.h presence... yes checking for execinfo.h... yes checking ucontext.h usability... yes checking ucontext.h presence... yes checking for ucontext.h... yes checking sys/syscall.h usability... yes checking sys/syscall.h presence... yes checking for sys/syscall.h... yes checking pthread.h usability... yes checking pthread.h presence... yes checking for pthread.h... yes checking linux/videodev.h usability... no checking linux/videodev.h presence... no checking for linux/videodev.h... no checking linux/videodev2.h usability... yes checking linux/videodev2.h presence... yes checking for linux/videodev2.h... yes checking jpeglib.h usability... yes checking jpeglib.h presence... yes checking for jpeglib.h... yes checking mysql/mysql.h usability... yes checking mysql/mysql.h presence... yes checking for mysql/mysql.h... yes checking how to run the C preprocessor... i686-pld-linux-gcc -E checking libavutil/avutil.h usability... yes checking libavutil/avutil.h presence... yes checking for libavutil/avutil.h... yes checking libavcodec/avcodec.h usability... yes checking libavcodec/avcodec.h presence... yes checking for libavcodec/avcodec.h... yes checking libavformat/avformat.h usability... yes checking libavformat/avformat.h presence... yes checking for libavformat/avformat.h... yes checking libswscale/swscale.h usability... yes checking libswscale/swscale.h presence... yes checking for libswscale/swscale.h... yes checking pcre/pcre.h usability... no checking pcre/pcre.h presence... no checking for pcre/pcre.h... no checking pcre.h usability... yes checking pcre.h presence... yes checking for pcre.h... yes checking sys/mman.h usability... yes checking sys/mman.h presence... yes checking for sys/mman.h... yes checking for fcntl.h... (cached) yes checking zlib.h usability... yes checking zlib.h presence... yes checking for zlib.h... yes checking vlc/vlc.h usability... yes checking vlc/vlc.h presence... yes checking for vlc/vlc.h... yes checking curl/curl.h usability... yes checking curl/curl.h presence... yes checking for curl/curl.h... yes checking whether MD5 is declared... yes checking whether backtrace is declared... yes checking whether backtrace_symbols is declared... yes checking for perl... perl checking for perl version greater than or equal to 5.6.0... ok checking for perl module Sys::Syslog... ok checking for perl module DBI... ok checking for perl module DBD::mysql... ok checking for perl module Getopt::Long... ok checking for perl module Time::HiRes... ok checking for perl module Date::Manip... ok checking for perl module LWP::UserAgent... ok checking for perl module ExtUtils::MakeMaker... ok checking for perl module Sys::Mmap... ok checking for perl module Module::Load... ok checking for perl module Device::SerialPort... ok checking for perl module Net::FTP... ok checking for perl module Net::SFTP::Foreign... ok checking for perl module Expect... ok checking for perl module Archive::Tar... ok checking for perl module Archive::Zip... ok checking for perl module Net::SMTP... ok checking for perl module MIME::Lite... no configure: WARNING: MIME::Lite may be required for automatic event email notification checking for perl module MIME::Entity... ok checking for perl module X10::ActiveHome... no configure: WARNING: X10::ActiveHome is required for X.10 support checking that generated files are newer than configure... done configure: creating ./config.status config.status: creating Makefile config.status: creating zm.conf config.status: creating zmconfgen.pl config.status: creating db/Makefile config.status: creating db/zm_create.sql config.status: creating misc/Makefile config.status: creating misc/apache.conf config.status: creating misc/logrotate.conf config.status: creating misc/syslog.conf config.status: creating misc/com.zoneminder.systemctl.policy config.status: creating misc/com.zoneminder.systemctl.rules config.status: creating scripts/Makefile config.status: creating scripts/zm config.status: creating scripts/zmaudit.pl config.status: creating scripts/zmcontrol.pl config.status: creating scripts/zmdc.pl config.status: creating scripts/zmfilter.pl config.status: creating scripts/zmpkg.pl config.status: creating scripts/zmtrack.pl config.status: creating scripts/zmcamtool.pl config.status: creating scripts/zmsystemctl.pl config.status: creating scripts/zmtrigger.pl config.status: creating scripts/zmupdate.pl config.status: creating scripts/zmvideo.pl config.status: creating scripts/zmwatch.pl config.status: creating scripts/zmx10.pl config.status: creating scripts/zmdbbackup config.status: creating scripts/zmdbrestore config.status: creating scripts/zmeventdump config.status: creating scripts/zmlogrotate.conf config.status: creating scripts/ZoneMinder/lib/ZoneMinder/Base.pm config.status: creating scripts/ZoneMinder/lib/ZoneMinder/Config.pm config.status: creating scripts/ZoneMinder/lib/ZoneMinder/Memory.pm config.status: creating scripts/ZoneMinder/lib/ZoneMinder/ConfigData.pm config.status: creating src/Makefile config.status: creating src/zm_config.h config.status: creating web/Makefile config.status: creating web/ajax/Makefile config.status: creating web/css/Makefile config.status: creating web/graphics/Makefile config.status: creating web/includes/Makefile config.status: creating web/includes/config.php config.status: creating web/js/Makefile config.status: creating web/lang/Makefile config.status: creating web/skins/Makefile config.status: creating web/skins/classic/Makefile config.status: creating web/skins/classic/ajax/Makefile config.status: creating web/skins/classic/css/Makefile config.status: creating web/skins/classic/graphics/Makefile config.status: creating web/skins/classic/includes/Makefile config.status: creating web/skins/classic/js/Makefile config.status: creating web/skins/classic/lang/Makefile config.status: creating web/skins/classic/views/Makefile config.status: creating web/skins/classic/views/css/Makefile config.status: creating web/skins/classic/views/js/Makefile config.status: creating web/skins/mobile/Makefile config.status: creating web/skins/mobile/ajax/Makefile config.status: creating web/skins/mobile/css/Makefile config.status: creating web/skins/mobile/graphics/Makefile config.status: creating web/skins/mobile/includes/Makefile config.status: creating web/skins/mobile/lang/Makefile config.status: creating web/skins/mobile/views/Makefile config.status: creating web/skins/mobile/views/css/Makefile config.status: creating web/tools/Makefile config.status: creating web/tools/mootools/Makefile config.status: creating web/views/Makefile config.status: creating web/skins/xml/Makefile config.status: creating web/skins/xml/views/Makefile config.status: creating web/skins/xml/includes/Makefile config.status: creating web/skins/flat/Makefile config.status: creating web/skins/flat/ajax/Makefile config.status: creating web/skins/flat/css/Makefile config.status: creating web/skins/flat/graphics/Makefile config.status: creating web/skins/flat/includes/Makefile config.status: creating web/skins/flat/js/Makefile config.status: creating web/skins/flat/lang/Makefile config.status: creating web/skins/flat/views/Makefile config.status: creating web/skins/flat/views/css/Makefile config.status: creating web/skins/flat/views/js/Makefile config.status: creating config.h config.status: executing depfiles commands config.status: executing src/zm_config_defines.h commands Generating 'src/zm_config_defines.h' Updating 'db/zm_create.sql' config.status: executing scripts/ZoneMinder/Makefile commands perl Makefile.PL PREFIX=/usr Checking if your kit is complete... Looks good Generating a Unix-style Makefile Writing Makefile for ZoneMinder Writing MYMETA.yml and MYMETA.json + /usr/bin/make -Otarget -j9 (CDPATH="${ZSH_VERSION+.}:" && cd . && /bin/sh /tmp/B._6255T/BUILD/ZoneMinder-1.28.0/missing autoheader) rm -f stamp-h1 touch config.h.in cd . && /bin/sh ./config.status config.h config.status: creating config.h /usr/bin/make all-recursive Making all in src make[2]: Entering directory '/tmp/B._6255T/BUILD/ZoneMinder-1.28.0/src' i686-pld-linux-g++ -DHAVE_CONFIG_H -I. -I.. -I/usr/include -I/usr/include -Iyes/include -D__STDC_CONSTANT_MACROS -Wall -finline-functions -fomit-frame-pointer -Iyes/include -D__STDC_CONSTANT_MACROS -D__STDC_CONSTANT_MACROS -O2 -fwrapv -pipe -Wformat -Werror=format-security -gdwarf-4 -fno-debug-types-section -fvar-tracking-assignments -g2 -Wp,-D_FORTIFY_SOURCE=2 -D__STDC_CONSTANT_MACROS -fstack-protector-strong --param=ssp-buffer-size=4 -fomit-frame-pointer -march=i686 -fasynchronous-unwind-tables -mtune=pentium4 -gdwarf-4 -fno-debug-types-section -fvar-tracking-assignments -g2 -MT zm_coord.o -MD -MP -MF .deps/zm_coord.Tpo -c -o zm_coord.o zm_coord.cpp mv -f .deps/zm_coord.Tpo .deps/zm_coord.Po make[2]: Leaving directory '/tmp/B._6255T/BUILD/ZoneMinder-1.28.0/src' make[2]: Entering directory '/tmp/B._6255T/BUILD/ZoneMinder-1.28.0/src' i686-pld-linux-g++ -DHAVE_CONFIG_H -I. -I.. -I/usr/include -I/usr/include -Iyes/include -D__STDC_CONSTANT_MACROS -Wall -finline-functions -fomit-frame-pointer -Iyes/include -D__STDC_CONSTANT_MACROS -D__STDC_CONSTANT_MACROS -O2 -fwrapv -pipe -Wformat -Werror=format-security -gdwarf-4 -fno-debug-types-section -fvar-tracking-assignments -g2 -Wp,-D_FORTIFY_SOURCE=2 -D__STDC_CONSTANT_MACROS -fstack-protector-strong --param=ssp-buffer-size=4 -fomit-frame-pointer -march=i686 -fasynchronous-unwind-tables -mtune=pentium4 -gdwarf-4 -fno-debug-types-section -fvar-tracking-assignments -g2 -MT zm_buffer.o -MD -MP -MF .deps/zm_buffer.Tpo -c -o zm_buffer.o zm_buffer.cpp In file included from zm_buffer.cpp:23:0: zm_buffer.h: In member function 'void Buffer::tidy(bool)': zm_buffer.h:156:39: warning: comparison between signed and unsigned integer expressions [-Wsign-compare] if ( (mHead-mStorage) > mSize ) ~~~~~~~~~~~~~~~~~^~~~~~~ zm_buffer.h:162:33: warning: comparison of constant '2' with boolean expression is always false [-Wbool-compare] else if ( level >= 2 ) ~~~~~~^~~~ mv -f .deps/zm_buffer.Tpo .deps/zm_buffer.Po make[2]: Leaving directory '/tmp/B._6255T/BUILD/ZoneMinder-1.28.0/src' make[2]: Entering directory '/tmp/B._6255T/BUILD/ZoneMinder-1.28.0/src' i686-pld-linux-g++ -DHAVE_CONFIG_H -I. -I.. -I/usr/include -I/usr/include -Iyes/include -D__STDC_CONSTANT_MACROS -Wall -finline-functions -fomit-frame-pointer -Iyes/include -D__STDC_CONSTANT_MACROS -D__STDC_CONSTANT_MACROS -O2 -fwrapv -pipe -Wformat -Werror=format-security -gdwarf-4 -fno-debug-types-section -fvar-tracking-assignments -g2 -Wp,-D_FORTIFY_SOURCE=2 -D__STDC_CONSTANT_MACROS -fstack-protector-strong --param=ssp-buffer-size=4 -fomit-frame-pointer -march=i686 -fasynchronous-unwind-tables -mtune=pentium4 -gdwarf-4 -fno-debug-types-section -fvar-tracking-assignments -g2 -MT zm_box.o -MD -MP -MF .deps/zm_box.Tpo -c -o zm_box.o zm_box.cpp mv -f .deps/zm_box.Tpo .deps/zm_box.Po make[2]: Leaving directory '/tmp/B._6255T/BUILD/ZoneMinder-1.28.0/src' make[2]: Entering directory '/tmp/B._6255T/BUILD/ZoneMinder-1.28.0/src' i686-pld-linux-g++ -DHAVE_CONFIG_H -I. -I.. -I/usr/include -I/usr/include -Iyes/include -D__STDC_CONSTANT_MACROS -Wall -finline-functions -fomit-frame-pointer -Iyes/include -D__STDC_CONSTANT_MACROS -D__STDC_CONSTANT_MACROS -O2 -fwrapv -pipe -Wformat -Werror=format-security -gdwarf-4 -fno-debug-types-section -fvar-tracking-assignments -g2 -Wp,-D_FORTIFY_SOURCE=2 -D__STDC_CONSTANT_MACROS -fstack-protector-strong --param=ssp-buffer-size=4 -fomit-frame-pointer -march=i686 -fasynchronous-unwind-tables -mtune=pentium4 -gdwarf-4 -fno-debug-types-section -fvar-tracking-assignments -g2 -MT zm_curl_camera.o -MD -MP -MF .deps/zm_curl_camera.Tpo -c -o zm_curl_camera.o zm_curl_camera.cpp In file included from /usr/lib/gcc/i686-pld-linux/6.3.0/include/limits.h:168:0, from /usr/lib/gcc/i686-pld-linux/6.3.0/include/syslimits.h:7, from /usr/lib/gcc/i686-pld-linux/6.3.0/include/limits.h:34, from /usr/include/zconf.h:418, from /usr/include/zlib.h:34, from zm_image.h:38, from zm_camera.h:26, from zm_curl_camera.h:25, from zm_curl_camera.cpp:21: zm_image.h:125:25: error: expected identifier before numeric constant enum { CHAR_HEIGHT=11, CHAR_WIDTH=6 }; ^ zm_image.h:125:25: error: expected '}' before numeric constant zm_image.h:125:25: error: expected unqualified-id before numeric constant In file included from zm_camera.h:26:0, from zm_curl_camera.h:25, from zm_curl_camera.cpp:21: zm_image.h: In member function 'void Image::DumpImgBuffer()': zm_image.h:110:14: error: 'buffer' was not declared in this scope DumpBuffer(buffer,buffertype); ^~~~~~ zm_image.h:110:21: error: 'buffertype' was not declared in this scope DumpBuffer(buffer,buffertype); ^~~~~~~~~~ zm_image.h:112:3: error: 'allocation' was not declared in this scope allocation = 0; ^~~~~~~~~~ zm_image.h: In member function 'void Image::AllocImgBuffer(size_t)': zm_image.h:116:6: error: 'buffer' was not declared in this scope if(buffer) ^~~~~~ zm_image.h:119:3: error: 'buffer' was not declared in this scope buffer = AllocBuffer(p_bufsize); ^~~~~~ zm_image.h:120:3: error: 'buffertype' was not declared in this scope buffertype = ZM_BUFTYPE_ZM; ^~~~~~~~~~ zm_image.h:121:3: error: 'allocation' was not declared in this scope allocation = p_bufsize; ^~~~~~~~~~ zm_image.h: At global scope: zm_image.h:126:21: error: 'CHAR_HEIGHT' was not declared in this scope enum { LINE_HEIGHT=CHAR_HEIGHT+0 }; ^~~~~~~~~~~ zm_image.h:128:1: error: expected unqualified-id before 'protected' protected: ^~~~~~~~~ zm_image.h:138:1: error: expected unqualified-id before 'protected' protected: ^~~~~~~~~ zm_image.h:151:1: error: expected unqualified-id before 'protected' protected: ^~~~~~~~~ zm_image.h:154:1: error: expected unqualified-id before 'public' public: ^~~~~~ zm_image.h:156:9: error: expected unqualified-id before 'const' Image( const char *filename ); ^~~~~ zm_image.h:156:9: error: expected ')' before 'const' zm_image.h:157:9: error: expected unqualified-id before 'int' Image( int p_width, int p_height, int p_colours, int p_subpixelorder, uint8_t *p_buffer=0); ^~~ zm_image.h:157:9: error: expected ')' before 'int' zm_image.h:158:9: error: expected unqualified-id before 'const' Image( const Image &p_image ); ^~~~~ zm_image.h:158:9: error: expected ')' before 'const' zm_image.h:159:10: error: expected constructor, destructor, or type conversion before ';' token ~Image(); ^ zm_image.h:161:30: error: non-member function 'unsigned int Width()' cannot have cv-qualifier inline unsigned int Width() const { return( width ); } ^~~~~ zm_image.h: In function 'unsigned int Width()': zm_image.h:161:46: error: 'width' was not declared in this scope inline unsigned int Width() const { return( width ); } ^~~~~ zm_image.h: At global scope: zm_image.h:162:31: error: non-member function 'unsigned int Height()' cannot have cv-qualifier inline unsigned int Height() const { return( height ); } ^~~~~ zm_image.h:163:31: error: non-member function 'unsigned int Pixels()' cannot have cv-qualifier inline unsigned int Pixels() const { return( pixels ); } ^~~~~ zm_image.h:164:32: error: non-member function 'unsigned int Colours()' cannot have cv-qualifier inline unsigned int Colours() const { return( colours ); } ^~~~~ zm_image.h:165:38: error: non-member function 'unsigned int SubpixelOrder()' cannot have cv-qualifier inline unsigned int SubpixelOrder() const { return( subpixelorder ); } ^~~~~ zm_image.h:166:29: error: non-member function 'unsigned int Size()' cannot have cv-qualifier inline unsigned int Size() const { return( size ); } ^~~~~ zm_image.h:169:33: error: non-member function 'const uint8_t* Buffer()' cannot have cv-qualifier inline const uint8_t* Buffer() const { return( buffer ); } ^~~~~ zm_image.h:170:68: error: non-member function 'const uint8_t* Buffer(unsigned int, unsigned int)' cannot have cv-qualifier inline const uint8_t* Buffer( unsigned int x, unsigned int y= 0 ) const { return( &buffer[colours*((y*width)+x)] ); } ^~~~~ zm_image.h: In function 'const uint8_t* Buffer(unsigned int, unsigned int)': zm_image.h:170:104: error: 'width' was not declared in this scope inline const uint8_t* Buffer( unsigned int x, unsigned int y= 0 ) const { return( &buffer[colours*((y*width)+x)] ); } ^~~~~ In file included from zm_camera.h:26:0, from zm_curl_camera.h:25, from zm_curl_camera.cpp:21: zm_image.h: At global scope: zm_image.h:174:28: error: non-member function 'int IsBufferHeld()' cannot have cv-qualifier inline int IsBufferHeld() const { return holdbuffer; } ^~~~~ zm_image.h: In function 'void Empty()': zm_image.h:179:17: error: 'DumpImgBuffer' was not declared in this scope DumpImgBuffer(); ^ zm_image.h:181:2: error: 'width' was not declared in this scope width = height = colours = size = pixels = subpixelorder = 0; ^~~~~ zm_image.h: At global scope: zm_image.h:192:46: error: 'Image& operator=(const Image&)' must be a nonstatic member function inline Image &operator=( const Image &image ) ^ zm_image.h:197:59: error: 'Image& operator=(const unsigned char*)' must be a nonstatic member function inline Image &operator=( const unsigned char *new_buffer ) ^ zm_image.h:204:40: error: non-member function 'bool WriteRaw(const char*)' cannot have cv-qualifier bool WriteRaw( const char *filename ) const; ^~~~~ zm_image.h:207:65: error: non-member function 'bool WriteJpeg(const char*, int)' cannot have cv-qualifier bool WriteJpeg( const char *filename, int quality_override=0 ) const; ^~~~~ zm_image.h:209:84: error: non-member function 'bool EncodeJpeg(JOCTET*, int*, int)' cannot have cv-qualifier bool EncodeJpeg( JOCTET *outbuffer, int *outbuffer_size, int quality_override=0 ) const; ^~~~~ zm_image.h:213:98: error: non-member function 'bool Zip(Bytef*, long unsigned int*, int)' cannot have cv-qualifier bool Zip( Bytef *outbuffer, unsigned long *outbuffer_size, int compression_level=Z_BEST_SPEED ) const; ^~~~~ zm_image.h:226:54: error: non-member function 'void Delta(const Image&, Image*)' cannot have cv-qualifier void Delta( const Image &image, Image* targetimage) const; ^~~~~ zm_image.h:228:46: error: non-member function 'const Coord centreCoord(const char*)' cannot have cv-qualifier const Coord centreCoord( const char *text ) const; ^~~~~ zm_image.h:253:1: error: expected declaration before '}' token }; ^ zm_image.h:222:16: warning: 'Image* Merge(unsigned int, Image**)' declared 'static' but never defined [-Wunused-function] static Image *Merge( unsigned int n_images, Image *images[] ); ^~~~~ zm_image.h:223:16: warning: 'Image* Merge(unsigned int, Image**, double)' declared 'static' but never defined [-Wunused-function] static Image *Merge( unsigned int n_images, Image *images[], double weight ); ^~~~~ zm_image.h:224:16: warning: 'Image* Highlight(unsigned int, Image**, Rgb, Rgb)' declared 'static' but never defined [-Wunused-function] static Image *Highlight( unsigned int n_images, Image *images[], const Rgb threshold=RGB_BLACK, const Rgb ref_colour=RGB_RED ); ^~~~~~~~~ In file included from zm_camera.h:26:0, from zm_curl_camera.h:25, from zm_curl_camera.cpp:21: zm_image.h:136:29: warning: 'jpg_err' defined but not used [-Wunused-variable] static struct zm_error_mgr jpg_err; ^~~~~~~ zm_image.h:135:33: warning: 'jpg_dcinfo' defined but not used [-Wunused-variable] static jpeg_decompress_struct *jpg_dcinfo; ^~~~~~~~~~ zm_image.h:134:31: warning: 'jpg_ccinfo' defined but not used [-Wunused-variable] static jpeg_compress_struct *jpg_ccinfo[101]; ^~~~~~~~~~ zm_image.h:133:24: warning: 'y_b_table' defined but not used [-Wunused-variable] static unsigned char *y_b_table; ^~~~~~~~~ zm_image.h:132:24: warning: 'y_g_table' defined but not used [-Wunused-variable] static unsigned char *y_g_table; ^~~~~~~~~ zm_image.h:131:24: warning: 'y_r_table' defined but not used [-Wunused-variable] static unsigned char *y_r_table; ^~~~~~~~~ zm_image.h:130:24: warning: 'abs_table' defined but not used [-Wunused-variable] static unsigned char *abs_table; ^~~~~~~~~ make[2]: *** [Makefile:634: zm_curl_camera.o] Error 1 make[2]: Leaving directory '/tmp/B._6255T/BUILD/ZoneMinder-1.28.0/src' make[2]: *** Waiting for unfinished jobs.... make[2]: Entering directory '/tmp/B._6255T/BUILD/ZoneMinder-1.28.0/src' i686-pld-linux-g++ -DHAVE_CONFIG_H -I. -I.. -I/usr/include -I/usr/include -Iyes/include -D__STDC_CONSTANT_MACROS -Wall -finline-functions -fomit-frame-pointer -Iyes/include -D__STDC_CONSTANT_MACROS -D__STDC_CONSTANT_MACROS -O2 -fwrapv -pipe -Wformat -Werror=format-security -gdwarf-4 -fno-debug-types-section -fvar-tracking-assignments -g2 -Wp,-D_FORTIFY_SOURCE=2 -D__STDC_CONSTANT_MACROS -fstack-protector-strong --param=ssp-buffer-size=4 -fomit-frame-pointer -march=i686 -fasynchronous-unwind-tables -mtune=pentium4 -gdwarf-4 -fno-debug-types-section -fvar-tracking-assignments -g2 -MT zm_camera.o -MD -MP -MF .deps/zm_camera.Tpo -c -o zm_camera.o zm_camera.cpp In file included from /usr/lib/gcc/i686-pld-linux/6.3.0/include/limits.h:168:0, from /usr/lib/gcc/i686-pld-linux/6.3.0/include/syslimits.h:7, from /usr/lib/gcc/i686-pld-linux/6.3.0/include/limits.h:34, from /usr/include/zconf.h:418, from /usr/include/zlib.h:34, from zm_image.h:38, from zm_camera.h:26, from zm_camera.cpp:21: zm_image.h:125:25: error: expected identifier before numeric constant enum { CHAR_HEIGHT=11, CHAR_WIDTH=6 }; ^ zm_image.h:125:25: error: expected '}' before numeric constant zm_image.h:125:25: error: expected unqualified-id before numeric constant In file included from zm_camera.h:26:0, from zm_camera.cpp:21: zm_image.h: In member function 'void Image::DumpImgBuffer()': zm_image.h:110:14: error: 'buffer' was not declared in this scope DumpBuffer(buffer,buffertype); ^~~~~~ zm_image.h:110:21: error: 'buffertype' was not declared in this scope DumpBuffer(buffer,buffertype); ^~~~~~~~~~ zm_image.h:112:3: error: 'allocation' was not declared in this scope allocation = 0; ^~~~~~~~~~ zm_image.h: In member function 'void Image::AllocImgBuffer(size_t)': zm_image.h:116:6: error: 'buffer' was not declared in this scope if(buffer) ^~~~~~ zm_image.h:119:3: error: 'buffer' was not declared in this scope buffer = AllocBuffer(p_bufsize); ^~~~~~ zm_image.h:120:3: error: 'buffertype' was not declared in this scope buffertype = ZM_BUFTYPE_ZM; ^~~~~~~~~~ zm_image.h:121:3: error: 'allocation' was not declared in this scope allocation = p_bufsize; ^~~~~~~~~~ zm_image.h: At global scope: zm_image.h:126:21: error: 'CHAR_HEIGHT' was not declared in this scope enum { LINE_HEIGHT=CHAR_HEIGHT+0 }; ^~~~~~~~~~~ zm_image.h:128:1: error: expected unqualified-id before 'protected' protected: ^~~~~~~~~ zm_image.h:138:1: error: expected unqualified-id before 'protected' protected: ^~~~~~~~~ zm_image.h:151:1: error: expected unqualified-id before 'protected' protected: ^~~~~~~~~ zm_image.h:154:1: error: expected unqualified-id before 'public' public: ^~~~~~ zm_image.h:156:9: error: expected unqualified-id before 'const' Image( const char *filename ); ^~~~~ zm_image.h:156:9: error: expected ')' before 'const' zm_image.h:157:9: error: expected unqualified-id before 'int' Image( int p_width, int p_height, int p_colours, int p_subpixelorder, uint8_t *p_buffer=0); ^~~ zm_image.h:157:9: error: expected ')' before 'int' zm_image.h:158:9: error: expected unqualified-id before 'const' Image( const Image &p_image ); ^~~~~ zm_image.h:158:9: error: expected ')' before 'const' zm_image.h:159:10: error: expected constructor, destructor, or type conversion before ';' token ~Image(); ^ zm_image.h:161:30: error: non-member function 'unsigned int Width()' cannot have cv-qualifier inline unsigned int Width() const { return( width ); } ^~~~~ zm_image.h: In function 'unsigned int Width()': zm_image.h:161:46: error: 'width' was not declared in this scope inline unsigned int Width() const { return( width ); } ^~~~~ zm_image.h: At global scope: zm_image.h:162:31: error: non-member function 'unsigned int Height()' cannot have cv-qualifier inline unsigned int Height() const { return( height ); } ^~~~~ zm_image.h:163:31: error: non-member function 'unsigned int Pixels()' cannot have cv-qualifier inline unsigned int Pixels() const { return( pixels ); } ^~~~~ zm_image.h:164:32: error: non-member function 'unsigned int Colours()' cannot have cv-qualifier inline unsigned int Colours() const { return( colours ); } ^~~~~ zm_image.h:165:38: error: non-member function 'unsigned int SubpixelOrder()' cannot have cv-qualifier inline unsigned int SubpixelOrder() const { return( subpixelorder ); } ^~~~~ zm_image.h:166:29: error: non-member function 'unsigned int Size()' cannot have cv-qualifier inline unsigned int Size() const { return( size ); } ^~~~~ zm_image.h:169:33: error: non-member function 'const uint8_t* Buffer()' cannot have cv-qualifier inline const uint8_t* Buffer() const { return( buffer ); } ^~~~~ zm_image.h:170:68: error: non-member function 'const uint8_t* Buffer(unsigned int, unsigned int)' cannot have cv-qualifier inline const uint8_t* Buffer( unsigned int x, unsigned int y= 0 ) const { return( &buffer[colours*((y*width)+x)] ); } ^~~~~ zm_image.h: In function 'const uint8_t* Buffer(unsigned int, unsigned int)': zm_image.h:170:104: error: 'width' was not declared in this scope inline const uint8_t* Buffer( unsigned int x, unsigned int y= 0 ) const { return( &buffer[colours*((y*width)+x)] ); } ^~~~~ In file included from zm_camera.h:26:0, from zm_camera.cpp:21: zm_image.h: At global scope: zm_image.h:174:28: error: non-member function 'int IsBufferHeld()' cannot have cv-qualifier inline int IsBufferHeld() const { return holdbuffer; } ^~~~~ zm_image.h: In function 'void Empty()': zm_image.h:179:17: error: 'DumpImgBuffer' was not declared in this scope DumpImgBuffer(); ^ zm_image.h:181:2: error: 'width' was not declared in this scope width = height = colours = size = pixels = subpixelorder = 0; ^~~~~ zm_image.h: At global scope: zm_image.h:192:46: error: 'Image& operator=(const Image&)' must be a nonstatic member function inline Image &operator=( const Image &image ) ^ zm_image.h:197:59: error: 'Image& operator=(const unsigned char*)' must be a nonstatic member function inline Image &operator=( const unsigned char *new_buffer ) ^ zm_image.h:204:40: error: non-member function 'bool WriteRaw(const char*)' cannot have cv-qualifier bool WriteRaw( const char *filename ) const; ^~~~~ zm_image.h:207:65: error: non-member function 'bool WriteJpeg(const char*, int)' cannot have cv-qualifier bool WriteJpeg( const char *filename, int quality_override=0 ) const; ^~~~~ zm_image.h:209:84: error: non-member function 'bool EncodeJpeg(JOCTET*, int*, int)' cannot have cv-qualifier bool EncodeJpeg( JOCTET *outbuffer, int *outbuffer_size, int quality_override=0 ) const; ^~~~~ zm_image.h:213:98: error: non-member function 'bool Zip(Bytef*, long unsigned int*, int)' cannot have cv-qualifier bool Zip( Bytef *outbuffer, unsigned long *outbuffer_size, int compression_level=Z_BEST_SPEED ) const; ^~~~~ zm_image.h:226:54: error: non-member function 'void Delta(const Image&, Image*)' cannot have cv-qualifier void Delta( const Image &image, Image* targetimage) const; ^~~~~ zm_image.h:228:46: error: non-member function 'const Coord centreCoord(const char*)' cannot have cv-qualifier const Coord centreCoord( const char *text ) const; ^~~~~ zm_image.h:253:1: error: expected declaration before '}' token }; ^ zm_image.h:222:16: warning: 'Image* Merge(unsigned int, Image**)' declared 'static' but never defined [-Wunused-function] static Image *Merge( unsigned int n_images, Image *images[] ); ^~~~~ zm_image.h:223:16: warning: 'Image* Merge(unsigned int, Image**, double)' declared 'static' but never defined [-Wunused-function] static Image *Merge( unsigned int n_images, Image *images[], double weight ); ^~~~~ zm_image.h:224:16: warning: 'Image* Highlight(unsigned int, Image**, Rgb, Rgb)' declared 'static' but never defined [-Wunused-function] static Image *Highlight( unsigned int n_images, Image *images[], const Rgb threshold=RGB_BLACK, const Rgb ref_colour=RGB_RED ); ^~~~~~~~~ In file included from zm_camera.h:26:0, from zm_camera.cpp:21: zm_image.h:136:29: warning: 'jpg_err' defined but not used [-Wunused-variable] static struct zm_error_mgr jpg_err; ^~~~~~~ zm_image.h:135:33: warning: 'jpg_dcinfo' defined but not used [-Wunused-variable] static jpeg_decompress_struct *jpg_dcinfo; ^~~~~~~~~~ zm_image.h:134:31: warning: 'jpg_ccinfo' defined but not used [-Wunused-variable] static jpeg_compress_struct *jpg_ccinfo[101]; ^~~~~~~~~~ zm_image.h:133:24: warning: 'y_b_table' defined but not used [-Wunused-variable] static unsigned char *y_b_table; ^~~~~~~~~ zm_image.h:132:24: warning: 'y_g_table' defined but not used [-Wunused-variable] static unsigned char *y_g_table; ^~~~~~~~~ zm_image.h:131:24: warning: 'y_r_table' defined but not used [-Wunused-variable] static unsigned char *y_r_table; ^~~~~~~~~ zm_image.h:130:24: warning: 'abs_table' defined but not used [-Wunused-variable] static unsigned char *abs_table; ^~~~~~~~~ make[2]: *** [Makefile:634: zm_camera.o] Error 1 make[2]: Leaving directory '/tmp/B._6255T/BUILD/ZoneMinder-1.28.0/src' make[2]: Entering directory '/tmp/B._6255T/BUILD/ZoneMinder-1.28.0/src' i686-pld-linux-g++ -DHAVE_CONFIG_H -I. -I.. -I/usr/include -I/usr/include -Iyes/include -D__STDC_CONSTANT_MACROS -Wall -finline-functions -fomit-frame-pointer -Iyes/include -D__STDC_CONSTANT_MACROS -D__STDC_CONSTANT_MACROS -O2 -fwrapv -pipe -Wformat -Werror=format-security -gdwarf-4 -fno-debug-types-section -fvar-tracking-assignments -g2 -Wp,-D_FORTIFY_SOURCE=2 -D__STDC_CONSTANT_MACROS -fstack-protector-strong --param=ssp-buffer-size=4 -fomit-frame-pointer -march=i686 -fasynchronous-unwind-tables -mtune=pentium4 -gdwarf-4 -fno-debug-types-section -fvar-tracking-assignments -g2 -MT zm.o -MD -MP -MF .deps/zm.Tpo -c -o zm.o zm.cpp mv -f .deps/zm.Tpo .deps/zm.Po make[2]: Leaving directory '/tmp/B._6255T/BUILD/ZoneMinder-1.28.0/src' make[2]: Entering directory '/tmp/B._6255T/BUILD/ZoneMinder-1.28.0/src' i686-pld-linux-g++ -DHAVE_CONFIG_H -I. -I.. -I/usr/include -I/usr/include -Iyes/include -D__STDC_CONSTANT_MACROS -Wall -finline-functions -fomit-frame-pointer -Iyes/include -D__STDC_CONSTANT_MACROS -D__STDC_CONSTANT_MACROS -O2 -fwrapv -pipe -Wformat -Werror=format-security -gdwarf-4 -fno-debug-types-section -fvar-tracking-assignments -g2 -Wp,-D_FORTIFY_SOURCE=2 -D__STDC_CONSTANT_MACROS -fstack-protector-strong --param=ssp-buffer-size=4 -fomit-frame-pointer -march=i686 -fasynchronous-unwind-tables -mtune=pentium4 -gdwarf-4 -fno-debug-types-section -fvar-tracking-assignments -g2 -MT zmc.o -MD -MP -MF .deps/zmc.Tpo -c -o zmc.o zmc.cpp In file included from /usr/lib/gcc/i686-pld-linux/6.3.0/include/limits.h:168:0, from /usr/lib/gcc/i686-pld-linux/6.3.0/include/syslimits.h:7, from /usr/lib/gcc/i686-pld-linux/6.3.0/include/limits.h:34, from /usr/include/values.h:27, from zmc.cpp:22: zm_image.h:125:25: error: expected identifier before numeric constant enum { CHAR_HEIGHT=11, CHAR_WIDTH=6 }; ^ zm_image.h:125:25: error: expected '}' before numeric constant zm_image.h:125:25: error: expected unqualified-id before numeric constant In file included from zm_monitor.h:28:0, from zmc.cpp:28: zm_image.h: In member function 'void Image::DumpImgBuffer()': zm_image.h:110:14: error: 'buffer' was not declared in this scope DumpBuffer(buffer,buffertype); ^~~~~~ zm_image.h:110:21: error: 'buffertype' was not declared in this scope DumpBuffer(buffer,buffertype); ^~~~~~~~~~ zm_image.h:112:3: error: 'allocation' was not declared in this scope allocation = 0; ^~~~~~~~~~ zm_image.h: In member function 'void Image::AllocImgBuffer(size_t)': zm_image.h:116:6: error: 'buffer' was not declared in this scope if(buffer) ^~~~~~ zm_image.h:119:3: error: 'buffer' was not declared in this scope buffer = AllocBuffer(p_bufsize); ^~~~~~ zm_image.h:120:3: error: 'buffertype' was not declared in this scope buffertype = ZM_BUFTYPE_ZM; ^~~~~~~~~~ zm_image.h:121:3: error: 'allocation' was not declared in this scope allocation = p_bufsize; ^~~~~~~~~~ zm_image.h: At global scope: zm_image.h:126:21: error: 'CHAR_HEIGHT' was not declared in this scope enum { LINE_HEIGHT=CHAR_HEIGHT+0 }; ^~~~~~~~~~~ zm_image.h:128:1: error: expected unqualified-id before 'protected' protected: ^~~~~~~~~ zm_image.h:138:1: error: expected unqualified-id before 'protected' protected: ^~~~~~~~~ zm_image.h:151:1: error: expected unqualified-id before 'protected' protected: ^~~~~~~~~ zm_image.h:154:1: error: expected unqualified-id before 'public' public: ^~~~~~ zm_image.h:156:9: error: expected unqualified-id before 'const' Image( const char *filename ); ^~~~~ zm_image.h:156:9: error: expected ')' before 'const' zm_image.h:157:9: error: expected unqualified-id before 'int' Image( int p_width, int p_height, int p_colours, int p_subpixelorder, uint8_t *p_buffer=0); ^~~ zm_image.h:157:9: error: expected ')' before 'int' zm_image.h:158:9: error: expected unqualified-id before 'const' Image( const Image &p_image ); ^~~~~ zm_image.h:158:9: error: expected ')' before 'const' zm_image.h:159:10: error: expected constructor, destructor, or type conversion before ';' token ~Image(); ^ zm_image.h:161:30: error: non-member function 'unsigned int Width()' cannot have cv-qualifier inline unsigned int Width() const { return( width ); } ^~~~~ zm_image.h: In function 'unsigned int Width()': zm_image.h:161:46: error: 'width' was not declared in this scope inline unsigned int Width() const { return( width ); } ^~~~~ zm_image.h: At global scope: zm_image.h:162:31: error: non-member function 'unsigned int Height()' cannot have cv-qualifier inline unsigned int Height() const { return( height ); } ^~~~~ zm_image.h:163:31: error: non-member function 'unsigned int Pixels()' cannot have cv-qualifier inline unsigned int Pixels() const { return( pixels ); } ^~~~~ zm_image.h:164:32: error: non-member function 'unsigned int Colours()' cannot have cv-qualifier inline unsigned int Colours() const { return( colours ); } ^~~~~ zm_image.h:165:38: error: non-member function 'unsigned int SubpixelOrder()' cannot have cv-qualifier inline unsigned int SubpixelOrder() const { return( subpixelorder ); } ^~~~~ zm_image.h:166:29: error: non-member function 'unsigned int Size()' cannot have cv-qualifier inline unsigned int Size() const { return( size ); } ^~~~~ zm_image.h:169:33: error: non-member function 'const uint8_t* Buffer()' cannot have cv-qualifier inline const uint8_t* Buffer() const { return( buffer ); } ^~~~~ zm_image.h:170:68: error: non-member function 'const uint8_t* Buffer(unsigned int, unsigned int)' cannot have cv-qualifier inline const uint8_t* Buffer( unsigned int x, unsigned int y= 0 ) const { return( &buffer[colours*((y*width)+x)] ); } ^~~~~ zm_image.h: In function 'const uint8_t* Buffer(unsigned int, unsigned int)': zm_image.h:170:104: error: 'width' was not declared in this scope inline const uint8_t* Buffer( unsigned int x, unsigned int y= 0 ) const { return( &buffer[colours*((y*width)+x)] ); } ^~~~~ In file included from zm_monitor.h:28:0, from zmc.cpp:28: zm_image.h: At global scope: zm_image.h:174:28: error: non-member function 'int IsBufferHeld()' cannot have cv-qualifier inline int IsBufferHeld() const { return holdbuffer; } ^~~~~ zm_image.h: In function 'void Empty()': zm_image.h:179:17: error: 'DumpImgBuffer' was not declared in this scope DumpImgBuffer(); ^ zm_image.h:181:2: error: 'width' was not declared in this scope width = height = colours = size = pixels = subpixelorder = 0; ^~~~~ zm_image.h: At global scope: zm_image.h:192:46: error: 'Image& operator=(const Image&)' must be a nonstatic member function inline Image &operator=( const Image &image ) ^ zm_image.h:197:59: error: 'Image& operator=(const unsigned char*)' must be a nonstatic member function inline Image &operator=( const unsigned char *new_buffer ) ^ zm_image.h:204:40: error: non-member function 'bool WriteRaw(const char*)' cannot have cv-qualifier bool WriteRaw( const char *filename ) const; ^~~~~ zm_image.h:207:65: error: non-member function 'bool WriteJpeg(const char*, int)' cannot have cv-qualifier bool WriteJpeg( const char *filename, int quality_override=0 ) const; ^~~~~ zm_image.h:209:84: error: non-member function 'bool EncodeJpeg(JOCTET*, int*, int)' cannot have cv-qualifier bool EncodeJpeg( JOCTET *outbuffer, int *outbuffer_size, int quality_override=0 ) const; ^~~~~ zm_image.h:213:98: error: non-member function 'bool Zip(Bytef*, long unsigned int*, int)' cannot have cv-qualifier bool Zip( Bytef *outbuffer, unsigned long *outbuffer_size, int compression_level=Z_BEST_SPEED ) const; ^~~~~ zm_image.h:226:54: error: non-member function 'void Delta(const Image&, Image*)' cannot have cv-qualifier void Delta( const Image &image, Image* targetimage) const; ^~~~~ zm_image.h:228:46: error: non-member function 'const Coord centreCoord(const char*)' cannot have cv-qualifier const Coord centreCoord( const char *text ) const; ^~~~~ zm_image.h:253:1: error: expected declaration before '}' token }; ^ zm_image.h:222:16: warning: 'Image* Merge(unsigned int, Image**)' declared 'static' but never defined [-Wunused-function] static Image *Merge( unsigned int n_images, Image *images[] ); ^~~~~ zm_image.h:223:16: warning: 'Image* Merge(unsigned int, Image**, double)' declared 'static' but never defined [-Wunused-function] static Image *Merge( unsigned int n_images, Image *images[], double weight ); ^~~~~ zm_image.h:224:16: warning: 'Image* Highlight(unsigned int, Image**, Rgb, Rgb)' declared 'static' but never defined [-Wunused-function] static Image *Highlight( unsigned int n_images, Image *images[], const Rgb threshold=RGB_BLACK, const Rgb ref_colour=RGB_RED ); ^~~~~~~~~ In file included from zm_monitor.h:28:0, from zmc.cpp:28: zm_image.h:136:29: warning: 'jpg_err' defined but not used [-Wunused-variable] static struct zm_error_mgr jpg_err; ^~~~~~~ zm_image.h:135:33: warning: 'jpg_dcinfo' defined but not used [-Wunused-variable] static jpeg_decompress_struct *jpg_dcinfo; ^~~~~~~~~~ zm_image.h:134:31: warning: 'jpg_ccinfo' defined but not used [-Wunused-variable] static jpeg_compress_struct *jpg_ccinfo[101]; ^~~~~~~~~~ zm_image.h:133:24: warning: 'y_b_table' defined but not used [-Wunused-variable] static unsigned char *y_b_table; ^~~~~~~~~ zm_image.h:132:24: warning: 'y_g_table' defined but not used [-Wunused-variable] static unsigned char *y_g_table; ^~~~~~~~~ zm_image.h:131:24: warning: 'y_r_table' defined but not used [-Wunused-variable] static unsigned char *y_r_table; ^~~~~~~~~ zm_image.h:130:24: warning: 'abs_table' defined but not used [-Wunused-variable] static unsigned char *abs_table; ^~~~~~~~~ make[2]: *** [Makefile:634: zmc.o] Error 1 make[2]: Leaving directory '/tmp/B._6255T/BUILD/ZoneMinder-1.28.0/src' make[2]: Entering directory '/tmp/B._6255T/BUILD/ZoneMinder-1.28.0/src' i686-pld-linux-g++ -DHAVE_CONFIG_H -I. -I.. -I/usr/include -I/usr/include -Iyes/include -D__STDC_CONSTANT_MACROS -Wall -finline-functions -fomit-frame-pointer -Iyes/include -D__STDC_CONSTANT_MACROS -D__STDC_CONSTANT_MACROS -O2 -fwrapv -pipe -Wformat -Werror=format-security -gdwarf-4 -fno-debug-types-section -fvar-tracking-assignments -g2 -Wp,-D_FORTIFY_SOURCE=2 -D__STDC_CONSTANT_MACROS -fstack-protector-strong --param=ssp-buffer-size=4 -fomit-frame-pointer -march=i686 -fasynchronous-unwind-tables -mtune=pentium4 -gdwarf-4 -fno-debug-types-section -fvar-tracking-assignments -g2 -MT zm_config.o -MD -MP -MF .deps/zm_config.Tpo -c -o zm_config.o zm_config.cpp mv -f .deps/zm_config.Tpo .deps/zm_config.Po make[2]: Leaving directory '/tmp/B._6255T/BUILD/ZoneMinder-1.28.0/src' make[2]: Entering directory '/tmp/B._6255T/BUILD/ZoneMinder-1.28.0/src' i686-pld-linux-g++ -DHAVE_CONFIG_H -I. -I.. -I/usr/include -I/usr/include -Iyes/include -D__STDC_CONSTANT_MACROS -Wall -finline-functions -fomit-frame-pointer -Iyes/include -D__STDC_CONSTANT_MACROS -D__STDC_CONSTANT_MACROS -O2 -fwrapv -pipe -Wformat -Werror=format-security -gdwarf-4 -fno-debug-types-section -fvar-tracking-assignments -g2 -Wp,-D_FORTIFY_SOURCE=2 -D__STDC_CONSTANT_MACROS -fstack-protector-strong --param=ssp-buffer-size=4 -fomit-frame-pointer -march=i686 -fasynchronous-unwind-tables -mtune=pentium4 -gdwarf-4 -fno-debug-types-section -fvar-tracking-assignments -g2 -MT zm_event.o -MD -MP -MF .deps/zm_event.Tpo -c -o zm_event.o zm_event.cpp In file included from /usr/lib/gcc/i686-pld-linux/6.3.0/include/limits.h:168:0, from /usr/lib/gcc/i686-pld-linux/6.3.0/include/syslimits.h:7, from /usr/lib/gcc/i686-pld-linux/6.3.0/include/limits.h:34, from /usr/include/zconf.h:418, from /usr/include/zlib.h:34, from zm_image.h:38, from zm_ffmpeg.h:24, from zm_mpeg.h:23, from zm_event.cpp:34: zm_image.h:125:25: error: expected identifier before numeric constant enum { CHAR_HEIGHT=11, CHAR_WIDTH=6 }; ^ zm_image.h:125:25: error: expected '}' before numeric constant zm_image.h:125:25: error: expected unqualified-id before numeric constant In file included from zm_ffmpeg.h:24:0, from zm_mpeg.h:23, from zm_event.cpp:34: zm_image.h: In member function 'void Image::DumpImgBuffer()': zm_image.h:110:14: error: 'buffer' was not declared in this scope DumpBuffer(buffer,buffertype); ^~~~~~ zm_image.h:110:21: error: 'buffertype' was not declared in this scope DumpBuffer(buffer,buffertype); ^~~~~~~~~~ zm_image.h:112:3: error: 'allocation' was not declared in this scope allocation = 0; ^~~~~~~~~~ zm_image.h: In member function 'void Image::AllocImgBuffer(size_t)': zm_image.h:116:6: error: 'buffer' was not declared in this scope if(buffer) ^~~~~~ zm_image.h:119:3: error: 'buffer' was not declared in this scope buffer = AllocBuffer(p_bufsize); ^~~~~~ zm_image.h:120:3: error: 'buffertype' was not declared in this scope buffertype = ZM_BUFTYPE_ZM; ^~~~~~~~~~ zm_image.h:121:3: error: 'allocation' was not declared in this scope allocation = p_bufsize; ^~~~~~~~~~ zm_image.h: At global scope: zm_image.h:126:21: error: 'CHAR_HEIGHT' was not declared in this scope enum { LINE_HEIGHT=CHAR_HEIGHT+0 }; ^~~~~~~~~~~ zm_image.h:128:1: error: expected unqualified-id before 'protected' protected: ^~~~~~~~~ zm_image.h:138:1: error: expected unqualified-id before 'protected' protected: ^~~~~~~~~ zm_image.h:151:1: error: expected unqualified-id before 'protected' protected: ^~~~~~~~~ zm_image.h:154:1: error: expected unqualified-id before 'public' public: ^~~~~~ zm_image.h:156:9: error: expected unqualified-id before 'const' Image( const char *filename ); ^~~~~ zm_image.h:156:9: error: expected ')' before 'const' zm_image.h:157:9: error: expected unqualified-id before 'int' Image( int p_width, int p_height, int p_colours, int p_subpixelorder, uint8_t *p_buffer=0); ^~~ zm_image.h:157:9: error: expected ')' before 'int' zm_image.h:158:9: error: expected unqualified-id before 'const' Image( const Image &p_image ); ^~~~~ zm_image.h:158:9: error: expected ')' before 'const' zm_image.h:159:10: error: expected constructor, destructor, or type conversion before ';' token ~Image(); ^ zm_image.h:161:30: error: non-member function 'unsigned int Width()' cannot have cv-qualifier inline unsigned int Width() const { return( width ); } ^~~~~ zm_image.h: In function 'unsigned int Width()': zm_image.h:161:46: error: 'width' was not declared in this scope inline unsigned int Width() const { return( width ); } ^~~~~ zm_image.h: At global scope: zm_image.h:162:31: error: non-member function 'unsigned int Height()' cannot have cv-qualifier inline unsigned int Height() const { return( height ); } ^~~~~ zm_image.h:163:31: error: non-member function 'unsigned int Pixels()' cannot have cv-qualifier inline unsigned int Pixels() const { return( pixels ); } ^~~~~ zm_image.h:164:32: error: non-member function 'unsigned int Colours()' cannot have cv-qualifier inline unsigned int Colours() const { return( colours ); } ^~~~~ zm_image.h:165:38: error: non-member function 'unsigned int SubpixelOrder()' cannot have cv-qualifier inline unsigned int SubpixelOrder() const { return( subpixelorder ); } ^~~~~ zm_image.h:166:29: error: non-member function 'unsigned int Size()' cannot have cv-qualifier inline unsigned int Size() const { return( size ); } ^~~~~ zm_image.h:169:33: error: non-member function 'const uint8_t* Buffer()' cannot have cv-qualifier inline const uint8_t* Buffer() const { return( buffer ); } ^~~~~ zm_image.h:170:68: error: non-member function 'const uint8_t* Buffer(unsigned int, unsigned int)' cannot have cv-qualifier inline const uint8_t* Buffer( unsigned int x, unsigned int y= 0 ) const { return( &buffer[colours*((y*width)+x)] ); } ^~~~~ zm_image.h: In function 'const uint8_t* Buffer(unsigned int, unsigned int)': zm_image.h:170:104: error: 'width' was not declared in this scope inline const uint8_t* Buffer( unsigned int x, unsigned int y= 0 ) const { return( &buffer[colours*((y*width)+x)] ); } ^~~~~ In file included from zm_ffmpeg.h:24:0, from zm_mpeg.h:23, from zm_event.cpp:34: zm_image.h: At global scope: zm_image.h:174:28: error: non-member function 'int IsBufferHeld()' cannot have cv-qualifier inline int IsBufferHeld() const { return holdbuffer; } ^~~~~ zm_image.h: In function 'void Empty()': zm_image.h:179:17: error: 'DumpImgBuffer' was not declared in this scope DumpImgBuffer(); ^ zm_image.h:181:2: error: 'width' was not declared in this scope width = height = colours = size = pixels = subpixelorder = 0; ^~~~~ zm_image.h: At global scope: zm_image.h:192:46: error: 'Image& operator=(const Image&)' must be a nonstatic member function inline Image &operator=( const Image &image ) ^ zm_image.h:197:59: error: 'Image& operator=(const unsigned char*)' must be a nonstatic member function inline Image &operator=( const unsigned char *new_buffer ) ^ zm_image.h:204:40: error: non-member function 'bool WriteRaw(const char*)' cannot have cv-qualifier bool WriteRaw( const char *filename ) const; ^~~~~ zm_image.h:207:65: error: non-member function 'bool WriteJpeg(const char*, int)' cannot have cv-qualifier bool WriteJpeg( const char *filename, int quality_override=0 ) const; ^~~~~ zm_image.h:209:84: error: non-member function 'bool EncodeJpeg(JOCTET*, int*, int)' cannot have cv-qualifier bool EncodeJpeg( JOCTET *outbuffer, int *outbuffer_size, int quality_override=0 ) const; ^~~~~ zm_image.h:213:98: error: non-member function 'bool Zip(Bytef*, long unsigned int*, int)' cannot have cv-qualifier bool Zip( Bytef *outbuffer, unsigned long *outbuffer_size, int compression_level=Z_BEST_SPEED ) const; ^~~~~ zm_image.h:226:54: error: non-member function 'void Delta(const Image&, Image*)' cannot have cv-qualifier void Delta( const Image &image, Image* targetimage) const; ^~~~~ zm_image.h:228:46: error: non-member function 'const Coord centreCoord(const char*)' cannot have cv-qualifier const Coord centreCoord( const char *text ) const; ^~~~~ zm_image.h:253:1: error: expected declaration before '}' token }; ^ zm_image.h:222:16: warning: 'Image* Merge(unsigned int, Image**)' declared 'static' but never defined [-Wunused-function] static Image *Merge( unsigned int n_images, Image *images[] ); ^~~~~ zm_image.h:223:16: warning: 'Image* Merge(unsigned int, Image**, double)' declared 'static' but never defined [-Wunused-function] static Image *Merge( unsigned int n_images, Image *images[], double weight ); ^~~~~ zm_image.h:224:16: warning: 'Image* Highlight(unsigned int, Image**, Rgb, Rgb)' declared 'static' but never defined [-Wunused-function] static Image *Highlight( unsigned int n_images, Image *images[], const Rgb threshold=RGB_BLACK, const Rgb ref_colour=RGB_RED ); ^~~~~~~~~ In file included from zm_ffmpeg.h:24:0, from zm_mpeg.h:23, from zm_event.cpp:34: zm_image.h:136:29: warning: 'jpg_err' defined but not used [-Wunused-variable] static struct zm_error_mgr jpg_err; ^~~~~~~ zm_image.h:135:33: warning: 'jpg_dcinfo' defined but not used [-Wunused-variable] static jpeg_decompress_struct *jpg_dcinfo; ^~~~~~~~~~ zm_image.h:134:31: warning: 'jpg_ccinfo' defined but not used [-Wunused-variable] static jpeg_compress_struct *jpg_ccinfo[101]; ^~~~~~~~~~ zm_image.h:133:24: warning: 'y_b_table' defined but not used [-Wunused-variable] static unsigned char *y_b_table; ^~~~~~~~~ zm_image.h:132:24: warning: 'y_g_table' defined but not used [-Wunused-variable] static unsigned char *y_g_table; ^~~~~~~~~ zm_image.h:131:24: warning: 'y_r_table' defined but not used [-Wunused-variable] static unsigned char *y_r_table; ^~~~~~~~~ zm_image.h:130:24: warning: 'abs_table' defined but not used [-Wunused-variable] static unsigned char *abs_table; ^~~~~~~~~ make[2]: *** [Makefile:634: zm_event.o] Error 1 make[2]: Leaving directory '/tmp/B._6255T/BUILD/ZoneMinder-1.28.0/src' make[2]: Entering directory '/tmp/B._6255T/BUILD/ZoneMinder-1.28.0/src' i686-pld-linux-g++ -DHAVE_CONFIG_H -I. -I.. -I/usr/include -I/usr/include -Iyes/include -D__STDC_CONSTANT_MACROS -Wall -finline-functions -fomit-frame-pointer -Iyes/include -D__STDC_CONSTANT_MACROS -D__STDC_CONSTANT_MACROS -O2 -fwrapv -pipe -Wformat -Werror=format-security -gdwarf-4 -fno-debug-types-section -fvar-tracking-assignments -g2 -Wp,-D_FORTIFY_SOURCE=2 -D__STDC_CONSTANT_MACROS -fstack-protector-strong --param=ssp-buffer-size=4 -fomit-frame-pointer -march=i686 -fasynchronous-unwind-tables -mtune=pentium4 -gdwarf-4 -fno-debug-types-section -fvar-tracking-assignments -g2 -MT zm_db.o -MD -MP -MF .deps/zm_db.Tpo -c -o zm_db.o zm_db.cpp mv -f .deps/zm_db.Tpo .deps/zm_db.Po make[2]: Leaving directory '/tmp/B._6255T/BUILD/ZoneMinder-1.28.0/src' make[2]: Entering directory '/tmp/B._6255T/BUILD/ZoneMinder-1.28.0/src' i686-pld-linux-g++ -DHAVE_CONFIG_H -I. -I.. -I/usr/include -I/usr/include -Iyes/include -D__STDC_CONSTANT_MACROS -Wall -finline-functions -fomit-frame-pointer -Iyes/include -D__STDC_CONSTANT_MACROS -D__STDC_CONSTANT_MACROS -O2 -fwrapv -pipe -Wformat -Werror=format-security -gdwarf-4 -fno-debug-types-section -fvar-tracking-assignments -g2 -Wp,-D_FORTIFY_SOURCE=2 -D__STDC_CONSTANT_MACROS -fstack-protector-strong --param=ssp-buffer-size=4 -fomit-frame-pointer -march=i686 -fasynchronous-unwind-tables -mtune=pentium4 -gdwarf-4 -fno-debug-types-section -fvar-tracking-assignments -g2 -MT zm_comms.o -MD -MP -MF .deps/zm_comms.Tpo -c -o zm_comms.o zm_comms.cpp zm_comms.cpp: In member function 'virtual bool Socket::socket()': zm_comms.cpp:250:5: warning: this 'if' clause does not guard... [-Wmisleading-indentation] if ( mSd >= 0 ) ^~ zm_comms.cpp:253:2: note: ...this statement, but the latter is misleadingly indented as if it is guarded by the 'if' if ( (mSd = ::socket( getDomain(), getType(), 0 ) ) < 0 ) ^~ zm_comms.cpp: In member function 'bool TcpInetServer::accept(TcpInetSocket*&)': zm_comms.cpp:528:5: warning: this 'if' clause does not guard... [-Wmisleading-indentation] if ( !Socket::accept( newSd ) ) ^~ zm_comms.cpp:531:2: note: ...this statement, but the latter is misleadingly indented as if it is guarded by the 'if' newSocket = new TcpInetSocket( *this, newSd ); ^~~~~~~~~ zm_comms.cpp: In member function 'bool TcpUnixServer::accept(TcpUnixSocket*&)': zm_comms.cpp:541:5: warning: this 'if' clause does not guard... [-Wmisleading-indentation] if ( !Socket::accept( newSd ) ) ^~ zm_comms.cpp:544:2: note: ...this statement, but the latter is misleadingly indented as if it is guarded by the 'if' newSocket = new TcpUnixSocket( *this, newSd ); ^~~~~~~~~ mv -f .deps/zm_comms.Tpo .deps/zm_comms.Po make[2]: Leaving directory '/tmp/B._6255T/BUILD/ZoneMinder-1.28.0/src' make[2]: Entering directory '/tmp/B._6255T/BUILD/ZoneMinder-1.28.0/src' i686-pld-linux-g++ -DHAVE_CONFIG_H -I. -I.. -I/usr/include -I/usr/include -Iyes/include -D__STDC_CONSTANT_MACROS -Wall -finline-functions -fomit-frame-pointer -Iyes/include -D__STDC_CONSTANT_MACROS -D__STDC_CONSTANT_MACROS -O2 -fwrapv -pipe -Wformat -Werror=format-security -gdwarf-4 -fno-debug-types-section -fvar-tracking-assignments -g2 -Wp,-D_FORTIFY_SOURCE=2 -D__STDC_CONSTANT_MACROS -fstack-protector-strong --param=ssp-buffer-size=4 -fomit-frame-pointer -march=i686 -fasynchronous-unwind-tables -mtune=pentium4 -gdwarf-4 -fno-debug-types-section -fvar-tracking-assignments -g2 -MT zm_logger.o -MD -MP -MF .deps/zm_logger.Tpo -c -o zm_logger.o zm_logger.cpp mv -f .deps/zm_logger.Tpo .deps/zm_logger.Po make[2]: Leaving directory '/tmp/B._6255T/BUILD/ZoneMinder-1.28.0/src' make[1]: *** [Makefile:517: all-recursive] Error 1 make: *** [Makefile:425: all] Error 2 error: Bad exit status from /tmp/B._6255T/BUILD/tmp/rpm-tmp.10826 (%build) RPM build errors: Bad exit status from /tmp/B._6255T/BUILD/tmp/rpm-tmp.10826 (%build) ended at: Fri Apr 14 16:06:45 2017, done in 0:00:24.427664 error: No files produced. + chmod -R u+rwX /tmp/B._6255T/BUILD + rm -rf /tmp/B._6255T/tmp /tmp/B._6255T/BUILD + rm -rf /tmp/B._6255T Begin-PLD-Builder-Info Build-Time: user:21.83s sys:2.67s real:29.08s (faults io:0 non-io:1228225) End-PLD-Builder-Info
[Back to list of logs] [View rpm -qa of builder]