FailedOk

th/SRPMS[OK]
th/x32[OK]
th/i686[OK]
th/x86_64[OK]

ac/SRPMS[OK]
ac/i386[OK]
ac/i586[OK]
ac/i686[OK]
ac/alpha[OK]
ac/amd64[OK]
ac/athlon[OK]
ac/ppc[OK]
ac/sparc[OK]
ac/sparc64[OK]

Advanced Search
main()
Powered by PLD Linux
(c) 2002-2017 PLD Team
$Revision: 1.37 $
Powered by X.
Your IP: 54.198.143.210

zoneminder 9e8498b4-c2d6-46a3-9759-9e64a4984d92

Status:Failed
Source URL:ftp://buildlogs.pld-linux.org/th/i686/FAIL/zoneminder,9e8498b4-c2d6-46a3-9759-9e64a4984d92.bz2
text/plain URL:View!
full text:View!
rpm -qa of builder:View!
Date:2017/04/14 16:06:45
Runtime:0:00:24.427664

Toc:

  • error 1
  • zm_image.h:125:25: error: expected identifier before numeric constant
  • error 2
  • zm_image.h:125:25: error: expected '}' before numeric constant
  • error 3
  • zm_image.h:125:25: error: expected unqualified-id before numeric constant
  • error 4
  • zm_image.h:110:14: error: 'buffer' was not declared in this scope
  • error 5
  • zm_image.h:110:21: error: 'buffertype' was not declared in this scope
  • error 6
  • zm_image.h:112:3: error: 'allocation' was not declared in this scope
  • error 7
  • zm_image.h:116:6: error: 'buffer' was not declared in this scope
  • error 8
  • zm_image.h:119:3: error: 'buffer' was not declared in this scope
  • error 9
  • zm_image.h:120:3: error: 'buffertype' was not declared in this scope
  • error 10
  • zm_image.h:121:3: error: 'allocation' was not declared in this scope
  • error 11
  • zm_image.h:126:21: error: 'CHAR_HEIGHT' was not declared in this scope
  • error 12
  • zm_image.h:128:1: error: expected unqualified-id before 'protected'
  • error 13
  • zm_image.h:138:1: error: expected unqualified-id before 'protected'
  • error 14
  • zm_image.h:151:1: error: expected unqualified-id before 'protected'
  • error 15
  • zm_image.h:154:1: error: expected unqualified-id before 'public'
  • error 16
  • zm_image.h:156:9: error: expected unqualified-id before 'const'
  • error 17
  • zm_image.h:156:9: error: expected ')' before 'const'
  • error 18
  • zm_image.h:157:9: error: expected unqualified-id before 'int'
  • error 19
  • zm_image.h:157:9: error: expected ')' before 'int'
  • error 20
  • zm_image.h:158:9: error: expected unqualified-id before 'const'
  • error 21
  • zm_image.h:158:9: error: expected ')' before 'const'
  • error 22
  • zm_image.h:159:10: error: expected constructor, destructor, or type conversion before ';' token
  • error 23
  • zm_image.h:161:30: error: non-member function 'unsigned int Width()' cannot have cv-qualifier
  • error 24
  • zm_image.h:161:46: error: 'width' was not declared in this scope
  • error 25
  • zm_image.h:162:31: error: non-member function 'unsigned int Height()' cannot have cv-qualifier
  • error 26
  • zm_image.h:163:31: error: non-member function 'unsigned int Pixels()' cannot have cv-qualifier
  • error 27
  • zm_image.h:164:32: error: non-member function 'unsigned int Colours()' cannot have cv-qualifier
  • error 28
  • zm_image.h:165:38: error: non-member function 'unsigned int SubpixelOrder()' cannot have cv-qualifier
  • error 29
  • zm_image.h:166:29: error: non-member function 'unsigned int Size()' cannot have cv-qualifier
  • error 30
  • zm_image.h:169:33: error: non-member function 'const uint8_t* Buffer()' cannot have cv-qualifier
  • error 31
  • zm_image.h:170:68: error: non-member function 'const uint8_t* Buffer(unsigned int, unsigned int)' cannot have cv-qualifier
  • error 32
  • zm_image.h:170:104: error: 'width' was not declared in this scope
  • error 33
  • zm_image.h:174:28: error: non-member function 'int IsBufferHeld()' cannot have cv-qualifier
  • error 34
  • zm_image.h:179:17: error: 'DumpImgBuffer' was not declared in this scope
  • error 35
  • zm_image.h:181:2: error: 'width' was not declared in this scope
  • error 36
  • zm_image.h:192:46: error: 'Image& operator=(const Image&)' must be a nonstatic member function
  • error 37
  • zm_image.h:197:59: error: 'Image& operator=(const unsigned char*)' must be a nonstatic member function
  • error 38
  • zm_image.h:204:40: error: non-member function 'bool WriteRaw(const char*)' cannot have cv-qualifier
  • error 39
  • zm_image.h:207:65: error: non-member function 'bool WriteJpeg(const char*, int)' cannot have cv-qualifier
  • error 40
  • zm_image.h:209:84: error: non-member function 'bool EncodeJpeg(JOCTET*, int*, int)' cannot have cv-qualifier
  • error 41
  • zm_image.h:213:98: error: non-member function 'bool Zip(Bytef*, long unsigned int*, int)' cannot have cv-qualifier
  • error 42
  • zm_image.h:226:54: error: non-member function 'void Delta(const Image&, Image*)' cannot have cv-qualifier
  • error 43
  • zm_image.h:228:46: error: non-member function 'const Coord centreCoord(const char*)' cannot have cv-qualifier
  • error 44
  • zm_image.h:253:1: error: expected declaration before '}' token
  • error 45
  • zm_image.h:125:25: error: expected identifier before numeric constant
  • error 46
  • zm_image.h:125:25: error: expected '}' before numeric constant
  • error 47
  • zm_image.h:125:25: error: expected unqualified-id before numeric constant
  • error 48
  • zm_image.h:110:14: error: 'buffer' was not declared in this scope
  • error 49
  • zm_image.h:110:21: error: 'buffertype' was not declared in this scope
  • error 50
  • zm_image.h:112:3: error: 'allocation' was not declared in this scope
  • error 51
  • zm_image.h:116:6: error: 'buffer' was not declared in this scope
  • error 52
  • zm_image.h:119:3: error: 'buffer' was not declared in this scope
  • error 53
  • zm_image.h:120:3: error: 'buffertype' was not declared in this scope
  • error 54
  • zm_image.h:121:3: error: 'allocation' was not declared in this scope
  • error 55
  • zm_image.h:126:21: error: 'CHAR_HEIGHT' was not declared in this scope
  • error 56
  • zm_image.h:128:1: error: expected unqualified-id before 'protected'
  • error 57
  • zm_image.h:138:1: error: expected unqualified-id before 'protected'
  • error 58
  • zm_image.h:151:1: error: expected unqualified-id before 'protected'
  • error 59
  • zm_image.h:154:1: error: expected unqualified-id before 'public'
  • error 60
  • zm_image.h:156:9: error: expected unqualified-id before 'const'
  • error 61
  • zm_image.h:156:9: error: expected ')' before 'const'
  • error 62
  • zm_image.h:157:9: error: expected unqualified-id before 'int'
  • error 63
  • zm_image.h:157:9: error: expected ')' before 'int'
  • error 64
  • zm_image.h:158:9: error: expected unqualified-id before 'const'
  • error 65
  • zm_image.h:158:9: error: expected ')' before 'const'
  • error 66
  • zm_image.h:159:10: error: expected constructor, destructor, or type conversion before ';' token
  • error 67
  • zm_image.h:161:30: error: non-member function 'unsigned int Width()' cannot have cv-qualifier
  • error 68
  • zm_image.h:161:46: error: 'width' was not declared in this scope
  • error 69
  • zm_image.h:162:31: error: non-member function 'unsigned int Height()' cannot have cv-qualifier
  • error 70
  • zm_image.h:163:31: error: non-member function 'unsigned int Pixels()' cannot have cv-qualifier
  • error 71
  • zm_image.h:164:32: error: non-member function 'unsigned int Colours()' cannot have cv-qualifier
  • error 72
  • zm_image.h:165:38: error: non-member function 'unsigned int SubpixelOrder()' cannot have cv-qualifier
  • error 73
  • zm_image.h:166:29: error: non-member function 'unsigned int Size()' cannot have cv-qualifier
  • error 74
  • zm_image.h:169:33: error: non-member function 'const uint8_t* Buffer()' cannot have cv-qualifier
  • error 75
  • zm_image.h:170:68: error: non-member function 'const uint8_t* Buffer(unsigned int, unsigned int)' cannot have cv-qualifier
  • error 76
  • zm_image.h:170:104: error: 'width' was not declared in this scope
  • error 77
  • zm_image.h:174:28: error: non-member function 'int IsBufferHeld()' cannot have cv-qualifier
  • error 78
  • zm_image.h:179:17: error: 'DumpImgBuffer' was not declared in this scope
  • error 79
  • zm_image.h:181:2: error: 'width' was not declared in this scope
  • error 80
  • zm_image.h:192:46: error: 'Image& operator=(const Image&)' must be a nonstatic member function
  • error 81
  • zm_image.h:197:59: error: 'Image& operator=(const unsigned char*)' must be a nonstatic member function
  • error 82
  • zm_image.h:204:40: error: non-member function 'bool WriteRaw(const char*)' cannot have cv-qualifier
  • error 83
  • zm_image.h:207:65: error: non-member function 'bool WriteJpeg(const char*, int)' cannot have cv-qualifier
  • error 84
  • zm_image.h:209:84: error: non-member function 'bool EncodeJpeg(JOCTET*, int*, int)' cannot have cv-qualifier
  • error 85
  • zm_image.h:213:98: error: non-member function 'bool Zip(Bytef*, long unsigned int*, int)' cannot have cv-qualifier
  • error 86
  • zm_image.h:226:54: error: non-member function 'void Delta(const Image&, Image*)' cannot have cv-qualifier
  • error 87
  • zm_image.h:228:46: error: non-member function 'const Coord centreCoord(const char*)' cannot have cv-qualifier
  • error 88
  • zm_image.h:253:1: error: expected declaration before '}' token
  • error 89
  • zm_image.h:125:25: error: expected identifier before numeric constant
  • error 90
  • zm_image.h:125:25: error: expected '}' before numeric constant
  • error 91
  • zm_image.h:125:25: error: expected unqualified-id before numeric constant
  • error 92
  • zm_image.h:110:14: error: 'buffer' was not declared in this scope
  • error 93
  • zm_image.h:110:21: error: 'buffertype' was not declared in this scope
  • error 94
  • zm_image.h:112:3: error: 'allocation' was not declared in this scope
  • error 95
  • zm_image.h:116:6: error: 'buffer' was not declared in this scope
  • error 96
  • zm_image.h:119:3: error: 'buffer' was not declared in this scope
  • error 97
  • zm_image.h:120:3: error: 'buffertype' was not declared in this scope
  • error 98
  • zm_image.h:121:3: error: 'allocation' was not declared in this scope
  • error 99
  • zm_image.h:126:21: error: 'CHAR_HEIGHT' was not declared in this scope
  • error 100
  • zm_image.h:128:1: error: expected unqualified-id before 'protected'
  • error 101
  • zm_image.h:138:1: error: expected unqualified-id before 'protected'
  • error 102
  • zm_image.h:151:1: error: expected unqualified-id before 'protected'
  • error 103
  • zm_image.h:154:1: error: expected unqualified-id before 'public'
  • error 104
  • zm_image.h:156:9: error: expected unqualified-id before 'const'
  • error 105
  • zm_image.h:156:9: error: expected ')' before 'const'
  • error 106
  • zm_image.h:157:9: error: expected unqualified-id before 'int'
  • error 107
  • zm_image.h:157:9: error: expected ')' before 'int'
  • error 108
  • zm_image.h:158:9: error: expected unqualified-id before 'const'
  • error 109
  • zm_image.h:158:9: error: expected ')' before 'const'
  • error 110
  • zm_image.h:159:10: error: expected constructor, destructor, or type conversion before ';' token
  • error 111
  • zm_image.h:161:30: error: non-member function 'unsigned int Width()' cannot have cv-qualifier
  • error 112
  • zm_image.h:161:46: error: 'width' was not declared in this scope
  • error 113
  • zm_image.h:162:31: error: non-member function 'unsigned int Height()' cannot have cv-qualifier
  • error 114
  • zm_image.h:163:31: error: non-member function 'unsigned int Pixels()' cannot have cv-qualifier
  • error 115
  • zm_image.h:164:32: error: non-member function 'unsigned int Colours()' cannot have cv-qualifier
  • error 116
  • zm_image.h:165:38: error: non-member function 'unsigned int SubpixelOrder()' cannot have cv-qualifier
  • error 117
  • zm_image.h:166:29: error: non-member function 'unsigned int Size()' cannot have cv-qualifier
  • error 118
  • zm_image.h:169:33: error: non-member function 'const uint8_t* Buffer()' cannot have cv-qualifier
  • error 119
  • zm_image.h:170:68: error: non-member function 'const uint8_t* Buffer(unsigned int, unsigned int)' cannot have cv-qualifier
  • error 120
  • zm_image.h:170:104: error: 'width' was not declared in this scope
  • error 121
  • zm_image.h:174:28: error: non-member function 'int IsBufferHeld()' cannot have cv-qualifier
  • error 122
  • zm_image.h:179:17: error: 'DumpImgBuffer' was not declared in this scope
  • error 123
  • zm_image.h:181:2: error: 'width' was not declared in this scope
  • error 124
  • zm_image.h:192:46: error: 'Image& operator=(const Image&)' must be a nonstatic member function
  • error 125
  • zm_image.h:197:59: error: 'Image& operator=(const unsigned char*)' must be a nonstatic member function
  • error 126
  • zm_image.h:204:40: error: non-member function 'bool WriteRaw(const char*)' cannot have cv-qualifier
  • error 127
  • zm_image.h:207:65: error: non-member function 'bool WriteJpeg(const char*, int)' cannot have cv-qualifier
  • error 128
  • zm_image.h:209:84: error: non-member function 'bool EncodeJpeg(JOCTET*, int*, int)' cannot have cv-qualifier
  • error 129
  • zm_image.h:213:98: error: non-member function 'bool Zip(Bytef*, long unsigned int*, int)' cannot have cv-qualifier
  • error 130
  • zm_image.h:226:54: error: non-member function 'void Delta(const Image&, Image*)' cannot have cv-qualifier
  • error 131
  • zm_image.h:228:46: error: non-member function 'const Coord centreCoord(const char*)' cannot have cv-qualifier
  • error 132
  • zm_image.h:253:1: error: expected declaration before '}' token
  • error 133
  • zm_image.h:125:25: error: expected identifier before numeric constant
  • error 134
  • zm_image.h:125:25: error: expected '}' before numeric constant
  • error 135
  • zm_image.h:125:25: error: expected unqualified-id before numeric constant
  • error 136
  • zm_image.h:110:14: error: 'buffer' was not declared in this scope
  • error 137
  • zm_image.h:110:21: error: 'buffertype' was not declared in this scope
  • error 138
  • zm_image.h:112:3: error: 'allocation' was not declared in this scope
  • error 139
  • zm_image.h:116:6: error: 'buffer' was not declared in this scope
  • error 140
  • zm_image.h:119:3: error: 'buffer' was not declared in this scope
  • error 141
  • zm_image.h:120:3: error: 'buffertype' was not declared in this scope
  • error 142
  • zm_image.h:121:3: error: 'allocation' was not declared in this scope
  • error 143
  • zm_image.h:126:21: error: 'CHAR_HEIGHT' was not declared in this scope
  • error 144
  • zm_image.h:128:1: error: expected unqualified-id before 'protected'
  • error 145
  • zm_image.h:138:1: error: expected unqualified-id before 'protected'
  • error 146
  • zm_image.h:151:1: error: expected unqualified-id before 'protected'
  • error 147
  • zm_image.h:154:1: error: expected unqualified-id before 'public'
  • error 148
  • zm_image.h:156:9: error: expected unqualified-id before 'const'
  • error 149
  • zm_image.h:156:9: error: expected ')' before 'const'
  • error 150
  • zm_image.h:157:9: error: expected unqualified-id before 'int'
  • error 151
  • zm_image.h:157:9: error: expected ')' before 'int'
  • error 152
  • zm_image.h:158:9: error: expected unqualified-id before 'const'
  • error 153
  • zm_image.h:158:9: error: expected ')' before 'const'
  • error 154
  • zm_image.h:159:10: error: expected constructor, destructor, or type conversion before ';' token
  • error 155
  • zm_image.h:161:30: error: non-member function 'unsigned int Width()' cannot have cv-qualifier
  • error 156
  • zm_image.h:161:46: error: 'width' was not declared in this scope
  • error 157
  • zm_image.h:162:31: error: non-member function 'unsigned int Height()' cannot have cv-qualifier
  • error 158
  • zm_image.h:163:31: error: non-member function 'unsigned int Pixels()' cannot have cv-qualifier
  • error 159
  • zm_image.h:164:32: error: non-member function 'unsigned int Colours()' cannot have cv-qualifier
  • error 160
  • zm_image.h:165:38: error: non-member function 'unsigned int SubpixelOrder()' cannot have cv-qualifier
  • error 161
  • zm_image.h:166:29: error: non-member function 'unsigned int Size()' cannot have cv-qualifier
  • error 162
  • zm_image.h:169:33: error: non-member function 'const uint8_t* Buffer()' cannot have cv-qualifier
  • error 163
  • zm_image.h:170:68: error: non-member function 'const uint8_t* Buffer(unsigned int, unsigned int)' cannot have cv-qualifier
  • error 164
  • zm_image.h:170:104: error: 'width' was not declared in this scope
  • error 165
  • zm_image.h:174:28: error: non-member function 'int IsBufferHeld()' cannot have cv-qualifier
  • error 166
  • zm_image.h:179:17: error: 'DumpImgBuffer' was not declared in this scope
  • error 167
  • zm_image.h:181:2: error: 'width' was not declared in this scope
  • error 168
  • zm_image.h:192:46: error: 'Image& operator=(const Image&)' must be a nonstatic member function
  • error 169
  • zm_image.h:197:59: error: 'Image& operator=(const unsigned char*)' must be a nonstatic member function
  • error 170
  • zm_image.h:204:40: error: non-member function 'bool WriteRaw(const char*)' cannot have cv-qualifier
  • error 171
  • zm_image.h:207:65: error: non-member function 'bool WriteJpeg(const char*, int)' cannot have cv-qualifier
  • error 172
  • zm_image.h:209:84: error: non-member function 'bool EncodeJpeg(JOCTET*, int*, int)' cannot have cv-qualifier
  • error 173
  • zm_image.h:213:98: error: non-member function 'bool Zip(Bytef*, long unsigned int*, int)' cannot have cv-qualifier
  • error 174
  • zm_image.h:226:54: error: non-member function 'void Delta(const Image&, Image*)' cannot have cv-qualifier
  • error 175
  • zm_image.h:228:46: error: non-member function 'const Coord centreCoord(const char*)' cannot have cv-qualifier
  • error 176
  • zm_image.h:253:1: error: expected declaration before '}' token
  • error 177
  • error: Bad exit status from /tmp/B._6255T/BUILD/tmp/rpm-tmp.10826 (%build)
  • error 178
  • RPM build errors:
  • error 179
  • error: No files produced.

Content:

config.status: creating scripts/ZoneMinder/lib/ZoneMinder/Config.pm
config.status: creating scripts/ZoneMinder/lib/ZoneMinder/Memory.pm
config.status: creating scripts/ZoneMinder/lib/ZoneMinder/ConfigData.pm
config.status: creating src/Makefile
config.status: creating src/zm_config.h
config.status: creating web/Makefile
config.status: creating web/ajax/Makefile
config.status: creating web/css/Makefile
config.status: creating web/graphics/Makefile
config.status: creating web/includes/Makefile
config.status: creating web/includes/config.php
config.status: creating web/js/Makefile
config.status: creating web/lang/Makefile
config.status: creating web/skins/Makefile
config.status: creating web/skins/classic/Makefile
config.status: creating web/skins/classic/ajax/Makefile
config.status: creating web/skins/classic/css/Makefile
config.status: creating web/skins/classic/graphics/Makefile
config.status: creating web/skins/classic/includes/Makefile
config.status: creating web/skins/classic/js/Makefile
config.status: creating web/skins/classic/lang/Makefile
config.status: creating web/skins/classic/views/Makefile
config.status: creating web/skins/classic/views/css/Makefile
config.status: creating web/skins/classic/views/js/Makefile
config.status: creating web/skins/mobile/Makefile
config.status: creating web/skins/mobile/ajax/Makefile
config.status: creating web/skins/mobile/css/Makefile
config.status: creating web/skins/mobile/graphics/Makefile
config.status: creating web/skins/mobile/includes/Makefile
config.status: creating web/skins/mobile/lang/Makefile
config.status: creating web/skins/mobile/views/Makefile
config.status: creating web/skins/mobile/views/css/Makefile
config.status: creating web/tools/Makefile
config.status: creating web/tools/mootools/Makefile
config.status: creating web/views/Makefile
config.status: creating web/skins/xml/Makefile
config.status: creating web/skins/xml/views/Makefile
config.status: creating web/skins/xml/includes/Makefile
config.status: creating web/skins/flat/Makefile
config.status: creating web/skins/flat/ajax/Makefile
config.status: creating web/skins/flat/css/Makefile
config.status: creating web/skins/flat/graphics/Makefile
config.status: creating web/skins/flat/includes/Makefile
config.status: creating web/skins/flat/js/Makefile
config.status: creating web/skins/flat/lang/Makefile
config.status: creating web/skins/flat/views/Makefile
config.status: creating web/skins/flat/views/css/Makefile
config.status: creating web/skins/flat/views/js/Makefile
config.status: creating config.h
config.status: executing depfiles commands
config.status: executing src/zm_config_defines.h commands
Generating 'src/zm_config_defines.h'
Updating 'db/zm_create.sql'
config.status: executing scripts/ZoneMinder/Makefile commands
perl Makefile.PL PREFIX=/usr
Checking if your kit is complete...
Looks good
Generating a Unix-style Makefile
Writing Makefile for ZoneMinder
Writing MYMETA.yml and MYMETA.json
+ /usr/bin/make -Otarget -j9
(CDPATH="${ZSH_VERSION+.}:" && cd . && /bin/sh /tmp/B._6255T/BUILD/ZoneMinder-1.28.0/missing autoheader)
rm -f stamp-h1
touch config.h.in
cd . && /bin/sh ./config.status config.h
config.status: creating config.h
/usr/bin/make  all-recursive
Making all in src
make[2]: Entering directory '/tmp/B._6255T/BUILD/ZoneMinder-1.28.0/src'
i686-pld-linux-g++ -DHAVE_CONFIG_H -I. -I..  -I/usr/include -I/usr/include -Iyes/include -D__STDC_CONSTANT_MACROS -Wall -finline-functions -fomit-frame-pointer -Iyes/include -D__STDC_CONSTANT_MACROS  -D__STDC_CONSTANT_MACROS -O2 -fwrapv -pipe -Wformat -Werror=format-security -gdwarf-4 -fno-debug-types-section -fvar-tracking-assignments -g2 -Wp,-D_FORTIFY_SOURCE=2 -D__STDC_CONSTANT_MACROS -fstack-protector-strong --param=ssp-buffer-size=4 -fomit-frame-pointer -march=i686 -fasynchronous-unwind-tables -mtune=pentium4 -gdwarf-4 -fno-debug-types-section -fvar-tracking-assignments -g2  -MT zm_coord.o -MD -MP -MF .deps/zm_coord.Tpo -c -o zm_coord.o zm_coord.cpp
mv -f .deps/zm_coord.Tpo .deps/zm_coord.Po
make[2]: Leaving directory '/tmp/B._6255T/BUILD/ZoneMinder-1.28.0/src'
make[2]: Entering directory '/tmp/B._6255T/BUILD/ZoneMinder-1.28.0/src'
i686-pld-linux-g++ -DHAVE_CONFIG_H -I. -I..  -I/usr/include -I/usr/include -Iyes/include -D__STDC_CONSTANT_MACROS -Wall -finline-functions -fomit-frame-pointer -Iyes/include -D__STDC_CONSTANT_MACROS  -D__STDC_CONSTANT_MACROS -O2 -fwrapv -pipe -Wformat -Werror=format-security -gdwarf-4 -fno-debug-types-section -fvar-tracking-assignments -g2 -Wp,-D_FORTIFY_SOURCE=2 -D__STDC_CONSTANT_MACROS -fstack-protector-strong --param=ssp-buffer-size=4 -fomit-frame-pointer -march=i686 -fasynchronous-unwind-tables -mtune=pentium4 -gdwarf-4 -fno-debug-types-section -fvar-tracking-assignments -g2  -MT zm_buffer.o -MD -MP -MF .deps/zm_buffer.Tpo -c -o zm_buffer.o zm_buffer.cpp
In file included from zm_buffer.cpp:23:0:
zm_buffer.h: In member function 'void Buffer::tidy(bool)':
zm_buffer.h:156:39: warning: comparison between signed and unsigned integer expressions [-Wsign-compare]
                 if ( (mHead-mStorage) > mSize )
                      ~~~~~~~~~~~~~~~~~^~~~~~~
zm_buffer.h:162:33: warning: comparison of constant '2' with boolean expression is always false [-Wbool-compare]
                 else if ( level >= 2 )
                           ~~~~~~^~~~
mv -f .deps/zm_buffer.Tpo .deps/zm_buffer.Po
make[2]: Leaving directory '/tmp/B._6255T/BUILD/ZoneMinder-1.28.0/src'
make[2]: Entering directory '/tmp/B._6255T/BUILD/ZoneMinder-1.28.0/src'
i686-pld-linux-g++ -DHAVE_CONFIG_H -I. -I..  -I/usr/include -I/usr/include -Iyes/include -D__STDC_CONSTANT_MACROS -Wall -finline-functions -fomit-frame-pointer -Iyes/include -D__STDC_CONSTANT_MACROS  -D__STDC_CONSTANT_MACROS -O2 -fwrapv -pipe -Wformat -Werror=format-security -gdwarf-4 -fno-debug-types-section -fvar-tracking-assignments -g2 -Wp,-D_FORTIFY_SOURCE=2 -D__STDC_CONSTANT_MACROS -fstack-protector-strong --param=ssp-buffer-size=4 -fomit-frame-pointer -march=i686 -fasynchronous-unwind-tables -mtune=pentium4 -gdwarf-4 -fno-debug-types-section -fvar-tracking-assignments -g2  -MT zm_box.o -MD -MP -MF .deps/zm_box.Tpo -c -o zm_box.o zm_box.cpp
mv -f .deps/zm_box.Tpo .deps/zm_box.Po
make[2]: Leaving directory '/tmp/B._6255T/BUILD/ZoneMinder-1.28.0/src'
make[2]: Entering directory '/tmp/B._6255T/BUILD/ZoneMinder-1.28.0/src'
i686-pld-linux-g++ -DHAVE_CONFIG_H -I. -I..  -I/usr/include -I/usr/include -Iyes/include -D__STDC_CONSTANT_MACROS -Wall -finline-functions -fomit-frame-pointer -Iyes/include -D__STDC_CONSTANT_MACROS  -D__STDC_CONSTANT_MACROS -O2 -fwrapv -pipe -Wformat -Werror=format-security -gdwarf-4 -fno-debug-types-section -fvar-tracking-assignments -g2 -Wp,-D_FORTIFY_SOURCE=2 -D__STDC_CONSTANT_MACROS -fstack-protector-strong --param=ssp-buffer-size=4 -fomit-frame-pointer -march=i686 -fasynchronous-unwind-tables -mtune=pentium4 -gdwarf-4 -fno-debug-types-section -fvar-tracking-assignments -g2  -MT zm_curl_camera.o -MD -MP -MF .deps/zm_curl_camera.Tpo -c -o zm_curl_camera.o zm_curl_camera.cpp
In file included from /usr/lib/gcc/i686-pld-linux/6.3.0/include/limits.h:168:0,
                 from /usr/lib/gcc/i686-pld-linux/6.3.0/include/syslimits.h:7,
                 from /usr/lib/gcc/i686-pld-linux/6.3.0/include/limits.h:34,
                 from /usr/include/zconf.h:418,
                 from /usr/include/zlib.h:34,
                 from zm_image.h:38,
                 from zm_camera.h:26,
                 from zm_curl_camera.h:25,
                 from zm_curl_camera.cpp:21:
zm_image.h:125:25: error: expected identifier before numeric constant
  enum { CHAR_HEIGHT=11, CHAR_WIDTH=6 };
                         ^
zm_image.h:125:25: error: expected '}' before numeric constant
zm_image.h:125:25: error: expected unqualified-id before numeric constant
In file included from zm_camera.h:26:0,
                 from zm_curl_camera.h:25,
                 from zm_curl_camera.cpp:21:
zm_image.h: In member function 'void Image::DumpImgBuffer()':
zm_image.h:110:14: error: 'buffer' was not declared in this scope
   DumpBuffer(buffer,buffertype);
              ^~~~~~
zm_image.h:110:21: error: 'buffertype' was not declared in this scope
   DumpBuffer(buffer,buffertype);
                     ^~~~~~~~~~
zm_image.h:112:3: error: 'allocation' was not declared in this scope
   allocation = 0;
   ^~~~~~~~~~
zm_image.h: In member function 'void Image::AllocImgBuffer(size_t)':
zm_image.h:116:6: error: 'buffer' was not declared in this scope
   if(buffer)
      ^~~~~~
zm_image.h:119:3: error: 'buffer' was not declared in this scope
   buffer = AllocBuffer(p_bufsize);
   ^~~~~~
zm_image.h:120:3: error: 'buffertype' was not declared in this scope
   buffertype = ZM_BUFTYPE_ZM;
   ^~~~~~~~~~
zm_image.h:121:3: error: 'allocation' was not declared in this scope
   allocation = p_bufsize;
   ^~~~~~~~~~
zm_image.h: At global scope:
zm_image.h:126:21: error: 'CHAR_HEIGHT' was not declared in this scope
  enum { LINE_HEIGHT=CHAR_HEIGHT+0 };
                     ^~~~~~~~~~~
zm_image.h:128:1: error: expected unqualified-id before 'protected'
 protected:
 ^~~~~~~~~
zm_image.h:138:1: error: expected unqualified-id before 'protected'
 protected:
 ^~~~~~~~~
zm_image.h:151:1: error: expected unqualified-id before 'protected'
 protected:
 ^~~~~~~~~
zm_image.h:154:1: error: expected unqualified-id before 'public'
 public:
 ^~~~~~
zm_image.h:156:9: error: expected unqualified-id before 'const'
  Image( const char *filename );
         ^~~~~
zm_image.h:156:9: error: expected ')' before 'const'
zm_image.h:157:9: error: expected unqualified-id before 'int'
  Image( int p_width, int p_height, int p_colours, int p_subpixelorder, uint8_t *p_buffer=0);
         ^~~
zm_image.h:157:9: error: expected ')' before 'int'
zm_image.h:158:9: error: expected unqualified-id before 'const'
  Image( const Image &p_image );
         ^~~~~
zm_image.h:158:9: error: expected ')' before 'const'
zm_image.h:159:10: error: expected constructor, destructor, or type conversion before ';' token
  ~Image();
          ^
zm_image.h:161:30: error: non-member function 'unsigned int Width()' cannot have cv-qualifier
  inline unsigned int Width() const { return( width ); }
                              ^~~~~
zm_image.h: In function 'unsigned int Width()':
zm_image.h:161:46: error: 'width' was not declared in this scope
  inline unsigned int Width() const { return( width ); }
                                              ^~~~~
zm_image.h: At global scope:
zm_image.h:162:31: error: non-member function 'unsigned int Height()' cannot have cv-qualifier
  inline unsigned int Height() const { return( height ); }
                               ^~~~~
zm_image.h:163:31: error: non-member function 'unsigned int Pixels()' cannot have cv-qualifier
  inline unsigned int Pixels() const { return( pixels ); }
                               ^~~~~
zm_image.h:164:32: error: non-member function 'unsigned int Colours()' cannot have cv-qualifier
  inline unsigned int Colours() const { return( colours ); }
                                ^~~~~
zm_image.h:165:38: error: non-member function 'unsigned int SubpixelOrder()' cannot have cv-qualifier
  inline unsigned int SubpixelOrder() const { return( subpixelorder ); }
                                      ^~~~~
zm_image.h:166:29: error: non-member function 'unsigned int Size()' cannot have cv-qualifier
  inline unsigned int Size() const { return( size ); }
                             ^~~~~
zm_image.h:169:33: error: non-member function 'const uint8_t* Buffer()' cannot have cv-qualifier
  inline const uint8_t* Buffer() const { return( buffer ); }
                                 ^~~~~
zm_image.h:170:68: error: non-member function 'const uint8_t* Buffer(unsigned int, unsigned int)' cannot have cv-qualifier
  inline const uint8_t* Buffer( unsigned int x, unsigned int y= 0 ) const { return( &buffer[colours*((y*width)+x)] ); }
                                                                    ^~~~~
zm_image.h: In function 'const uint8_t* Buffer(unsigned int, unsigned int)':
zm_image.h:170:104: error: 'width' was not declared in this scope
  inline const uint8_t* Buffer( unsigned int x, unsigned int y= 0 ) const { return( &buffer[colours*((y*width)+x)] ); }
                                                                                                        ^~~~~
In file included from zm_camera.h:26:0,
                 from zm_curl_camera.h:25,
                 from zm_curl_camera.cpp:21:
zm_image.h: At global scope:
zm_image.h:174:28: error: non-member function 'int IsBufferHeld()' cannot have cv-qualifier
  inline int IsBufferHeld() const { return holdbuffer; }
                            ^~~~~
zm_image.h: In function 'void Empty()':
zm_image.h:179:17: error: 'DumpImgBuffer' was not declared in this scope
   DumpImgBuffer();
                 ^
zm_image.h:181:2: error: 'width' was not declared in this scope
  width = height = colours = size = pixels = subpixelorder = 0;
  ^~~~~
zm_image.h: At global scope:
zm_image.h:192:46: error: 'Image& operator=(const Image&)' must be a nonstatic member function
  inline Image &operator=( const Image &image )
                                              ^
zm_image.h:197:59: error: 'Image& operator=(const unsigned char*)' must be a nonstatic member function
  inline Image &operator=( const unsigned char *new_buffer )
                                                           ^
zm_image.h:204:40: error: non-member function 'bool WriteRaw(const char*)' cannot have cv-qualifier
  bool WriteRaw( const char *filename ) const;
                                        ^~~~~
zm_image.h:207:65: error: non-member function 'bool WriteJpeg(const char*, int)' cannot have cv-qualifier
  bool WriteJpeg( const char *filename, int quality_override=0 ) const;
                                                                 ^~~~~
zm_image.h:209:84: error: non-member function 'bool EncodeJpeg(JOCTET*, int*, int)' cannot have cv-qualifier
  bool EncodeJpeg( JOCTET *outbuffer, int *outbuffer_size, int quality_override=0 ) const;
                                                                                    ^~~~~
zm_image.h:213:98: error: non-member function 'bool Zip(Bytef*, long unsigned int*, int)' cannot have cv-qualifier
  bool Zip( Bytef *outbuffer, unsigned long *outbuffer_size, int compression_level=Z_BEST_SPEED ) const;
                                                                                                  ^~~~~
zm_image.h:226:54: error: non-member function 'void Delta(const Image&, Image*)' cannot have cv-qualifier
  void Delta( const Image &image, Image* targetimage) const;
                                                      ^~~~~
zm_image.h:228:46: error: non-member function 'const Coord centreCoord(const char*)' cannot have cv-qualifier
  const Coord centreCoord( const char *text ) const;
                                              ^~~~~
zm_image.h:253:1: error: expected declaration before '}' token
 };
 ^
zm_image.h:222:16: warning: 'Image* Merge(unsigned int, Image**)' declared 'static' but never defined [-Wunused-function]
  static Image *Merge( unsigned int n_images, Image *images[] );
                ^~~~~
zm_image.h:223:16: warning: 'Image* Merge(unsigned int, Image**, double)' declared 'static' but never defined [-Wunused-function]
  static Image *Merge( unsigned int n_images, Image *images[], double weight );
                ^~~~~
zm_image.h:224:16: warning: 'Image* Highlight(unsigned int, Image**, Rgb, Rgb)' declared 'static' but never defined [-Wunused-function]
  static Image *Highlight( unsigned int n_images, Image *images[], const Rgb threshold=RGB_BLACK, const Rgb ref_colour=RGB_RED );
                ^~~~~~~~~
In file included from zm_camera.h:26:0,
                 from zm_curl_camera.h:25,
                 from zm_curl_camera.cpp:21:
zm_image.h:136:29: warning: 'jpg_err' defined but not used [-Wunused-variable]
  static struct zm_error_mgr jpg_err;
                             ^~~~~~~
zm_image.h:135:33: warning: 'jpg_dcinfo' defined but not used [-Wunused-variable]
  static jpeg_decompress_struct *jpg_dcinfo;
                                 ^~~~~~~~~~
zm_image.h:134:31: warning: 'jpg_ccinfo' defined but not used [-Wunused-variable]
  static jpeg_compress_struct *jpg_ccinfo[101];
                               ^~~~~~~~~~
zm_image.h:133:24: warning: 'y_b_table' defined but not used [-Wunused-variable]
  static unsigned char *y_b_table;
                        ^~~~~~~~~
zm_image.h:132:24: warning: 'y_g_table' defined but not used [-Wunused-variable]
  static unsigned char *y_g_table;
                        ^~~~~~~~~
zm_image.h:131:24: warning: 'y_r_table' defined but not used [-Wunused-variable]
  static unsigned char *y_r_table;
                        ^~~~~~~~~
zm_image.h:130:24: warning: 'abs_table' defined but not used [-Wunused-variable]
  static unsigned char *abs_table;
                        ^~~~~~~~~
make[2]: *** [Makefile:634: zm_curl_camera.o] Error 1
make[2]: Leaving directory '/tmp/B._6255T/BUILD/ZoneMinder-1.28.0/src'
make[2]: *** Waiting for unfinished jobs....
make[2]: Entering directory '/tmp/B._6255T/BUILD/ZoneMinder-1.28.0/src'
i686-pld-linux-g++ -DHAVE_CONFIG_H -I. -I..  -I/usr/include -I/usr/include -Iyes/include -D__STDC_CONSTANT_MACROS -Wall -finline-functions -fomit-frame-pointer -Iyes/include -D__STDC_CONSTANT_MACROS  -D__STDC_CONSTANT_MACROS -O2 -fwrapv -pipe -Wformat -Werror=format-security -gdwarf-4 -fno-debug-types-section -fvar-tracking-assignments -g2 -Wp,-D_FORTIFY_SOURCE=2 -D__STDC_CONSTANT_MACROS -fstack-protector-strong --param=ssp-buffer-size=4 -fomit-frame-pointer -march=i686 -fasynchronous-unwind-tables -mtune=pentium4 -gdwarf-4 -fno-debug-types-section -fvar-tracking-assignments -g2  -MT zm_camera.o -MD -MP -MF .deps/zm_camera.Tpo -c -o zm_camera.o zm_camera.cpp
In file included from /usr/lib/gcc/i686-pld-linux/6.3.0/include/limits.h:168:0,
                 from /usr/lib/gcc/i686-pld-linux/6.3.0/include/syslimits.h:7,
                 from /usr/lib/gcc/i686-pld-linux/6.3.0/include/limits.h:34,
                 from /usr/include/zconf.h:418,
                 from /usr/include/zlib.h:34,
                 from zm_image.h:38,
                 from zm_camera.h:26,
                 from zm_camera.cpp:21:
zm_image.h:125:25: error: expected identifier before numeric constant
  enum { CHAR_HEIGHT=11, CHAR_WIDTH=6 };
                         ^
zm_image.h:125:25: error: expected '}' before numeric constant
zm_image.h:125:25: error: expected unqualified-id before numeric constant
In file included from zm_camera.h:26:0,
                 from zm_camera.cpp:21:
zm_image.h: In member function 'void Image::DumpImgBuffer()':
zm_image.h:110:14: error: 'buffer' was not declared in this scope
   DumpBuffer(buffer,buffertype);
              ^~~~~~
zm_image.h:110:21: error: 'buffertype' was not declared in this scope
   DumpBuffer(buffer,buffertype);
                     ^~~~~~~~~~
zm_image.h:112:3: error: 'allocation' was not declared in this scope
   allocation = 0;
   ^~~~~~~~~~
zm_image.h: In member function 'void Image::AllocImgBuffer(size_t)':
zm_image.h:116:6: error: 'buffer' was not declared in this scope
   if(buffer)
      ^~~~~~
zm_image.h:119:3: error: 'buffer' was not declared in this scope
   buffer = AllocBuffer(p_bufsize);
   ^~~~~~
zm_image.h:120:3: error: 'buffertype' was not declared in this scope
   buffertype = ZM_BUFTYPE_ZM;
   ^~~~~~~~~~
zm_image.h:121:3: error: 'allocation' was not declared in this scope
   allocation = p_bufsize;
   ^~~~~~~~~~
zm_image.h: At global scope:
zm_image.h:126:21: error: 'CHAR_HEIGHT' was not declared in this scope
  enum { LINE_HEIGHT=CHAR_HEIGHT+0 };
                     ^~~~~~~~~~~
zm_image.h:128:1: error: expected unqualified-id before 'protected'
 protected:
 ^~~~~~~~~
zm_image.h:138:1: error: expected unqualified-id before 'protected'
 protected:
 ^~~~~~~~~
zm_image.h:151:1: error: expected unqualified-id before 'protected'
 protected:
 ^~~~~~~~~
zm_image.h:154:1: error: expected unqualified-id before 'public'
 public:
 ^~~~~~
zm_image.h:156:9: error: expected unqualified-id before 'const'
  Image( const char *filename );
         ^~~~~
zm_image.h:156:9: error: expected ')' before 'const'
zm_image.h:157:9: error: expected unqualified-id before 'int'
  Image( int p_width, int p_height, int p_colours, int p_subpixelorder, uint8_t *p_buffer=0);
         ^~~
zm_image.h:157:9: error: expected ')' before 'int'
zm_image.h:158:9: error: expected unqualified-id before 'const'
  Image( const Image &p_image );
         ^~~~~
zm_image.h:158:9: error: expected ')' before 'const'
zm_image.h:159:10: error: expected constructor, destructor, or type conversion before ';' token
  ~Image();
          ^
zm_image.h:161:30: error: non-member function 'unsigned int Width()' cannot have cv-qualifier
  inline unsigned int Width() const { return( width ); }
                              ^~~~~
zm_image.h: In function 'unsigned int Width()':
zm_image.h:161:46: error: 'width' was not declared in this scope
  inline unsigned int Width() const { return( width ); }
                                              ^~~~~
zm_image.h: At global scope:
zm_image.h:162:31: error: non-member function 'unsigned int Height()' cannot have cv-qualifier
  inline unsigned int Height() const { return( height ); }
                               ^~~~~
zm_image.h:163:31: error: non-member function 'unsigned int Pixels()' cannot have cv-qualifier
  inline unsigned int Pixels() const { return( pixels ); }
                               ^~~~~
zm_image.h:164:32: error: non-member function 'unsigned int Colours()' cannot have cv-qualifier
  inline unsigned int Colours() const { return( colours ); }
                                ^~~~~
zm_image.h:165:38: error: non-member function 'unsigned int SubpixelOrder()' cannot have cv-qualifier
  inline unsigned int SubpixelOrder() const { return( subpixelorder ); }
                                      ^~~~~
zm_image.h:166:29: error: non-member function 'unsigned int Size()' cannot have cv-qualifier
  inline unsigned int Size() const { return( size ); }
                             ^~~~~
zm_image.h:169:33: error: non-member function 'const uint8_t* Buffer()' cannot have cv-qualifier
  inline const uint8_t* Buffer() const { return( buffer ); }
                                 ^~~~~
zm_image.h:170:68: error: non-member function 'const uint8_t* Buffer(unsigned int, unsigned int)' cannot have cv-qualifier
  inline const uint8_t* Buffer( unsigned int x, unsigned int y= 0 ) const { return( &buffer[colours*((y*width)+x)] ); }
                                                                    ^~~~~
zm_image.h: In function 'const uint8_t* Buffer(unsigned int, unsigned int)':
zm_image.h:170:104: error: 'width' was not declared in this scope
  inline const uint8_t* Buffer( unsigned int x, unsigned int y= 0 ) const { return( &buffer[colours*((y*width)+x)] ); }
                                                                                                        ^~~~~
In file included from zm_camera.h:26:0,
                 from zm_camera.cpp:21:
zm_image.h: At global scope:
zm_image.h:174:28: error: non-member function 'int IsBufferHeld()' cannot have cv-qualifier
  inline int IsBufferHeld() const { return holdbuffer; }
                            ^~~~~
zm_image.h: In function 'void Empty()':
zm_image.h:179:17: error: 'DumpImgBuffer' was not declared in this scope
   DumpImgBuffer();
                 ^
zm_image.h:181:2: error: 'width' was not declared in this scope
  width = height = colours = size = pixels = subpixelorder = 0;
  ^~~~~
zm_image.h: At global scope:
zm_image.h:192:46: error: 'Image& operator=(const Image&)' must be a nonstatic member function
  inline Image &operator=( const Image &image )
                                              ^
zm_image.h:197:59: error: 'Image& operator=(const unsigned char*)' must be a nonstatic member function
  inline Image &operator=( const unsigned char *new_buffer )
                                                           ^
zm_image.h:204:40: error: non-member function 'bool WriteRaw(const char*)' cannot have cv-qualifier
  bool WriteRaw( const char *filename ) const;
                                        ^~~~~
zm_image.h:207:65: error: non-member function 'bool WriteJpeg(const char*, int)' cannot have cv-qualifier
  bool WriteJpeg( const char *filename, int quality_override=0 ) const;
                                                                 ^~~~~
zm_image.h:209:84: error: non-member function 'bool EncodeJpeg(JOCTET*, int*, int)' cannot have cv-qualifier
  bool EncodeJpeg( JOCTET *outbuffer, int *outbuffer_size, int quality_override=0 ) const;
                                                                                    ^~~~~
zm_image.h:213:98: error: non-member function 'bool Zip(Bytef*, long unsigned int*, int)' cannot have cv-qualifier
  bool Zip( Bytef *outbuffer, unsigned long *outbuffer_size, int compression_level=Z_BEST_SPEED ) const;
                                                                                                  ^~~~~
zm_image.h:226:54: error: non-member function 'void Delta(const Image&, Image*)' cannot have cv-qualifier
  void Delta( const Image &image, Image* targetimage) const;
                                                      ^~~~~
zm_image.h:228:46: error: non-member function 'const Coord centreCoord(const char*)' cannot have cv-qualifier
  const Coord centreCoord( const char *text ) const;
                                              ^~~~~
zm_image.h:253:1: error: expected declaration before '}' token
 };
 ^
zm_image.h:222:16: warning: 'Image* Merge(unsigned int, Image**)' declared 'static' but never defined [-Wunused-function]
  static Image *Merge( unsigned int n_images, Image *images[] );
                ^~~~~
zm_image.h:223:16: warning: 'Image* Merge(unsigned int, Image**, double)' declared 'static' but never defined [-Wunused-function]
  static Image *Merge( unsigned int n_images, Image *images[], double weight );
                ^~~~~
zm_image.h:224:16: warning: 'Image* Highlight(unsigned int, Image**, Rgb, Rgb)' declared 'static' but never defined [-Wunused-function]
  static Image *Highlight( unsigned int n_images, Image *images[], const Rgb threshold=RGB_BLACK, const Rgb ref_colour=RGB_RED );
                ^~~~~~~~~
In file included from zm_camera.h:26:0,
                 from zm_camera.cpp:21:
zm_image.h:136:29: warning: 'jpg_err' defined but not used [-Wunused-variable]
  static struct zm_error_mgr jpg_err;
                             ^~~~~~~
zm_image.h:135:33: warning: 'jpg_dcinfo' defined but not used [-Wunused-variable]
  static jpeg_decompress_struct *jpg_dcinfo;
                                 ^~~~~~~~~~
zm_image.h:134:31: warning: 'jpg_ccinfo' defined but not used [-Wunused-variable]
  static jpeg_compress_struct *jpg_ccinfo[101];
                               ^~~~~~~~~~
zm_image.h:133:24: warning: 'y_b_table' defined but not used [-Wunused-variable]
  static unsigned char *y_b_table;
                        ^~~~~~~~~
zm_image.h:132:24: warning: 'y_g_table' defined but not used [-Wunused-variable]
  static unsigned char *y_g_table;
                        ^~~~~~~~~
zm_image.h:131:24: warning: 'y_r_table' defined but not used [-Wunused-variable]
  static unsigned char *y_r_table;
                        ^~~~~~~~~
zm_image.h:130:24: warning: 'abs_table' defined but not used [-Wunused-variable]
  static unsigned char *abs_table;
                        ^~~~~~~~~
make[2]: *** [Makefile:634: zm_camera.o] Error 1
make[2]: Leaving directory '/tmp/B._6255T/BUILD/ZoneMinder-1.28.0/src'
make[2]: Entering directory '/tmp/B._6255T/BUILD/ZoneMinder-1.28.0/src'
i686-pld-linux-g++ -DHAVE_CONFIG_H -I. -I..  -I/usr/include -I/usr/include -Iyes/include -D__STDC_CONSTANT_MACROS -Wall -finline-functions -fomit-frame-pointer -Iyes/include -D__STDC_CONSTANT_MACROS  -D__STDC_CONSTANT_MACROS -O2 -fwrapv -pipe -Wformat -Werror=format-security -gdwarf-4 -fno-debug-types-section -fvar-tracking-assignments -g2 -Wp,-D_FORTIFY_SOURCE=2 -D__STDC_CONSTANT_MACROS -fstack-protector-strong --param=ssp-buffer-size=4 -fomit-frame-pointer -march=i686 -fasynchronous-unwind-tables -mtune=pentium4 -gdwarf-4 -fno-debug-types-section -fvar-tracking-assignments -g2  -MT zm.o -MD -MP -MF .deps/zm.Tpo -c -o zm.o zm.cpp
mv -f .deps/zm.Tpo .deps/zm.Po
make[2]: Leaving directory '/tmp/B._6255T/BUILD/ZoneMinder-1.28.0/src'
make[2]: Entering directory '/tmp/B._6255T/BUILD/ZoneMinder-1.28.0/src'
i686-pld-linux-g++ -DHAVE_CONFIG_H -I. -I..  -I/usr/include -I/usr/include -Iyes/include -D__STDC_CONSTANT_MACROS -Wall -finline-functions -fomit-frame-pointer -Iyes/include -D__STDC_CONSTANT_MACROS  -D__STDC_CONSTANT_MACROS -O2 -fwrapv -pipe -Wformat -Werror=format-security -gdwarf-4 -fno-debug-types-section -fvar-tracking-assignments -g2 -Wp,-D_FORTIFY_SOURCE=2 -D__STDC_CONSTANT_MACROS -fstack-protector-strong --param=ssp-buffer-size=4 -fomit-frame-pointer -march=i686 -fasynchronous-unwind-tables -mtune=pentium4 -gdwarf-4 -fno-debug-types-section -fvar-tracking-assignments -g2  -MT zmc.o -MD -MP -MF .deps/zmc.Tpo -c -o zmc.o zmc.cpp
In file included from /usr/lib/gcc/i686-pld-linux/6.3.0/include/limits.h:168:0,
                 from /usr/lib/gcc/i686-pld-linux/6.3.0/include/syslimits.h:7,
                 from /usr/lib/gcc/i686-pld-linux/6.3.0/include/limits.h:34,
                 from /usr/include/values.h:27,
                 from zmc.cpp:22:
zm_image.h:125:25: error: expected identifier before numeric constant
  enum { CHAR_HEIGHT=11, CHAR_WIDTH=6 };
                         ^
zm_image.h:125:25: error: expected '}' before numeric constant
zm_image.h:125:25: error: expected unqualified-id before numeric constant
In file included from zm_monitor.h:28:0,
                 from zmc.cpp:28:
zm_image.h: In member function 'void Image::DumpImgBuffer()':
zm_image.h:110:14: error: 'buffer' was not declared in this scope
   DumpBuffer(buffer,buffertype);
              ^~~~~~
zm_image.h:110:21: error: 'buffertype' was not declared in this scope
   DumpBuffer(buffer,buffertype);
                     ^~~~~~~~~~
zm_image.h:112:3: error: 'allocation' was not declared in this scope
   allocation = 0;
   ^~~~~~~~~~
zm_image.h: In member function 'void Image::AllocImgBuffer(size_t)':
zm_image.h:116:6: error: 'buffer' was not declared in this scope
   if(buffer)
      ^~~~~~
zm_image.h:119:3: error: 'buffer' was not declared in this scope
   buffer = AllocBuffer(p_bufsize);
   ^~~~~~
zm_image.h:120:3: error: 'buffertype' was not declared in this scope
   buffertype = ZM_BUFTYPE_ZM;
   ^~~~~~~~~~
zm_image.h:121:3: error: 'allocation' was not declared in this scope
   allocation = p_bufsize;
   ^~~~~~~~~~
zm_image.h: At global scope:
zm_image.h:126:21: error: 'CHAR_HEIGHT' was not declared in this scope
  enum { LINE_HEIGHT=CHAR_HEIGHT+0 };
                     ^~~~~~~~~~~
zm_image.h:128:1: error: expected unqualified-id before 'protected'
 protected:
 ^~~~~~~~~
zm_image.h:138:1: error: expected unqualified-id before 'protected'
 protected:
 ^~~~~~~~~
zm_image.h:151:1: error: expected unqualified-id before 'protected'
 protected:
 ^~~~~~~~~
zm_image.h:154:1: error: expected unqualified-id before 'public'
 public:
 ^~~~~~
zm_image.h:156:9: error: expected unqualified-id before 'const'
  Image( const char *filename );
         ^~~~~
zm_image.h:156:9: error: expected ')' before 'const'
zm_image.h:157:9: error: expected unqualified-id before 'int'
  Image( int p_width, int p_height, int p_colours, int p_subpixelorder, uint8_t *p_buffer=0);
         ^~~
zm_image.h:157:9: error: expected ')' before 'int'
zm_image.h:158:9: error: expected unqualified-id before 'const'
  Image( const Image &p_image );
         ^~~~~
zm_image.h:158:9: error: expected ')' before 'const'
zm_image.h:159:10: error: expected constructor, destructor, or type conversion before ';' token
  ~Image();
          ^
zm_image.h:161:30: error: non-member function 'unsigned int Width()' cannot have cv-qualifier
  inline unsigned int Width() const { return( width ); }
                              ^~~~~
zm_image.h: In function 'unsigned int Width()':
zm_image.h:161:46: error: 'width' was not declared in this scope
  inline unsigned int Width() const { return( width ); }
                                              ^~~~~
zm_image.h: At global scope:
zm_image.h:162:31: error: non-member function 'unsigned int Height()' cannot have cv-qualifier
  inline unsigned int Height() const { return( height ); }
                               ^~~~~
zm_image.h:163:31: error: non-member function 'unsigned int Pixels()' cannot have cv-qualifier
  inline unsigned int Pixels() const { return( pixels ); }
                               ^~~~~
zm_image.h:164:32: error: non-member function 'unsigned int Colours()' cannot have cv-qualifier
  inline unsigned int Colours() const { return( colours ); }
                                ^~~~~
zm_image.h:165:38: error: non-member function 'unsigned int SubpixelOrder()' cannot have cv-qualifier
  inline unsigned int SubpixelOrder() const { return( subpixelorder ); }
                                      ^~~~~
zm_image.h:166:29: error: non-member function 'unsigned int Size()' cannot have cv-qualifier
  inline unsigned int Size() const { return( size ); }
                             ^~~~~
zm_image.h:169:33: error: non-member function 'const uint8_t* Buffer()' cannot have cv-qualifier
  inline const uint8_t* Buffer() const { return( buffer ); }
                                 ^~~~~
zm_image.h:170:68: error: non-member function 'const uint8_t* Buffer(unsigned int, unsigned int)' cannot have cv-qualifier
  inline const uint8_t* Buffer( unsigned int x, unsigned int y= 0 ) const { return( &buffer[colours*((y*width)+x)] ); }
                                                                    ^~~~~
zm_image.h: In function 'const uint8_t* Buffer(unsigned int, unsigned int)':
zm_image.h:170:104: error: 'width' was not declared in this scope
  inline const uint8_t* Buffer( unsigned int x, unsigned int y= 0 ) const { return( &buffer[colours*((y*width)+x)] ); }
                                                                                                        ^~~~~
In file included from zm_monitor.h:28:0,
                 from zmc.cpp:28:
zm_image.h: At global scope:
zm_image.h:174:28: error: non-member function 'int IsBufferHeld()' cannot have cv-qualifier
  inline int IsBufferHeld() const { return holdbuffer; }
                            ^~~~~
zm_image.h: In function 'void Empty()':
zm_image.h:179:17: error: 'DumpImgBuffer' was not declared in this scope
   DumpImgBuffer();
                 ^
zm_image.h:181:2: error: 'width' was not declared in this scope
  width = height = colours = size = pixels = subpixelorder = 0;
  ^~~~~
zm_image.h: At global scope:
zm_image.h:192:46: error: 'Image& operator=(const Image&)' must be a nonstatic member function
  inline Image &operator=( const Image &image )
                                              ^
zm_image.h:197:59: error: 'Image& operator=(const unsigned char*)' must be a nonstatic member function
  inline Image &operator=( const unsigned char *new_buffer )
                                                           ^
zm_image.h:204:40: error: non-member function 'bool WriteRaw(const char*)' cannot have cv-qualifier
  bool WriteRaw( const char *filename ) const;
                                        ^~~~~
zm_image.h:207:65: error: non-member function 'bool WriteJpeg(const char*, int)' cannot have cv-qualifier
  bool WriteJpeg( const char *filename, int quality_override=0 ) const;
                                                                 ^~~~~
zm_image.h:209:84: error: non-member function 'bool EncodeJpeg(JOCTET*, int*, int)' cannot have cv-qualifier
  bool EncodeJpeg( JOCTET *outbuffer, int *outbuffer_size, int quality_override=0 ) const;
                                                                                    ^~~~~
zm_image.h:213:98: error: non-member function 'bool Zip(Bytef*, long unsigned int*, int)' cannot have cv-qualifier
  bool Zip( Bytef *outbuffer, unsigned long *outbuffer_size, int compression_level=Z_BEST_SPEED ) const;
                                                                                                  ^~~~~
zm_image.h:226:54: error: non-member function 'void Delta(const Image&, Image*)' cannot have cv-qualifier
  void Delta( const Image &image, Image* targetimage) const;
                                                      ^~~~~
zm_image.h:228:46: error: non-member function 'const Coord centreCoord(const char*)' cannot have cv-qualifier
  const Coord centreCoord( const char *text ) const;
                                              ^~~~~
zm_image.h:253:1: error: expected declaration before '}' token
 };
 ^
zm_image.h:222:16: warning: 'Image* Merge(unsigned int, Image**)' declared 'static' but never defined [-Wunused-function]
  static Image *Merge( unsigned int n_images, Image *images[] );
                ^~~~~
zm_image.h:223:16: warning: 'Image* Merge(unsigned int, Image**, double)' declared 'static' but never defined [-Wunused-function]
  static Image *Merge( unsigned int n_images, Image *images[], double weight );
                ^~~~~
zm_image.h:224:16: warning: 'Image* Highlight(unsigned int, Image**, Rgb, Rgb)' declared 'static' but never defined [-Wunused-function]
  static Image *Highlight( unsigned int n_images, Image *images[], const Rgb threshold=RGB_BLACK, const Rgb ref_colour=RGB_RED );
                ^~~~~~~~~
In file included from zm_monitor.h:28:0,
                 from zmc.cpp:28:
zm_image.h:136:29: warning: 'jpg_err' defined but not used [-Wunused-variable]
  static struct zm_error_mgr jpg_err;
                             ^~~~~~~
zm_image.h:135:33: warning: 'jpg_dcinfo' defined but not used [-Wunused-variable]
  static jpeg_decompress_struct *jpg_dcinfo;
                                 ^~~~~~~~~~
zm_image.h:134:31: warning: 'jpg_ccinfo' defined but not used [-Wunused-variable]
  static jpeg_compress_struct *jpg_ccinfo[101];
                               ^~~~~~~~~~
zm_image.h:133:24: warning: 'y_b_table' defined but not used [-Wunused-variable]
  static unsigned char *y_b_table;
                        ^~~~~~~~~
zm_image.h:132:24: warning: 'y_g_table' defined but not used [-Wunused-variable]
  static unsigned char *y_g_table;
                        ^~~~~~~~~
zm_image.h:131:24: warning: 'y_r_table' defined but not used [-Wunused-variable]
  static unsigned char *y_r_table;
                        ^~~~~~~~~
zm_image.h:130:24: warning: 'abs_table' defined but not used [-Wunused-variable]
  static unsigned char *abs_table;
                        ^~~~~~~~~
make[2]: *** [Makefile:634: zmc.o] Error 1
make[2]: Leaving directory '/tmp/B._6255T/BUILD/ZoneMinder-1.28.0/src'
make[2]: Entering directory '/tmp/B._6255T/BUILD/ZoneMinder-1.28.0/src'
i686-pld-linux-g++ -DHAVE_CONFIG_H -I. -I..  -I/usr/include -I/usr/include -Iyes/include -D__STDC_CONSTANT_MACROS -Wall -finline-functions -fomit-frame-pointer -Iyes/include -D__STDC_CONSTANT_MACROS  -D__STDC_CONSTANT_MACROS -O2 -fwrapv -pipe -Wformat -Werror=format-security -gdwarf-4 -fno-debug-types-section -fvar-tracking-assignments -g2 -Wp,-D_FORTIFY_SOURCE=2 -D__STDC_CONSTANT_MACROS -fstack-protector-strong --param=ssp-buffer-size=4 -fomit-frame-pointer -march=i686 -fasynchronous-unwind-tables -mtune=pentium4 -gdwarf-4 -fno-debug-types-section -fvar-tracking-assignments -g2  -MT zm_config.o -MD -MP -MF .deps/zm_config.Tpo -c -o zm_config.o zm_config.cpp
mv -f .deps/zm_config.Tpo .deps/zm_config.Po
make[2]: Leaving directory '/tmp/B._6255T/BUILD/ZoneMinder-1.28.0/src'
make[2]: Entering directory '/tmp/B._6255T/BUILD/ZoneMinder-1.28.0/src'
i686-pld-linux-g++ -DHAVE_CONFIG_H -I. -I..  -I/usr/include -I/usr/include -Iyes/include -D__STDC_CONSTANT_MACROS -Wall -finline-functions -fomit-frame-pointer -Iyes/include -D__STDC_CONSTANT_MACROS  -D__STDC_CONSTANT_MACROS -O2 -fwrapv -pipe -Wformat -Werror=format-security -gdwarf-4 -fno-debug-types-section -fvar-tracking-assignments -g2 -Wp,-D_FORTIFY_SOURCE=2 -D__STDC_CONSTANT_MACROS -fstack-protector-strong --param=ssp-buffer-size=4 -fomit-frame-pointer -march=i686 -fasynchronous-unwind-tables -mtune=pentium4 -gdwarf-4 -fno-debug-types-section -fvar-tracking-assignments -g2  -MT zm_event.o -MD -MP -MF .deps/zm_event.Tpo -c -o zm_event.o zm_event.cpp
In file included from /usr/lib/gcc/i686-pld-linux/6.3.0/include/limits.h:168:0,
                 from /usr/lib/gcc/i686-pld-linux/6.3.0/include/syslimits.h:7,
                 from /usr/lib/gcc/i686-pld-linux/6.3.0/include/limits.h:34,
                 from /usr/include/zconf.h:418,
                 from /usr/include/zlib.h:34,
                 from zm_image.h:38,
                 from zm_ffmpeg.h:24,
                 from zm_mpeg.h:23,
                 from zm_event.cpp:34:
zm_image.h:125:25: error: expected identifier before numeric constant
  enum { CHAR_HEIGHT=11, CHAR_WIDTH=6 };
                         ^
zm_image.h:125:25: error: expected '}' before numeric constant
zm_image.h:125:25: error: expected unqualified-id before numeric constant
In file included from zm_ffmpeg.h:24:0,
                 from zm_mpeg.h:23,
                 from zm_event.cpp:34:
zm_image.h: In member function 'void Image::DumpImgBuffer()':
zm_image.h:110:14: error: 'buffer' was not declared in this scope
   DumpBuffer(buffer,buffertype);
              ^~~~~~
zm_image.h:110:21: error: 'buffertype' was not declared in this scope
   DumpBuffer(buffer,buffertype);
                     ^~~~~~~~~~
zm_image.h:112:3: error: 'allocation' was not declared in this scope
   allocation = 0;
   ^~~~~~~~~~
zm_image.h: In member function 'void Image::AllocImgBuffer(size_t)':
zm_image.h:116:6: error: 'buffer' was not declared in this scope
   if(buffer)
      ^~~~~~
zm_image.h:119:3: error: 'buffer' was not declared in this scope
   buffer = AllocBuffer(p_bufsize);
   ^~~~~~
zm_image.h:120:3: error: 'buffertype' was not declared in this scope
   buffertype = ZM_BUFTYPE_ZM;
   ^~~~~~~~~~
zm_image.h:121:3: error: 'allocation' was not declared in this scope
   allocation = p_bufsize;
   ^~~~~~~~~~
zm_image.h: At global scope:
zm_image.h:126:21: error: 'CHAR_HEIGHT' was not declared in this scope
  enum { LINE_HEIGHT=CHAR_HEIGHT+0 };
                     ^~~~~~~~~~~
zm_image.h:128:1: error: expected unqualified-id before 'protected'
 protected:
 ^~~~~~~~~
zm_image.h:138:1: error: expected unqualified-id before 'protected'
 protected:
 ^~~~~~~~~
zm_image.h:151:1: error: expected unqualified-id before 'protected'
 protected:
 ^~~~~~~~~
zm_image.h:154:1: error: expected unqualified-id before 'public'
 public:
 ^~~~~~
zm_image.h:156:9: error: expected unqualified-id before 'const'
  Image( const char *filename );
         ^~~~~
zm_image.h:156:9: error: expected ')' before 'const'
zm_image.h:157:9: error: expected unqualified-id before 'int'
  Image( int p_width, int p_height, int p_colours, int p_subpixelorder, uint8_t *p_buffer=0);
         ^~~
zm_image.h:157:9: error: expected ')' before 'int'
zm_image.h:158:9: error: expected unqualified-id before 'const'
  Image( const Image &p_image );
         ^~~~~
zm_image.h:158:9: error: expected ')' before 'const'
zm_image.h:159:10: error: expected constructor, destructor, or type conversion before ';' token
  ~Image();
          ^
zm_image.h:161:30: error: non-member function 'unsigned int Width()' cannot have cv-qualifier
  inline unsigned int Width() const { return( width ); }
                              ^~~~~
zm_image.h: In function 'unsigned int Width()':
zm_image.h:161:46: error: 'width' was not declared in this scope
  inline unsigned int Width() const { return( width ); }
                                              ^~~~~
zm_image.h: At global scope:
zm_image.h:162:31: error: non-member function 'unsigned int Height()' cannot have cv-qualifier
  inline unsigned int Height() const { return( height ); }
                               ^~~~~
zm_image.h:163:31: error: non-member function 'unsigned int Pixels()' cannot have cv-qualifier
  inline unsigned int Pixels() const { return( pixels ); }
                               ^~~~~
zm_image.h:164:32: error: non-member function 'unsigned int Colours()' cannot have cv-qualifier
  inline unsigned int Colours() const { return( colours ); }
                                ^~~~~
zm_image.h:165:38: error: non-member function 'unsigned int SubpixelOrder()' cannot have cv-qualifier
  inline unsigned int SubpixelOrder() const { return( subpixelorder ); }
                                      ^~~~~
zm_image.h:166:29: error: non-member function 'unsigned int Size()' cannot have cv-qualifier
  inline unsigned int Size() const { return( size ); }
                             ^~~~~
zm_image.h:169:33: error: non-member function 'const uint8_t* Buffer()' cannot have cv-qualifier
  inline const uint8_t* Buffer() const { return( buffer ); }
                                 ^~~~~
zm_image.h:170:68: error: non-member function 'const uint8_t* Buffer(unsigned int, unsigned int)' cannot have cv-qualifier
  inline const uint8_t* Buffer( unsigned int x, unsigned int y= 0 ) const { return( &buffer[colours*((y*width)+x)] ); }
                                                                    ^~~~~
zm_image.h: In function 'const uint8_t* Buffer(unsigned int, unsigned int)':
zm_image.h:170:104: error: 'width' was not declared in this scope
  inline const uint8_t* Buffer( unsigned int x, unsigned int y= 0 ) const { return( &buffer[colours*((y*width)+x)] ); }
                                                                                                        ^~~~~
In file included from zm_ffmpeg.h:24:0,
                 from zm_mpeg.h:23,
                 from zm_event.cpp:34:
zm_image.h: At global scope:
zm_image.h:174:28: error: non-member function 'int IsBufferHeld()' cannot have cv-qualifier
  inline int IsBufferHeld() const { return holdbuffer; }
                            ^~~~~
zm_image.h: In function 'void Empty()':
zm_image.h:179:17: error: 'DumpImgBuffer' was not declared in this scope
   DumpImgBuffer();
                 ^
zm_image.h:181:2: error: 'width' was not declared in this scope
  width = height = colours = size = pixels = subpixelorder = 0;
  ^~~~~
zm_image.h: At global scope:
zm_image.h:192:46: error: 'Image& operator=(const Image&)' must be a nonstatic member function
  inline Image &operator=( const Image &image )
                                              ^
zm_image.h:197:59: error: 'Image& operator=(const unsigned char*)' must be a nonstatic member function
  inline Image &operator=( const unsigned char *new_buffer )
                                                           ^
zm_image.h:204:40: error: non-member function 'bool WriteRaw(const char*)' cannot have cv-qualifier
  bool WriteRaw( const char *filename ) const;
                                        ^~~~~
zm_image.h:207:65: error: non-member function 'bool WriteJpeg(const char*, int)' cannot have cv-qualifier
  bool WriteJpeg( const char *filename, int quality_override=0 ) const;
                                                                 ^~~~~
zm_image.h:209:84: error: non-member function 'bool EncodeJpeg(JOCTET*, int*, int)' cannot have cv-qualifier
  bool EncodeJpeg( JOCTET *outbuffer, int *outbuffer_size, int quality_override=0 ) const;
                                                                                    ^~~~~
zm_image.h:213:98: error: non-member function 'bool Zip(Bytef*, long unsigned int*, int)' cannot have cv-qualifier
  bool Zip( Bytef *outbuffer, unsigned long *outbuffer_size, int compression_level=Z_BEST_SPEED ) const;
                                                                                                  ^~~~~
zm_image.h:226:54: error: non-member function 'void Delta(const Image&, Image*)' cannot have cv-qualifier
  void Delta( const Image &image, Image* targetimage) const;
                                                      ^~~~~
zm_image.h:228:46: error: non-member function 'const Coord centreCoord(const char*)' cannot have cv-qualifier
  const Coord centreCoord( const char *text ) const;
                                              ^~~~~
zm_image.h:253:1: error: expected declaration before '}' token
 };
 ^
zm_image.h:222:16: warning: 'Image* Merge(unsigned int, Image**)' declared 'static' but never defined [-Wunused-function]
  static Image *Merge( unsigned int n_images, Image *images[] );
                ^~~~~
zm_image.h:223:16: warning: 'Image* Merge(unsigned int, Image**, double)' declared 'static' but never defined [-Wunused-function]
  static Image *Merge( unsigned int n_images, Image *images[], double weight );
                ^~~~~
zm_image.h:224:16: warning: 'Image* Highlight(unsigned int, Image**, Rgb, Rgb)' declared 'static' but never defined [-Wunused-function]
  static Image *Highlight( unsigned int n_images, Image *images[], const Rgb threshold=RGB_BLACK, const Rgb ref_colour=RGB_RED );
                ^~~~~~~~~
In file included from zm_ffmpeg.h:24:0,
                 from zm_mpeg.h:23,
                 from zm_event.cpp:34:
zm_image.h:136:29: warning: 'jpg_err' defined but not used [-Wunused-variable]
  static struct zm_error_mgr jpg_err;
                             ^~~~~~~
zm_image.h:135:33: warning: 'jpg_dcinfo' defined but not used [-Wunused-variable]
  static jpeg_decompress_struct *jpg_dcinfo;
                                 ^~~~~~~~~~
zm_image.h:134:31: warning: 'jpg_ccinfo' defined but not used [-Wunused-variable]
  static jpeg_compress_struct *jpg_ccinfo[101];
                               ^~~~~~~~~~
zm_image.h:133:24: warning: 'y_b_table' defined but not used [-Wunused-variable]
  static unsigned char *y_b_table;
                        ^~~~~~~~~
zm_image.h:132:24: warning: 'y_g_table' defined but not used [-Wunused-variable]
  static unsigned char *y_g_table;
                        ^~~~~~~~~
zm_image.h:131:24: warning: 'y_r_table' defined but not used [-Wunused-variable]
  static unsigned char *y_r_table;
                        ^~~~~~~~~
zm_image.h:130:24: warning: 'abs_table' defined but not used [-Wunused-variable]
  static unsigned char *abs_table;
                        ^~~~~~~~~
make[2]: *** [Makefile:634: zm_event.o] Error 1
make[2]: Leaving directory '/tmp/B._6255T/BUILD/ZoneMinder-1.28.0/src'
make[2]: Entering directory '/tmp/B._6255T/BUILD/ZoneMinder-1.28.0/src'
i686-pld-linux-g++ -DHAVE_CONFIG_H -I. -I..  -I/usr/include -I/usr/include -Iyes/include -D__STDC_CONSTANT_MACROS -Wall -finline-functions -fomit-frame-pointer -Iyes/include -D__STDC_CONSTANT_MACROS  -D__STDC_CONSTANT_MACROS -O2 -fwrapv -pipe -Wformat -Werror=format-security -gdwarf-4 -fno-debug-types-section -fvar-tracking-assignments -g2 -Wp,-D_FORTIFY_SOURCE=2 -D__STDC_CONSTANT_MACROS -fstack-protector-strong --param=ssp-buffer-size=4 -fomit-frame-pointer -march=i686 -fasynchronous-unwind-tables -mtune=pentium4 -gdwarf-4 -fno-debug-types-section -fvar-tracking-assignments -g2  -MT zm_db.o -MD -MP -MF .deps/zm_db.Tpo -c -o zm_db.o zm_db.cpp
mv -f .deps/zm_db.Tpo .deps/zm_db.Po
make[2]: Leaving directory '/tmp/B._6255T/BUILD/ZoneMinder-1.28.0/src'
make[2]: Entering directory '/tmp/B._6255T/BUILD/ZoneMinder-1.28.0/src'
i686-pld-linux-g++ -DHAVE_CONFIG_H -I. -I..  -I/usr/include -I/usr/include -Iyes/include -D__STDC_CONSTANT_MACROS -Wall -finline-functions -fomit-frame-pointer -Iyes/include -D__STDC_CONSTANT_MACROS  -D__STDC_CONSTANT_MACROS -O2 -fwrapv -pipe -Wformat -Werror=format-security -gdwarf-4 -fno-debug-types-section -fvar-tracking-assignments -g2 -Wp,-D_FORTIFY_SOURCE=2 -D__STDC_CONSTANT_MACROS -fstack-protector-strong --param=ssp-buffer-size=4 -fomit-frame-pointer -march=i686 -fasynchronous-unwind-tables -mtune=pentium4 -gdwarf-4 -fno-debug-types-section -fvar-tracking-assignments -g2  -MT zm_comms.o -MD -MP -MF .deps/zm_comms.Tpo -c -o zm_comms.o zm_comms.cpp
zm_comms.cpp: In member function 'virtual bool Socket::socket()':
zm_comms.cpp:250:5: warning: this 'if' clause does not guard... [-Wmisleading-indentation]
     if ( mSd >= 0 )
     ^~
zm_comms.cpp:253:2: note: ...this statement, but the latter is misleadingly indented as if it is guarded by the 'if'
  if ( (mSd = ::socket( getDomain(), getType(), 0 ) ) < 0 )
  ^~
zm_comms.cpp: In member function 'bool TcpInetServer::accept(TcpInetSocket*&)':
zm_comms.cpp:528:5: warning: this 'if' clause does not guard... [-Wmisleading-indentation]
     if ( !Socket::accept( newSd ) )
     ^~
zm_comms.cpp:531:2: note: ...this statement, but the latter is misleadingly indented as if it is guarded by the 'if'
  newSocket = new TcpInetSocket( *this, newSd );
  ^~~~~~~~~
zm_comms.cpp: In member function 'bool TcpUnixServer::accept(TcpUnixSocket*&)':
zm_comms.cpp:541:5: warning: this 'if' clause does not guard... [-Wmisleading-indentation]
     if ( !Socket::accept( newSd ) )
     ^~
zm_comms.cpp:544:2: note: ...this statement, but the latter is misleadingly indented as if it is guarded by the 'if'
  newSocket = new TcpUnixSocket( *this, newSd );
  ^~~~~~~~~
mv -f .deps/zm_comms.Tpo .deps/zm_comms.Po
make[2]: Leaving directory '/tmp/B._6255T/BUILD/ZoneMinder-1.28.0/src'
make[2]: Entering directory '/tmp/B._6255T/BUILD/ZoneMinder-1.28.0/src'
i686-pld-linux-g++ -DHAVE_CONFIG_H -I. -I..  -I/usr/include -I/usr/include -Iyes/include -D__STDC_CONSTANT_MACROS -Wall -finline-functions -fomit-frame-pointer -Iyes/include -D__STDC_CONSTANT_MACROS  -D__STDC_CONSTANT_MACROS -O2 -fwrapv -pipe -Wformat -Werror=format-security -gdwarf-4 -fno-debug-types-section -fvar-tracking-assignments -g2 -Wp,-D_FORTIFY_SOURCE=2 -D__STDC_CONSTANT_MACROS -fstack-protector-strong --param=ssp-buffer-size=4 -fomit-frame-pointer -march=i686 -fasynchronous-unwind-tables -mtune=pentium4 -gdwarf-4 -fno-debug-types-section -fvar-tracking-assignments -g2  -MT zm_logger.o -MD -MP -MF .deps/zm_logger.Tpo -c -o zm_logger.o zm_logger.cpp
mv -f .deps/zm_logger.Tpo .deps/zm_logger.Po
make[2]: Leaving directory '/tmp/B._6255T/BUILD/ZoneMinder-1.28.0/src'
make[1]: *** [Makefile:517: all-recursive] Error 1
make: *** [Makefile:425: all] Error 2
error: Bad exit status from /tmp/B._6255T/BUILD/tmp/rpm-tmp.10826 (%build)


RPM build errors:
    Bad exit status from /tmp/B._6255T/BUILD/tmp/rpm-tmp.10826 (%build)
ended at: Fri Apr 14 16:06:45 2017, done in 0:00:24.427664
error: No files produced.
+ chmod -R u+rwX /tmp/B._6255T/BUILD
+ rm -rf /tmp/B._6255T/tmp /tmp/B._6255T/BUILD
+ rm -rf /tmp/B._6255T
Begin-PLD-Builder-Info
Build-Time: user:21.83s sys:2.67s real:29.08s (faults io:0 non-io:1228225)

End-PLD-Builder-Info
[Back to list of logs] [View rpm -qa of builder]