FailedOk

th/SRPMS[OK]
th/x32[OK]
th/i686[OK]
th/x86_64[OK]

ac/SRPMS[OK]
ac/i386[OK]
ac/i586[OK]
ac/i686[OK]
ac/alpha[OK]
ac/amd64[OK]
ac/athlon[OK]
ac/ppc[OK]
ac/sparc[OK]
ac/sparc64[OK]

Advanced Search
main()
Powered by PLD Linux
(c) 2002-2020 PLD Team
$Revision: 1.37 $
Powered by brain.
Your IP: 34.204.176.125

libafdt 9cdb14b8-066b-415e-ad3c-8786b14d97df

Status:Failed
Source URL:https://buildlogs.pld-linux.org/pld/th/i686/FAIL/libafdt,9cdb14b8-066b-415e-ad3c-8786b14d97df.bz2
text/plain URL:View!
rpm -qa of builder:View!
Date:2020/02/08 18:18:57
Runtime:0:00:13.331673

Toc:

  • prep
  • Executing(%prep): /bin/sh -e /tmp/B.683z3i/BUILD/tmp/rpm-tmp.41822
  • build
  • Executing(%build): /bin/sh -e /tmp/B.683z3i/BUILD/tmp/rpm-tmp.41822
  • make check
  • + /usr/bin/make -Otarget -j9 check
  • error 1
  • FAIL: test/runtests.py
  • error 2
  • # XFAIL: 0
  • error 3
  • # FAIL: 1
  • error 4
  • # ERROR: 0
  • error 5
  • make[2]: *** [Makefile:932: test-suite.log] Error 1
  • error 6
  • make[1]: *** [Makefile:1040: check-TESTS] Error 2
  • error 7
  • error: Bad exit status from /tmp/B.683z3i/BUILD/tmp/rpm-tmp.41822 (%build)
  • error 8
  • RPM build errors:
  • error 9
  • error: No files produced.

Content:

request from: baggins
checking if we should skip the build
started at: Sat Feb  8 18:18:40 2020
killing old processes on a builder
sending signal 9 to pid -1
Killed
cleaning up /tmp
fetching https://srcbuilder.pld-linux.org/th//srpms/9cdb14b8-066b-415e-ad3c-8786b14d97df/libafdt-0.1.0-5.src.rpm
fetched 308158 bytes, 501.7 K/s
installing srpm: libafdt-0.1.0-5.src.rpm
+ install -d /tmp/B.683z3i/BUILD /tmp/B.683z3i/RPMS
+ LC_ALL=en_US.UTF-8
+ rpm -qp --changelog libafdt-0.1.0-5.src.rpm
* Sat Feb 08 2020 PLD Linux Team <feedback@pld-linux.org>
- For complete changelog see: http://git.pld-linux.org/?p=packages/libafdt.git;a=log;h=master
* Sat Feb 08 2020 Jan Rękorajski <baggins@pld-linux.org> 90f74b1
- release 5 (by relup.sh) + rpm -Uhv --nodeps --define '_topdir /tmp/B.683z3i' --define '_specdir %{_topdir}' --define '_sourcedir %{_specdir}' --define '_rpmdir %{_topdir}/RPMS' --define '_builddir %{_topdir}/BUILD' libafdt-0.1.0-5.src.rpm Preparing... ################################################## libafdt ################################################## + rm -f libafdt-0.1.0-5.src.rpm + install -m 700 -d /tmp/B.683z3i/BUILD/tmp + TMPDIR=/tmp/B.683z3i/BUILD/tmp + exec nice -n 0 rpmbuild -bp --short-circuit --nodeps --define '_topdir /tmp/B.683z3i' --define '_specdir %{_topdir}' --define '_sourcedir %{_specdir}' --define '_rpmdir %{_topdir}/RPMS' --define '_builddir %{_topdir}/BUILD' --target i686-pld-linux --define 'prep exit 0' /tmp/B.683z3i/libafdt.spec Building target platforms: i686-pld-linux checking BuildConflict-ing packages no BuildConflicts found checking BR rpm: Building target platforms: i686-pld-linux no BR needed building RPM using: set -ex; : build-id: 9cdb14b8-066b-415e-ad3c-8786b14d97df; TMPDIR=/tmp/B.683z3i/BUILD/tmp exec nice -n 0 rpmbuild -bb --define '_smp_mflags -j9' --define '_make_opts -Otarget' --define '_pld_builder 1' --define '_topdir /tmp/B.683z3i' --define '_specdir %{_topdir}' --define '_sourcedir %{_specdir}' --define '_rpmdir %{_topdir}/RPMS' --define '_builddir %{_topdir}/BUILD' --target i686-pld-linux /tmp/B.683z3i/libafdt.spec + : build-id: 9cdb14b8-066b-415e-ad3c-8786b14d97df + TMPDIR=/tmp/B.683z3i/BUILD/tmp + exec nice -n 0 rpmbuild -bb --define '_smp_mflags -j9' --define '_make_opts -Otarget' --define '_pld_builder 1' --define '_topdir /tmp/B.683z3i' --define '_specdir %{_topdir}' --define '_sourcedir %{_specdir}' --define '_rpmdir %{_topdir}/RPMS' --define '_builddir %{_topdir}/BUILD' --target i686-pld-linux /tmp/B.683z3i/libafdt.spec Building target platforms: i686-pld-linux Executing(%prep): /bin/sh -e /tmp/B.683z3i/BUILD/tmp/rpm-tmp.41822 + umask 022 + cd /tmp/B.683z3i/BUILD + cd /tmp/B.683z3i/BUILD + rm -rf libafdt-0.1.0 + /bin/gzip -dc /tmp/B.683z3i/libafdt-0.1.0.tar.gz + /bin/tar -xf - + STATUS=0 + '[' 0 -ne 0 ']' + cd libafdt-0.1.0 + /bin/id -u + '[' 1001 '=' 0 ']' + /bin/id -u + '[' 1001 '=' 0 ']' + /bin/chmod -Rf a+rX,u+w,g-w,o-w . + echo 'Patch #0 (libafdt-link.patch):' Patch #0 (libafdt-link.patch): + '[' -f /tmp/B.683z3i/libafdt-link.patch ']' + /bin/cat /tmp/B.683z3i/libafdt-link.patch + /usr/bin/patch -s -p1 + exit 0 Executing(%build): /bin/sh -e /tmp/B.683z3i/BUILD/tmp/rpm-tmp.41822 TMP=/home/users/builder/tmp HOME=/home/users/builder PATH=/home/users/builder/GNUstep/Tools:/bin:/usr/bin:/usr/local/bin:/home/users/builder/bin TMPDIR=/tmp/B.683z3i/BUILD/tmp + umask 022 + cd /tmp/B.683z3i/BUILD + cd libafdt-0.1.0 + libtoolize --copy --force --install libtoolize: putting auxiliary files in '.'. libtoolize: copying file './config.guess' libtoolize: copying file './config.sub' libtoolize: copying file './install-sh' libtoolize: copying file './ltmain.sh' libtoolize: putting macros in AC_CONFIG_MACRO_DIRS, 'm4'. libtoolize: copying file 'm4/libtool.m4' libtoolize: copying file 'm4/ltoptions.m4' libtoolize: copying file 'm4/ltsugar.m4' libtoolize: copying file 'm4/ltversion.m4' libtoolize: copying file 'm4/lt~obsolete.m4' + aclocal -I m4 + autoconf + automake -a -c -f --foreign configure.ac:9: installing './compile' configure.ac:7: installing './missing' Makefile.am:10: warning: source file 'src/util.c' is in a subdirectory, Makefile.am:10: but option 'subdir-objects' is disabled automake: warning: possible forward-incompatibility. automake: At least a source file is in a subdirectory, but the 'subdir-objects' automake: automake option hasn't been enabled. For now, the corresponding output automake: object file(s) will be placed in the top-level directory. However, automake: this behaviour will change in future Automake versions: they will automake: unconditionally cause object files to be placed in the same subdirectory automake: of the corresponding sources. automake: You are advised to start using 'subdir-objects' option throughout your automake: project, to avoid future incompatibilities. Makefile.am:10: warning: source file 'src/lowlevel.c' is in a subdirectory, Makefile.am:10: but option 'subdir-objects' is disabled Makefile.am:10: warning: source file 'src/sync.c' is in a subdirectory, Makefile.am:10: but option 'subdir-objects' is disabled Makefile.am:10: warning: source file 'src/strlcpy.c' is in a subdirectory, Makefile.am:10: but option 'subdir-objects' is disabled Makefile.am:19: warning: source file 'src/async.c' is in a subdirectory, Makefile.am:19: but option 'subdir-objects' is disabled Makefile.am:34: warning: source file 'test/catter.c' is in a subdirectory, Makefile.am:34: but option 'subdir-objects' is disabled Makefile.am:45: warning: source file 'test/server.c' is in a subdirectory, Makefile.am:45: but option 'subdir-objects' is disabled Makefile.am:38: warning: source file 'test/sync_catter.c' is in a subdirectory, Makefile.am:38: but option 'subdir-objects' is disabled Makefile.am: installing './depcomp' parallel-tests: installing './test-driver' + ./configure 'LDFLAGS=-Wl,--as-needed -Wl,--no-copy-dt-needed-entries -Wl,-z,relro -Wl,-z,combreloc ' 'CFLAGS=-O2 -fwrapv -pipe -Wformat -Werror=format-security -gdwarf-4 -fno-debug-types-section -fvar-tracking-assignments -g2 -Wp,-D_FORTIFY_SOURCE=2 -fstack-protector-strong --param=ssp-buffer-size=4 -Werror=trampolines -fomit-frame-pointer -march=i686 -fasynchronous-unwind-tables -mtune=pentium4 -gdwarf-4 -fno-debug-types-section -fvar-tracking-assignments -g2 ' 'CXXFLAGS=-O2 -fwrapv -pipe -Wformat -Werror=format-security -gdwarf-4 -fno-debug-types-section -fvar-tracking-assignments -g2 -Wp,-D_FORTIFY_SOURCE=2 -fstack-protector-strong --param=ssp-buffer-size=4 -Werror=trampolines -fomit-frame-pointer -march=i686 -fasynchronous-unwind-tables -mtune=pentium4 -gdwarf-4 -fno-debug-types-section -fvar-tracking-assignments -g2 ' 'FFLAGS=-O2 -fwrapv -pipe -Wformat -Werror=format-security -gdwarf-4 -fno-debug-types-section -fvar-tracking-assignments -g2 -Wp,-D_FORTIFY_SOURCE=2 -fstack-protector-strong --param=ssp-buffer-size=4 -Werror=trampolines -fomit-frame-pointer -march=i686 -fasynchronous-unwind-tables -mtune=pentium4 -gdwarf-4 -fno-debug-types-section -fvar-tracking-assignments -g2 ' 'FCFLAGS=-O2 -fwrapv -pipe -Wformat -Werror=format-security -gdwarf-4 -fno-debug-types-section -fvar-tracking-assignments -g2 -Wp,-D_FORTIFY_SOURCE=2 -fstack-protector-strong --param=ssp-buffer-size=4 -Werror=trampolines -fomit-frame-pointer -march=i686 -fasynchronous-unwind-tables -mtune=pentium4 -gdwarf-4 -fno-debug-types-section -fvar-tracking-assignments -g2 ' 'CPPFLAGS=' 'CC=i686-pld-linux-gcc' 'CXX=i686-pld-linux-g++' '--host=i686-pld-linux' '--build=i686-pld-linux' '--prefix=/usr' '--exec-prefix=/usr' '--bindir=/usr/bin' '--sbindir=/usr/sbin' '--sysconfdir=/etc' '--datadir=/usr/share' '--includedir=/usr/include' '--libdir=/usr/lib' '--libexecdir=/usr/libexec' '--localstatedir=/var' '--sharedstatedir=/var/lib' '--mandir=/usr/share/man' '--infodir=/usr/share/info' '--x-libraries=/usr/lib' --enable-shared checking for a BSD-compatible install... /usr/bin/install -c checking whether build environment is sane... yes checking for a thread-safe mkdir -p... /bin/mkdir -p checking for mawk... mawk checking whether make sets $(MAKE)... yes checking whether make supports nested variables... yes checking for i686-pld-linux-gcc... i686-pld-linux-gcc checking whether the C compiler works... yes checking for C compiler default output file name... a.out checking for suffix of executables... checking whether we are cross compiling... no checking for suffix of object files... o checking whether we are using the GNU C compiler... yes checking whether i686-pld-linux-gcc accepts -g... yes checking for i686-pld-linux-gcc option to accept ISO C89... none needed checking whether i686-pld-linux-gcc understands -c and -o together... yes checking whether make supports the include directive... yes (GNU style) checking dependency style of i686-pld-linux-gcc... gcc3 checking whether make sets $(MAKE)... (cached) yes checking build system type... i686-pld-linux-gnu checking host system type... i686-pld-linux-gnu checking how to print strings... print -r checking for a sed that does not truncate output... /bin/sed checking for grep that handles long lines and -e... /bin/grep checking for egrep... /bin/grep -E checking for fgrep... /bin/grep -F checking for ld used by i686-pld-linux-gcc... /usr/bin/ld checking if the linker (/usr/bin/ld) is GNU ld... yes checking for BSD- or MS-compatible name lister (nm)... /usr/bin/nm -B checking the name lister (/usr/bin/nm -B) interface... BSD nm checking whether ln -s works... yes checking the maximum length of command line arguments... 1572864 checking how to convert i686-pld-linux-gnu file names to i686-pld-linux-gnu format... func_convert_file_noop checking how to convert i686-pld-linux-gnu file names to toolchain format... func_convert_file_noop checking for /usr/bin/ld option to reload object files... -r checking for i686-pld-linux-objdump... no checking for objdump... objdump checking how to recognize dependent libraries... pass_all checking for i686-pld-linux-dlltool... no checking for dlltool... no checking how to associate runtime and link libraries... print -r -- checking for i686-pld-linux-ar... no checking for ar... ar checking for archiver @FILE support... @ checking for i686-pld-linux-strip... no checking for strip... strip checking for i686-pld-linux-ranlib... no checking for ranlib... ranlib checking command to parse /usr/bin/nm -B output from i686-pld-linux-gcc object... ok checking for sysroot... no checking for a working dd... /bin/dd checking how to truncate binary pipes... /bin/dd bs=4096 count=1 checking for i686-pld-linux-mt... no checking for mt... no checking if : is a manifest tool... no checking how to run the C preprocessor... i686-pld-linux-gcc -E checking for ANSI C header files... yes checking for sys/types.h... yes checking for sys/stat.h... yes checking for stdlib.h... yes checking for string.h... yes checking for memory.h... yes checking for strings.h... yes checking for inttypes.h... yes checking for stdint.h... yes checking for unistd.h... yes checking for dlfcn.h... yes checking for objdir... .libs checking if i686-pld-linux-gcc supports -fno-rtti -fno-exceptions... no checking for i686-pld-linux-gcc option to produce PIC... -fPIC -DPIC checking if i686-pld-linux-gcc PIC flag -fPIC -DPIC works... yes checking if i686-pld-linux-gcc static flag -static works... yes checking if i686-pld-linux-gcc supports -c -o file.o... yes checking if i686-pld-linux-gcc supports -c -o file.o... (cached) yes checking whether the i686-pld-linux-gcc linker (/usr/bin/ld) supports shared libraries... yes checking whether -lc should be explicitly linked in... no checking dynamic linker characteristics... GNU/Linux ld.so checking how to hardcode library paths into programs... immediate checking whether stripping libraries is possible... yes checking if libtool supports shared libraries... yes checking whether to build shared libraries... yes checking whether to build static libraries... yes checking for inline... inline checking for stdbool.h that conforms to C99... yes checking for _Bool... yes checking arpa/inet.h usability... yes checking arpa/inet.h presence... yes checking for arpa/inet.h... yes checking netinet/in.h usability... yes checking netinet/in.h presence... yes checking for netinet/in.h... yes checking stddef.h usability... yes checking stddef.h presence... yes checking for stddef.h... yes checking for stdint.h... (cached) yes checking for string.h... (cached) yes checking sys/socket.h usability... yes checking sys/socket.h presence... yes checking for sys/socket.h... yes checking sys/time.h usability... yes checking sys/time.h presence... yes checking for sys/time.h... yes checking for unistd.h... (cached) yes checking for size_t... yes checking for ssize_t... yes checking for uint32_t... yes checking for uint8_t... yes checking for stdlib.h... (cached) yes checking for GNU libc compatible malloc... yes checking for memset... yes checking for socket... yes checking for strerror... yes checking whether AF_LOCAL is declared... yes checking whether PF_LOCAL is declared... yes checking for libevent >= 2.0.9... yes checking for a Python interpreter with version >= 2.6... python checking for python... /usr/bin/python checking for python version... 2.7 checking for python platform... linux2 checking for python script directory... ${prefix}/share/python2.7/site-packages checking for python extension module directory... ${exec_prefix}/lib/python2.7/site-packages checking that generated files are newer than configure... done configure: creating ./config.status config.status: creating Makefile config.status: creating config.h config.status: executing depfiles commands config.status: executing libtool commands + /usr/bin/make -Otarget -j9 (CDPATH="${ZSH_VERSION+.}:" && cd . && /bin/sh /tmp/B.683z3i/BUILD/libafdt-0.1.0/missing autoheader) rm -f stamp-h1 touch config.h.in cd . && /bin/sh ./config.status config.h config.status: creating config.h /usr/bin/make all-am make[1]: Entering directory '/tmp/B.683z3i/BUILD/libafdt-0.1.0' i686-pld-linux-gcc -DHAVE_CONFIG_H -I. -I ./src -O2 -fwrapv -pipe -Wformat -Werror=format-security -gdwarf-4 -fno-debug-types-section -fvar-tracking-assignments -g2 -Wp,-D_FORTIFY_SOURCE=2 -fstack-protector-strong --param=ssp-buffer-size=4 -Werror=trampolines -fomit-frame-pointer -march=i686 -fasynchronous-unwind-tables -mtune=pentium4 -gdwarf-4 -fno-debug-types-section -fvar-tracking-assignments -g2 -MT sync_catter-sync_catter.o -MD -MP -MF .deps/sync_catter-sync_catter.Tpo -c -o sync_catter-sync_catter.o `test -f 'test/sync_catter.c' || echo './'`test/sync_catter.c mv -f .deps/sync_catter-sync_catter.Tpo .deps/sync_catter-sync_catter.Po make[1]: Leaving directory '/tmp/B.683z3i/BUILD/libafdt-0.1.0' make[1]: Entering directory '/tmp/B.683z3i/BUILD/libafdt-0.1.0' i686-pld-linux-gcc -DHAVE_CONFIG_H -I. -I ./src -O2 -fwrapv -pipe -Wformat -Werror=format-security -gdwarf-4 -fno-debug-types-section -fvar-tracking-assignments -g2 -Wp,-D_FORTIFY_SOURCE=2 -fstack-protector-strong --param=ssp-buffer-size=4 -Werror=trampolines -fomit-frame-pointer -march=i686 -fasynchronous-unwind-tables -mtune=pentium4 -gdwarf-4 -fno-debug-types-section -fvar-tracking-assignments -g2 -MT catter-catter.o -MD -MP -MF .deps/catter-catter.Tpo -c -o catter-catter.o `test -f 'test/catter.c' || echo './'`test/catter.c In file included from /usr/include/bits/libc-header-start.h:33, from /usr/include/stdlib.h:25, from test/catter.c:16: /usr/include/features.h:185:3: warning: #warning "_BSD_SOURCE and _SVID_SOURCE are deprecated, use _DEFAULT_SOURCE" [-Wcpp] 185 | # warning "_BSD_SOURCE and _SVID_SOURCE are deprecated, use _DEFAULT_SOURCE" | ^~~~~~~ mv -f .deps/catter-catter.Tpo .deps/catter-catter.Po make[1]: Leaving directory '/tmp/B.683z3i/BUILD/libafdt-0.1.0' make[1]: Entering directory '/tmp/B.683z3i/BUILD/libafdt-0.1.0' /bin/sh ./libtool --tag=CC --mode=compile i686-pld-linux-gcc -DHAVE_CONFIG_H -I. -O2 -fwrapv -pipe -Wformat -Werror=format-security -gdwarf-4 -fno-debug-types-section -fvar-tracking-assignments -g2 -Wp,-D_FORTIFY_SOURCE=2 -fstack-protector-strong --param=ssp-buffer-size=4 -Werror=trampolines -fomit-frame-pointer -march=i686 -fasynchronous-unwind-tables -mtune=pentium4 -gdwarf-4 -fno-debug-types-section -fvar-tracking-assignments -g2 -MT util.lo -MD -MP -MF .deps/util.Tpo -c -o util.lo `test -f 'src/util.c' || echo './'`src/util.c libtool: compile: i686-pld-linux-gcc -DHAVE_CONFIG_H -I. -O2 -fwrapv -pipe -Wformat -Werror=format-security -gdwarf-4 -fno-debug-types-section -fvar-tracking-assignments -g2 -Wp,-D_FORTIFY_SOURCE=2 -fstack-protector-strong --param=ssp-buffer-size=4 -Werror=trampolines -fomit-frame-pointer -march=i686 -fasynchronous-unwind-tables -mtune=pentium4 -gdwarf-4 -fno-debug-types-section -fvar-tracking-assignments -g2 -MT util.lo -MD -MP -MF .deps/util.Tpo -c src/util.c -fPIC -DPIC -o .libs/util.o libtool: compile: i686-pld-linux-gcc -DHAVE_CONFIG_H -I. -O2 -fwrapv -pipe -Wformat -Werror=format-security -gdwarf-4 -fno-debug-types-section -fvar-tracking-assignments -g2 -Wp,-D_FORTIFY_SOURCE=2 -fstack-protector-strong --param=ssp-buffer-size=4 -Werror=trampolines -fomit-frame-pointer -march=i686 -fasynchronous-unwind-tables -mtune=pentium4 -gdwarf-4 -fno-debug-types-section -fvar-tracking-assignments -g2 -MT util.lo -MD -MP -MF .deps/util.Tpo -c src/util.c -o util.o >/dev/null 2>&1 mv -f .deps/util.Tpo .deps/util.Plo make[1]: Leaving directory '/tmp/B.683z3i/BUILD/libafdt-0.1.0' make[1]: Entering directory '/tmp/B.683z3i/BUILD/libafdt-0.1.0' /bin/sh ./libtool --tag=CC --mode=compile i686-pld-linux-gcc -DHAVE_CONFIG_H -I. -O2 -fwrapv -pipe -Wformat -Werror=format-security -gdwarf-4 -fno-debug-types-section -fvar-tracking-assignments -g2 -Wp,-D_FORTIFY_SOURCE=2 -fstack-protector-strong --param=ssp-buffer-size=4 -Werror=trampolines -fomit-frame-pointer -march=i686 -fasynchronous-unwind-tables -mtune=pentium4 -gdwarf-4 -fno-debug-types-section -fvar-tracking-assignments -g2 -MT strlcpy.lo -MD -MP -MF .deps/strlcpy.Tpo -c -o strlcpy.lo `test -f 'src/strlcpy.c' || echo './'`src/strlcpy.c libtool: compile: i686-pld-linux-gcc -DHAVE_CONFIG_H -I. -O2 -fwrapv -pipe -Wformat -Werror=format-security -gdwarf-4 -fno-debug-types-section -fvar-tracking-assignments -g2 -Wp,-D_FORTIFY_SOURCE=2 -fstack-protector-strong --param=ssp-buffer-size=4 -Werror=trampolines -fomit-frame-pointer -march=i686 -fasynchronous-unwind-tables -mtune=pentium4 -gdwarf-4 -fno-debug-types-section -fvar-tracking-assignments -g2 -MT strlcpy.lo -MD -MP -MF .deps/strlcpy.Tpo -c src/strlcpy.c -fPIC -DPIC -o .libs/strlcpy.o libtool: compile: i686-pld-linux-gcc -DHAVE_CONFIG_H -I. -O2 -fwrapv -pipe -Wformat -Werror=format-security -gdwarf-4 -fno-debug-types-section -fvar-tracking-assignments -g2 -Wp,-D_FORTIFY_SOURCE=2 -fstack-protector-strong --param=ssp-buffer-size=4 -Werror=trampolines -fomit-frame-pointer -march=i686 -fasynchronous-unwind-tables -mtune=pentium4 -gdwarf-4 -fno-debug-types-section -fvar-tracking-assignments -g2 -MT strlcpy.lo -MD -MP -MF .deps/strlcpy.Tpo -c src/strlcpy.c -o strlcpy.o >/dev/null 2>&1 mv -f .deps/strlcpy.Tpo .deps/strlcpy.Plo make[1]: Leaving directory '/tmp/B.683z3i/BUILD/libafdt-0.1.0' make[1]: Entering directory '/tmp/B.683z3i/BUILD/libafdt-0.1.0' /bin/sh ./libtool --tag=CC --mode=compile i686-pld-linux-gcc -DHAVE_CONFIG_H -I. -O2 -fwrapv -pipe -Wformat -Werror=format-security -gdwarf-4 -fno-debug-types-section -fvar-tracking-assignments -g2 -Wp,-D_FORTIFY_SOURCE=2 -fstack-protector-strong --param=ssp-buffer-size=4 -Werror=trampolines -fomit-frame-pointer -march=i686 -fasynchronous-unwind-tables -mtune=pentium4 -gdwarf-4 -fno-debug-types-section -fvar-tracking-assignments -g2 -MT sync.lo -MD -MP -MF .deps/sync.Tpo -c -o sync.lo `test -f 'src/sync.c' || echo './'`src/sync.c libtool: compile: i686-pld-linux-gcc -DHAVE_CONFIG_H -I. -O2 -fwrapv -pipe -Wformat -Werror=format-security -gdwarf-4 -fno-debug-types-section -fvar-tracking-assignments -g2 -Wp,-D_FORTIFY_SOURCE=2 -fstack-protector-strong --param=ssp-buffer-size=4 -Werror=trampolines -fomit-frame-pointer -march=i686 -fasynchronous-unwind-tables -mtune=pentium4 -gdwarf-4 -fno-debug-types-section -fvar-tracking-assignments -g2 -MT sync.lo -MD -MP -MF .deps/sync.Tpo -c src/sync.c -fPIC -DPIC -o .libs/sync.o libtool: compile: i686-pld-linux-gcc -DHAVE_CONFIG_H -I. -O2 -fwrapv -pipe -Wformat -Werror=format-security -gdwarf-4 -fno-debug-types-section -fvar-tracking-assignments -g2 -Wp,-D_FORTIFY_SOURCE=2 -fstack-protector-strong --param=ssp-buffer-size=4 -Werror=trampolines -fomit-frame-pointer -march=i686 -fasynchronous-unwind-tables -mtune=pentium4 -gdwarf-4 -fno-debug-types-section -fvar-tracking-assignments -g2 -MT sync.lo -MD -MP -MF .deps/sync.Tpo -c src/sync.c -o sync.o >/dev/null 2>&1 mv -f .deps/sync.Tpo .deps/sync.Plo make[1]: Leaving directory '/tmp/B.683z3i/BUILD/libafdt-0.1.0' make[1]: Entering directory '/tmp/B.683z3i/BUILD/libafdt-0.1.0' /bin/sh ./libtool --tag=CC --mode=compile i686-pld-linux-gcc -DHAVE_CONFIG_H -I. -O2 -fwrapv -pipe -Wformat -Werror=format-security -gdwarf-4 -fno-debug-types-section -fvar-tracking-assignments -g2 -Wp,-D_FORTIFY_SOURCE=2 -fstack-protector-strong --param=ssp-buffer-size=4 -Werror=trampolines -fomit-frame-pointer -march=i686 -fasynchronous-unwind-tables -mtune=pentium4 -gdwarf-4 -fno-debug-types-section -fvar-tracking-assignments -g2 -MT lowlevel.lo -MD -MP -MF .deps/lowlevel.Tpo -c -o lowlevel.lo `test -f 'src/lowlevel.c' || echo './'`src/lowlevel.c libtool: compile: i686-pld-linux-gcc -DHAVE_CONFIG_H -I. -O2 -fwrapv -pipe -Wformat -Werror=format-security -gdwarf-4 -fno-debug-types-section -fvar-tracking-assignments -g2 -Wp,-D_FORTIFY_SOURCE=2 -fstack-protector-strong --param=ssp-buffer-size=4 -Werror=trampolines -fomit-frame-pointer -march=i686 -fasynchronous-unwind-tables -mtune=pentium4 -gdwarf-4 -fno-debug-types-section -fvar-tracking-assignments -g2 -MT lowlevel.lo -MD -MP -MF .deps/lowlevel.Tpo -c src/lowlevel.c -fPIC -DPIC -o .libs/lowlevel.o libtool: compile: i686-pld-linux-gcc -DHAVE_CONFIG_H -I. -O2 -fwrapv -pipe -Wformat -Werror=format-security -gdwarf-4 -fno-debug-types-section -fvar-tracking-assignments -g2 -Wp,-D_FORTIFY_SOURCE=2 -fstack-protector-strong --param=ssp-buffer-size=4 -Werror=trampolines -fomit-frame-pointer -march=i686 -fasynchronous-unwind-tables -mtune=pentium4 -gdwarf-4 -fno-debug-types-section -fvar-tracking-assignments -g2 -MT lowlevel.lo -MD -MP -MF .deps/lowlevel.Tpo -c src/lowlevel.c -o lowlevel.o >/dev/null 2>&1 mv -f .deps/lowlevel.Tpo .deps/lowlevel.Plo make[1]: Leaving directory '/tmp/B.683z3i/BUILD/libafdt-0.1.0' make[1]: Entering directory '/tmp/B.683z3i/BUILD/libafdt-0.1.0' /bin/sh ./libtool --tag=CC --mode=compile i686-pld-linux-gcc -DHAVE_CONFIG_H -I. -O2 -fwrapv -pipe -Wformat -Werror=format-security -gdwarf-4 -fno-debug-types-section -fvar-tracking-assignments -g2 -Wp,-D_FORTIFY_SOURCE=2 -fstack-protector-strong --param=ssp-buffer-size=4 -Werror=trampolines -fomit-frame-pointer -march=i686 -fasynchronous-unwind-tables -mtune=pentium4 -gdwarf-4 -fno-debug-types-section -fvar-tracking-assignments -g2 -MT async.lo -MD -MP -MF .deps/async.Tpo -c -o async.lo `test -f 'src/async.c' || echo './'`src/async.c libtool: compile: i686-pld-linux-gcc -DHAVE_CONFIG_H -I. -O2 -fwrapv -pipe -Wformat -Werror=format-security -gdwarf-4 -fno-debug-types-section -fvar-tracking-assignments -g2 -Wp,-D_FORTIFY_SOURCE=2 -fstack-protector-strong --param=ssp-buffer-size=4 -Werror=trampolines -fomit-frame-pointer -march=i686 -fasynchronous-unwind-tables -mtune=pentium4 -gdwarf-4 -fno-debug-types-section -fvar-tracking-assignments -g2 -MT async.lo -MD -MP -MF .deps/async.Tpo -c src/async.c -fPIC -DPIC -o .libs/async.o In file included from /usr/include/bits/libc-header-start.h:33, from /usr/include/stdlib.h:25, from src/async.c:4: /usr/include/features.h:185:3: warning: #warning "_BSD_SOURCE and _SVID_SOURCE are deprecated, use _DEFAULT_SOURCE" [-Wcpp] 185 | # warning "_BSD_SOURCE and _SVID_SOURCE are deprecated, use _DEFAULT_SOURCE" | ^~~~~~~ libtool: compile: i686-pld-linux-gcc -DHAVE_CONFIG_H -I. -O2 -fwrapv -pipe -Wformat -Werror=format-security -gdwarf-4 -fno-debug-types-section -fvar-tracking-assignments -g2 -Wp,-D_FORTIFY_SOURCE=2 -fstack-protector-strong --param=ssp-buffer-size=4 -Werror=trampolines -fomit-frame-pointer -march=i686 -fasynchronous-unwind-tables -mtune=pentium4 -gdwarf-4 -fno-debug-types-section -fvar-tracking-assignments -g2 -MT async.lo -MD -MP -MF .deps/async.Tpo -c src/async.c -o async.o >/dev/null 2>&1 mv -f .deps/async.Tpo .deps/async.Plo make[1]: Leaving directory '/tmp/B.683z3i/BUILD/libafdt-0.1.0' make[1]: Entering directory '/tmp/B.683z3i/BUILD/libafdt-0.1.0' /bin/sh ./libtool --tag=CC --mode=link i686-pld-linux-gcc -O2 -fwrapv -pipe -Wformat -Werror=format-security -gdwarf-4 -fno-debug-types-section -fvar-tracking-assignments -g2 -Wp,-D_FORTIFY_SOURCE=2 -fstack-protector-strong --param=ssp-buffer-size=4 -Werror=trampolines -fomit-frame-pointer -march=i686 -fasynchronous-unwind-tables -mtune=pentium4 -gdwarf-4 -fno-debug-types-section -fvar-tracking-assignments -g2 -Wl,--as-needed -Wl,--no-copy-dt-needed-entries -Wl,-z,relro -Wl,-z,combreloc -o libafdt.la -rpath /usr/lib util.lo lowlevel.lo sync.lo strlcpy.lo async.lo -levent libtool: link: i686-pld-linux-gcc -shared -fPIC -DPIC -O2 -gdwarf-4 -g2 -fstack-protector-strong -march=i686 -mtune=pentium4 -gdwarf-4 -g2 -Wl,--as-needed -Wl,--no-copy-dt-needed-entries -Wl,-z -Wl,relro -Wl,-z -Wl,combreloc .libs/util.o .libs/lowlevel.o .libs/sync.o .libs/strlcpy.o .libs/async.o -levent -Wl,-soname -Wl,libafdt.so.0 -o .libs/libafdt.so.0.0.0 libtool: link: (cd ".libs" && rm -f "libafdt.so.0" && ln -s "libafdt.so.0.0.0" "libafdt.so.0") libtool: link: (cd ".libs" && rm -f "libafdt.so" && ln -s "libafdt.so.0.0.0" "libafdt.so") libtool: link: ar cru .libs/libafdt.a util.o lowlevel.o sync.o strlcpy.o async.o libtool: link: ranlib .libs/libafdt.a libtool: link: ( cd ".libs" && rm -f "libafdt.la" && ln -s "../libafdt.la" "libafdt.la" ) make[1]: Leaving directory '/tmp/B.683z3i/BUILD/libafdt-0.1.0' make[1]: Entering directory '/tmp/B.683z3i/BUILD/libafdt-0.1.0' /bin/sh ./libtool --tag=CC --mode=link i686-pld-linux-gcc -O2 -fwrapv -pipe -Wformat -Werror=format-security -gdwarf-4 -fno-debug-types-section -fvar-tracking-assignments -g2 -Wp,-D_FORTIFY_SOURCE=2 -fstack-protector-strong --param=ssp-buffer-size=4 -Werror=trampolines -fomit-frame-pointer -march=i686 -fasynchronous-unwind-tables -mtune=pentium4 -gdwarf-4 -fno-debug-types-section -fvar-tracking-assignments -g2 -Wl,--as-needed -Wl,--no-copy-dt-needed-entries -Wl,-z,relro -Wl,-z,combreloc -o sync_catter sync_catter-sync_catter.o libafdt.la libtool: link: i686-pld-linux-gcc -O2 -fwrapv -pipe -Wformat -Werror=format-security -gdwarf-4 -fno-debug-types-section -fvar-tracking-assignments -g2 -Wp,-D_FORTIFY_SOURCE=2 -fstack-protector-strong --param=ssp-buffer-size=4 -Werror=trampolines -fomit-frame-pointer -march=i686 -fasynchronous-unwind-tables -mtune=pentium4 -gdwarf-4 -fno-debug-types-section -fvar-tracking-assignments -g2 -Wl,--as-needed -Wl,--no-copy-dt-needed-entries -Wl,-z -Wl,relro -Wl,-z -Wl,combreloc -o .libs/sync_catter sync_catter-sync_catter.o ./.libs/libafdt.so -levent make[1]: Leaving directory '/tmp/B.683z3i/BUILD/libafdt-0.1.0' make[1]: Entering directory '/tmp/B.683z3i/BUILD/libafdt-0.1.0' /bin/sh ./libtool --tag=CC --mode=link i686-pld-linux-gcc -O2 -fwrapv -pipe -Wformat -Werror=format-security -gdwarf-4 -fno-debug-types-section -fvar-tracking-assignments -g2 -Wp,-D_FORTIFY_SOURCE=2 -fstack-protector-strong --param=ssp-buffer-size=4 -Werror=trampolines -fomit-frame-pointer -march=i686 -fasynchronous-unwind-tables -mtune=pentium4 -gdwarf-4 -fno-debug-types-section -fvar-tracking-assignments -g2 -Wl,--as-needed -Wl,--no-copy-dt-needed-entries -Wl,-z,relro -Wl,-z,combreloc -o catter catter-catter.o libafdt.la libtool: link: i686-pld-linux-gcc -O2 -fwrapv -pipe -Wformat -Werror=format-security -gdwarf-4 -fno-debug-types-section -fvar-tracking-assignments -g2 -Wp,-D_FORTIFY_SOURCE=2 -fstack-protector-strong --param=ssp-buffer-size=4 -Werror=trampolines -fomit-frame-pointer -march=i686 -fasynchronous-unwind-tables -mtune=pentium4 -gdwarf-4 -fno-debug-types-section -fvar-tracking-assignments -g2 -Wl,--as-needed -Wl,--no-copy-dt-needed-entries -Wl,-z -Wl,relro -Wl,-z -Wl,combreloc -o .libs/catter catter-catter.o ./.libs/libafdt.so -levent make[1]: Leaving directory '/tmp/B.683z3i/BUILD/libafdt-0.1.0' + /usr/bin/make -Otarget -j9 check /usr/bin/make check-TESTS make[2]: Entering directory '/tmp/B.683z3i/BUILD/libafdt-0.1.0' FAIL: test/runtests.py make[2]: Leaving directory '/tmp/B.683z3i/BUILD/libafdt-0.1.0' make[2]: Entering directory '/tmp/B.683z3i/BUILD/libafdt-0.1.0' ============================================================================ Testsuite summary for libafdt 0.1.0 ============================================================================ # TOTAL: 1 # PASS: 0 # SKIP: 0 # XFAIL: 0 # FAIL: 1 # XPASS: 0 # ERROR: 0 ============================================================================ See ./test-suite.log Please report to dreiss@facebook.com ============================================================================ make[2]: *** [Makefile:932: test-suite.log] Error 1 make[2]: Leaving directory '/tmp/B.683z3i/BUILD/libafdt-0.1.0' make[1]: *** [Makefile:1040: check-TESTS] Error 2 make: *** [Makefile:1246: check-am] Error 2 error: Bad exit status from /tmp/B.683z3i/BUILD/tmp/rpm-tmp.41822 (%build) RPM build errors: Bad exit status from /tmp/B.683z3i/BUILD/tmp/rpm-tmp.41822 (%build) ended at: Sat Feb 8 18:18:57 2020, done in 0:00:13.331673 error: No files produced. + chmod -R u+rwX /tmp/B.683z3i/BUILD + rm -rf /tmp/B.683z3i/tmp /tmp/B.683z3i/BUILD + rm -rf /tmp/B.683z3i Begin-PLD-Builder-Info Build-Time: user:11.55s sys:1.21s real:17.67s (faults io:0 non-io:672755) End-PLD-Builder-Info
[Back to list of logs] [View rpm -qa of builder]