FailedOk

th/SRPMS[OK]
th/x32[OK]
th/i686[OK]
th/x86_64[OK]

ac/SRPMS[OK]
ac/i386[OK]
ac/i586[OK]
ac/i686[OK]
ac/alpha[OK]
ac/amd64[OK]
ac/athlon[OK]
ac/ppc[OK]
ac/sparc[OK]
ac/sparc64[OK]

Advanced Search
main()
Powered by PLD Linux
(c) 2002-2024 PLD Team
$Revision: 1.37 $
Powered by Real Programmer.
Your IP: 3.235.145.108

stx-btree cccbb45b-eb5a-4857-acff-adf804139bfd

Status:Failed
Source URL:https://buildlogs.pld-linux.org/pld/th/i686/FAIL/stx-btree,cccbb45b-eb5a-4857-acff-adf804139bfd.bz2
text/plain URL:View!
rpm -qa of builder:View!
Date:2023/09/25 01:56:16
Runtime:0:03:22.185397

Toc:

  • prep
  • Executing(%prep): /bin/sh -e /tmp/B.k6884cfv/BUILD/tmp/rpm-tmp.7HAMOc
  • build
  • Executing(%build): /bin/sh -e /tmp/B.k6884cfv/BUILD/tmp/rpm-tmp.NtJy6q
  • error 1
  • WMain_wxg.cpp:93:32: error: 'wxADJUST_MINSIZE' was not declared in this scope
  • error 2
  • make[1]: *** [Makefile:313: WMain_wxg.o] Error 1
  • error 3
  • error: Bad exit status from /tmp/B.k6884cfv/BUILD/tmp/rpm-tmp.NtJy6q (%build)
  • error 4
  • RPM build errors:
  • error 5
  • error: No files produced.

Content:

request from: baggins
checking if we should skip the build
started at: Mon Sep 25 01:52:51 2023
killing old processes on a builder
sending signal 9 to pid -1
cleaning up /tmp
fetching https://srcbuilder.pld-linux.org/th//srpms/cccbb45b-eb5a-4857-acff-adf804139bfd/stx-btree-0.9-1.src.rpm
fetched 1698974 bytes, 3368.3 K/s
installing srpm: stx-btree-0.9-1.src.rpm
+ install -d /tmp/B.k6884cfv/BUILD /tmp/B.k6884cfv/RPMS
+ LC_ALL=en_US.UTF-8
+ rpm -qp --changelog stx-btree-0.9-1.src.rpm
* Mon Sep 25 2023 PLD Linux Team <feedback@pld-linux.org>
- For complete changelog see: http://git.pld-linux.org/?p=packages/stx-btree.git;a=log;h=master
* Mon May 13 2019 Jakub Bogusz <qboosh@pld-linux.org> 38d48a9
- new + rpm -Uhv --nodeps --define '_topdir /tmp/B.k6884cfv' --define '_specdir %{_topdir}' --define '_sourcedir %{_specdir}' --define '_rpmdir %{_topdir}/RPMS' --define '_builddir %{_topdir}/BUILD' stx-btree-0.9-1.src.rpm Updating / installing... stx-btree-0.9-1 ######################################## + rm -f stx-btree-0.9-1.src.rpm + install -m 700 -d /tmp/B.k6884cfv/BUILD/tmp + TMPDIR=/tmp/B.k6884cfv/BUILD/tmp + exec nice -n 0 rpmbuild -bp --short-circuit --nodeps --define '_topdir /tmp/B.k6884cfv' --define '_specdir %{_topdir}' --define '_sourcedir %{_specdir}' --define '_rpmdir %{_topdir}/RPMS' --define '_builddir %{_topdir}/BUILD' --target i686-pld-linux --define 'prep exit 0' /tmp/B.k6884cfv/stx-btree.spec warning: Could not canonicalize hostname: nereid Building target platforms: i686-pld-linux Building for target i686-pld-linux RPM build warnings: Could not canonicalize hostname: nereid checking BuildConflict-ing packages rpm: warning: Could not canonicalize hostname: nereid rpm: Building target platforms: i686-pld-linux rpm: Building for target i686-pld-linux rpm: rpm: RPM build warnings: rpm: Could not canonicalize hostname: nereid no BuildConflicts found checking BR rpm: warning: Could not canonicalize hostname: nereid rpm: Building target platforms: i686-pld-linux rpm: Building for target i686-pld-linux rpm: rpm: RPM build warnings: rpm: Could not canonicalize hostname: nereid no BR needed building RPM using: set -ex; : build-id: cccbb45b-eb5a-4857-acff-adf804139bfd; TMPDIR=/tmp/B.k6884cfv/BUILD/tmp exec nice -n 0 rpmbuild -bb --define '__jobs 28' --define '_smp_mflags -j28' --define '_make_opts -Otarget' --define '_pld_builder 1' --define '_topdir /tmp/B.k6884cfv' --define '_specdir %{_topdir}' --define '_sourcedir %{_specdir}' --define '_rpmdir %{_topdir}/RPMS' --define '_builddir %{_topdir}/BUILD' --target i686-pld-linux /tmp/B.k6884cfv/stx-btree.spec + : build-id: cccbb45b-eb5a-4857-acff-adf804139bfd + TMPDIR=/tmp/B.k6884cfv/BUILD/tmp + exec nice -n 0 rpmbuild -bb --define '__jobs 28' --define '_smp_mflags -j28' --define '_make_opts -Otarget' --define '_pld_builder 1' --define '_topdir /tmp/B.k6884cfv' --define '_specdir %{_topdir}' --define '_sourcedir %{_specdir}' --define '_rpmdir %{_topdir}/RPMS' --define '_builddir %{_topdir}/BUILD' --target i686-pld-linux /tmp/B.k6884cfv/stx-btree.spec warning: Could not canonicalize hostname: nereid Building target platforms: i686-pld-linux Building for target i686-pld-linux Executing(%prep): /bin/sh -e /tmp/B.k6884cfv/BUILD/tmp/rpm-tmp.7HAMOc + umask 022 + cd /tmp/B.k6884cfv/BUILD + cd /tmp/B.k6884cfv/BUILD + rm -rf stx-btree-0.9 + /usr/bin/bzip2 -dc /tmp/B.k6884cfv/stx-btree-0.9.tar.bz2 + /bin/tar -xof - + STATUS=0 + '[' 0 -ne 0 ']' + cd stx-btree-0.9 + /bin/chmod -Rf a+rX,u+w,g-w,o-w . + RPM_EC=0 + jobs -p + exit 0 Executing(%build): /bin/sh -e /tmp/B.k6884cfv/BUILD/tmp/rpm-tmp.NtJy6q TMP=/home/users/builder/tmp HOME=/home/users/builder PATH=/home/users/builder/GNUstep/Tools:/bin:/usr/bin:/usr/local/bin:/home/users/builder/bin TMPDIR=/tmp/B.k6884cfv/BUILD/tmp + umask 022 + cd /tmp/B.k6884cfv/BUILD + cd stx-btree-0.9 + ./configure 'LDFLAGS=-Wl,--as-needed -Wl,--no-copy-dt-needed-entries -Wl,-z,relro -Wl,-z,combreloc ' 'CFLAGS=-O2 -fwrapv -pipe -Wformat -Werror=format-security -gdwarf-4 -fno-debug-types-section -fvar-tracking-assignments -g2 -Wp,-D_FORTIFY_SOURCE=2 -fstack-protector-strong --param=ssp-buffer-size=4 -Werror=trampolines -fomit-frame-pointer -march=i686 -fasynchronous-unwind-tables -mtune=pentium4 -gdwarf-4 -fno-debug-types-section -fvar-tracking-assignments -g2 ' 'CXXFLAGS=-O2 -fwrapv -pipe -Wformat -Werror=format-security -gdwarf-4 -fno-debug-types-section -fvar-tracking-assignments -g2 -Wp,-D_FORTIFY_SOURCE=2 -fstack-protector-strong --param=ssp-buffer-size=4 -Werror=trampolines -fomit-frame-pointer -march=i686 -fasynchronous-unwind-tables -mtune=pentium4 -gdwarf-4 -fno-debug-types-section -fvar-tracking-assignments -g2 ' 'FFLAGS=-O2 -fwrapv -pipe -Wformat -Werror=format-security -gdwarf-4 -fno-debug-types-section -fvar-tracking-assignments -g2 -Wp,-D_FORTIFY_SOURCE=2 -fstack-protector-strong --param=ssp-buffer-size=4 -Werror=trampolines -fomit-frame-pointer -march=i686 -fasynchronous-unwind-tables -mtune=pentium4 -gdwarf-4 -fno-debug-types-section -fvar-tracking-assignments -g2 ' 'FCFLAGS=-O2 -fwrapv -pipe -Wformat -Werror=format-security -gdwarf-4 -fno-debug-types-section -fvar-tracking-assignments -g2 -Wp,-D_FORTIFY_SOURCE=2 -fstack-protector-strong --param=ssp-buffer-size=4 -Werror=trampolines -fomit-frame-pointer -march=i686 -fasynchronous-unwind-tables -mtune=pentium4 -gdwarf-4 -fno-debug-types-section -fvar-tracking-assignments -g2 ' 'CPPFLAGS=' 'CC=i686-pld-linux-gcc' 'CXX=i686-pld-linux-g++' '--host=i686-pld-linux' '--build=i686-pld-linux' '--prefix=/usr' '--exec-prefix=/usr' '--bindir=/usr/bin' '--sbindir=/usr/sbin' '--sysconfdir=/etc' '--datadir=/usr/share' '--includedir=/usr/include' '--libdir=/usr/lib' '--libexecdir=/usr/libexec' '--localstatedir=/var' '--sharedstatedir=/var/lib' '--mandir=/usr/share/man' '--infodir=/usr/share/info' '--x-libraries=/usr/lib' '--with-wx-config=/usr/bin/wx-gtk3-unicode-config' checking build system type... i686-pld-linux-gnu checking host system type... i686-pld-linux-gnu checking for a BSD-compatible install... /usr/bin/install -c checking whether build environment is sane... yes checking for a thread-safe mkdir -p... /bin/mkdir -p checking for gawk... gawk checking whether make sets $(MAKE)... yes checking whether to enable maintainer-specific portions of Makefiles... no checking whether the C++ compiler works... yes checking for C++ compiler default output file name... a.out checking for suffix of executables... checking whether we are cross compiling... no checking for suffix of object files... o checking whether we are using the GNU C++ compiler... yes checking whether i686-pld-linux-g++ accepts -g... yes checking for style of include used by make... GNU checking dependency style of i686-pld-linux-g++... gcc3 checking for i686-pld-linux-gcc... i686-pld-linux-gcc checking whether we are using the GNU C compiler... yes checking whether i686-pld-linux-gcc accepts -g... yes checking for i686-pld-linux-gcc option to accept ISO C89... none needed checking dependency style of i686-pld-linux-gcc... gcc3 checking how to run the C++ preprocessor... i686-pld-linux-g++ -E checking for grep that handles long lines and -e... /bin/grep checking for egrep... /bin/grep -E checking for ANSI C header files... yes checking for sys/types.h... yes checking for sys/stat.h... yes checking for stdlib.h... yes checking for string.h... yes checking for memory.h... yes checking for strings.h... yes checking for inttypes.h... yes checking for stdint.h... yes checking for unistd.h... yes checking for stdbool.h that conforms to C99... no checking for _Bool... no checking for an ANSI C-conforming const... yes checking for inline... inline checking for size_t... yes checking for wx-config... /usr/bin/wx-gtk3-unicode-config checking for wxWidgets version >= 2.6.0... yes (version 3.2.2) checking for wxWidgets static library... no configure: creating ./config.status config.status: creating Makefile config.status: creating include/Makefile config.status: creating testsuite/Makefile config.status: creating speedtest/Makefile config.status: creating memprofile/Makefile config.status: creating wxbtreedemo/Makefile config.status: executing depfiles commands + /usr/bin/make -Otarget -j28 Making all in . make[1]: Nothing to be done for 'all-am'. Making all in include make[1]: Nothing to be done for 'all'. Making all in testsuite make[1]: Entering directory '/tmp/B.k6884cfv/BUILD/stx-btree-0.9/testsuite' i686-pld-linux-g++ -DPACKAGE_NAME=\"stx-btree\" -DPACKAGE_TARNAME=\"stx-btree\" -DPACKAGE_VERSION=\"0.9\" -DPACKAGE_STRING=\"stx-btree\ 0.9\" -DPACKAGE_BUGREPORT=\"\" -DPACKAGE_URL=\"\" -DPACKAGE=\"stx-btree\" -DVERSION=\"0.9\" -DSTDC_HEADERS=1 -DHAVE_SYS_TYPES_H=1 -DHAVE_SYS_STAT_H=1 -DHAVE_STDLIB_H=1 -DHAVE_STRING_H=1 -DHAVE_MEMORY_H=1 -DHAVE_STRINGS_H=1 -DHAVE_INTTYPES_H=1 -DHAVE_STDINT_H=1 -DHAVE_UNISTD_H=1 -I. -W -Wall -Wold-style-cast -Wshadow -DBTREE_DEBUG -I../include -O2 -fwrapv -pipe -Wformat -Werror=format-security -gdwarf-4 -fno-debug-types-section -fvar-tracking-assignments -g2 -Wp,-D_FORTIFY_SOURCE=2 -fstack-protector-strong --param=ssp-buffer-size=4 -Werror=trampolines -fomit-frame-pointer -march=i686 -fasynchronous-unwind-tables -mtune=pentium4 -gdwarf-4 -fno-debug-types-section -fvar-tracking-assignments -g2 -MT tpunit.o -MD -MP -MF .deps/tpunit.Tpo -c -o tpunit.o tpunit.cc mv -f .deps/tpunit.Tpo .deps/tpunit.Po make[1]: Leaving directory '/tmp/B.k6884cfv/BUILD/stx-btree-0.9/testsuite' make[1]: Entering directory '/tmp/B.k6884cfv/BUILD/stx-btree-0.9/testsuite' i686-pld-linux-g++ -DPACKAGE_NAME=\"stx-btree\" -DPACKAGE_TARNAME=\"stx-btree\" -DPACKAGE_VERSION=\"0.9\" -DPACKAGE_STRING=\"stx-btree\ 0.9\" -DPACKAGE_BUGREPORT=\"\" -DPACKAGE_URL=\"\" -DPACKAGE=\"stx-btree\" -DVERSION=\"0.9\" -DSTDC_HEADERS=1 -DHAVE_SYS_TYPES_H=1 -DHAVE_SYS_STAT_H=1 -DHAVE_STDLIB_H=1 -DHAVE_STRING_H=1 -DHAVE_MEMORY_H=1 -DHAVE_STRINGS_H=1 -DHAVE_INTTYPES_H=1 -DHAVE_STDINT_H=1 -DHAVE_UNISTD_H=1 -I. -W -Wall -Wold-style-cast -Wshadow -DBTREE_DEBUG -I../include -O2 -fwrapv -pipe -Wformat -Werror=format-security -gdwarf-4 -fno-debug-types-section -fvar-tracking-assignments -g2 -Wp,-D_FORTIFY_SOURCE=2 -fstack-protector-strong --param=ssp-buffer-size=4 -Werror=trampolines -fomit-frame-pointer -march=i686 -fasynchronous-unwind-tables -mtune=pentium4 -gdwarf-4 -fno-debug-types-section -fvar-tracking-assignments -g2 -MT RelationTest.o -MD -MP -MF .deps/RelationTest.Tpo -c -o RelationTest.o RelationTest.cc mv -f .deps/RelationTest.Tpo .deps/RelationTest.Po make[1]: Leaving directory '/tmp/B.k6884cfv/BUILD/stx-btree-0.9/testsuite' make[1]: Entering directory '/tmp/B.k6884cfv/BUILD/stx-btree-0.9/testsuite' i686-pld-linux-g++ -DPACKAGE_NAME=\"stx-btree\" -DPACKAGE_TARNAME=\"stx-btree\" -DPACKAGE_VERSION=\"0.9\" -DPACKAGE_STRING=\"stx-btree\ 0.9\" -DPACKAGE_BUGREPORT=\"\" -DPACKAGE_URL=\"\" -DPACKAGE=\"stx-btree\" -DVERSION=\"0.9\" -DSTDC_HEADERS=1 -DHAVE_SYS_TYPES_H=1 -DHAVE_SYS_STAT_H=1 -DHAVE_STDLIB_H=1 -DHAVE_STRING_H=1 -DHAVE_MEMORY_H=1 -DHAVE_STRINGS_H=1 -DHAVE_INTTYPES_H=1 -DHAVE_STDINT_H=1 -DHAVE_UNISTD_H=1 -I. -W -Wall -Wold-style-cast -Wshadow -DBTREE_DEBUG -I../include -O2 -fwrapv -pipe -Wformat -Werror=format-security -gdwarf-4 -fno-debug-types-section -fvar-tracking-assignments -g2 -Wp,-D_FORTIFY_SOURCE=2 -fstack-protector-strong --param=ssp-buffer-size=4 -Werror=trampolines -fomit-frame-pointer -march=i686 -fasynchronous-unwind-tables -mtune=pentium4 -gdwarf-4 -fno-debug-types-section -fvar-tracking-assignments -g2 -MT StructureTest.o -MD -MP -MF .deps/StructureTest.Tpo -c -o StructureTest.o StructureTest.cc mv -f .deps/StructureTest.Tpo .deps/StructureTest.Po make[1]: Leaving directory '/tmp/B.k6884cfv/BUILD/stx-btree-0.9/testsuite' make[1]: Entering directory '/tmp/B.k6884cfv/BUILD/stx-btree-0.9/testsuite' i686-pld-linux-g++ -DPACKAGE_NAME=\"stx-btree\" -DPACKAGE_TARNAME=\"stx-btree\" -DPACKAGE_VERSION=\"0.9\" -DPACKAGE_STRING=\"stx-btree\ 0.9\" -DPACKAGE_BUGREPORT=\"\" -DPACKAGE_URL=\"\" -DPACKAGE=\"stx-btree\" -DVERSION=\"0.9\" -DSTDC_HEADERS=1 -DHAVE_SYS_TYPES_H=1 -DHAVE_SYS_STAT_H=1 -DHAVE_STDLIB_H=1 -DHAVE_STRING_H=1 -DHAVE_MEMORY_H=1 -DHAVE_STRINGS_H=1 -DHAVE_INTTYPES_H=1 -DHAVE_STDINT_H=1 -DHAVE_UNISTD_H=1 -I. -W -Wall -Wold-style-cast -Wshadow -DBTREE_DEBUG -I../include -O2 -fwrapv -pipe -Wformat -Werror=format-security -gdwarf-4 -fno-debug-types-section -fvar-tracking-assignments -g2 -Wp,-D_FORTIFY_SOURCE=2 -fstack-protector-strong --param=ssp-buffer-size=4 -Werror=trampolines -fomit-frame-pointer -march=i686 -fasynchronous-unwind-tables -mtune=pentium4 -gdwarf-4 -fno-debug-types-section -fvar-tracking-assignments -g2 -MT DumpRestoreTest.o -MD -MP -MF .deps/DumpRestoreTest.Tpo -c -o DumpRestoreTest.o DumpRestoreTest.cc mv -f .deps/DumpRestoreTest.Tpo .deps/DumpRestoreTest.Po make[1]: Leaving directory '/tmp/B.k6884cfv/BUILD/stx-btree-0.9/testsuite' make[1]: Entering directory '/tmp/B.k6884cfv/BUILD/stx-btree-0.9/testsuite' i686-pld-linux-g++ -DPACKAGE_NAME=\"stx-btree\" -DPACKAGE_TARNAME=\"stx-btree\" -DPACKAGE_VERSION=\"0.9\" -DPACKAGE_STRING=\"stx-btree\ 0.9\" -DPACKAGE_BUGREPORT=\"\" -DPACKAGE_URL=\"\" -DPACKAGE=\"stx-btree\" -DVERSION=\"0.9\" -DSTDC_HEADERS=1 -DHAVE_SYS_TYPES_H=1 -DHAVE_SYS_STAT_H=1 -DHAVE_STDLIB_H=1 -DHAVE_STRING_H=1 -DHAVE_MEMORY_H=1 -DHAVE_STRINGS_H=1 -DHAVE_INTTYPES_H=1 -DHAVE_STDINT_H=1 -DHAVE_UNISTD_H=1 -I. -W -Wall -Wold-style-cast -Wshadow -DBTREE_DEBUG -I../include -O2 -fwrapv -pipe -Wformat -Werror=format-security -gdwarf-4 -fno-debug-types-section -fvar-tracking-assignments -g2 -Wp,-D_FORTIFY_SOURCE=2 -fstack-protector-strong --param=ssp-buffer-size=4 -Werror=trampolines -fomit-frame-pointer -march=i686 -fasynchronous-unwind-tables -mtune=pentium4 -gdwarf-4 -fno-debug-types-section -fvar-tracking-assignments -g2 -MT BoundTest.o -MD -MP -MF .deps/BoundTest.Tpo -c -o BoundTest.o BoundTest.cc mv -f .deps/BoundTest.Tpo .deps/BoundTest.Po make[1]: Leaving directory '/tmp/B.k6884cfv/BUILD/stx-btree-0.9/testsuite' make[1]: Entering directory '/tmp/B.k6884cfv/BUILD/stx-btree-0.9/testsuite' i686-pld-linux-g++ -DPACKAGE_NAME=\"stx-btree\" -DPACKAGE_TARNAME=\"stx-btree\" -DPACKAGE_VERSION=\"0.9\" -DPACKAGE_STRING=\"stx-btree\ 0.9\" -DPACKAGE_BUGREPORT=\"\" -DPACKAGE_URL=\"\" -DPACKAGE=\"stx-btree\" -DVERSION=\"0.9\" -DSTDC_HEADERS=1 -DHAVE_SYS_TYPES_H=1 -DHAVE_SYS_STAT_H=1 -DHAVE_STDLIB_H=1 -DHAVE_STRING_H=1 -DHAVE_MEMORY_H=1 -DHAVE_STRINGS_H=1 -DHAVE_INTTYPES_H=1 -DHAVE_STDINT_H=1 -DHAVE_UNISTD_H=1 -I. -W -Wall -Wold-style-cast -Wshadow -DBTREE_DEBUG -I../include -O2 -fwrapv -pipe -Wformat -Werror=format-security -gdwarf-4 -fno-debug-types-section -fvar-tracking-assignments -g2 -Wp,-D_FORTIFY_SOURCE=2 -fstack-protector-strong --param=ssp-buffer-size=4 -Werror=trampolines -fomit-frame-pointer -march=i686 -fasynchronous-unwind-tables -mtune=pentium4 -gdwarf-4 -fno-debug-types-section -fvar-tracking-assignments -g2 -MT LargeTest.o -MD -MP -MF .deps/LargeTest.Tpo -c -o LargeTest.o LargeTest.cc mv -f .deps/LargeTest.Tpo .deps/LargeTest.Po make[1]: Leaving directory '/tmp/B.k6884cfv/BUILD/stx-btree-0.9/testsuite' make[1]: Entering directory '/tmp/B.k6884cfv/BUILD/stx-btree-0.9/testsuite' i686-pld-linux-g++ -DPACKAGE_NAME=\"stx-btree\" -DPACKAGE_TARNAME=\"stx-btree\" -DPACKAGE_VERSION=\"0.9\" -DPACKAGE_STRING=\"stx-btree\ 0.9\" -DPACKAGE_BUGREPORT=\"\" -DPACKAGE_URL=\"\" -DPACKAGE=\"stx-btree\" -DVERSION=\"0.9\" -DSTDC_HEADERS=1 -DHAVE_SYS_TYPES_H=1 -DHAVE_SYS_STAT_H=1 -DHAVE_STDLIB_H=1 -DHAVE_STRING_H=1 -DHAVE_MEMORY_H=1 -DHAVE_STRINGS_H=1 -DHAVE_INTTYPES_H=1 -DHAVE_STDINT_H=1 -DHAVE_UNISTD_H=1 -I. -W -Wall -Wold-style-cast -Wshadow -DBTREE_DEBUG -I../include -O2 -fwrapv -pipe -Wformat -Werror=format-security -gdwarf-4 -fno-debug-types-section -fvar-tracking-assignments -g2 -Wp,-D_FORTIFY_SOURCE=2 -fstack-protector-strong --param=ssp-buffer-size=4 -Werror=trampolines -fomit-frame-pointer -march=i686 -fasynchronous-unwind-tables -mtune=pentium4 -gdwarf-4 -fno-debug-types-section -fvar-tracking-assignments -g2 -MT BulkLoadTest.o -MD -MP -MF .deps/BulkLoadTest.Tpo -c -o BulkLoadTest.o BulkLoadTest.cc mv -f .deps/BulkLoadTest.Tpo .deps/BulkLoadTest.Po make[1]: Leaving directory '/tmp/B.k6884cfv/BUILD/stx-btree-0.9/testsuite' make[1]: Entering directory '/tmp/B.k6884cfv/BUILD/stx-btree-0.9/testsuite' i686-pld-linux-g++ -DPACKAGE_NAME=\"stx-btree\" -DPACKAGE_TARNAME=\"stx-btree\" -DPACKAGE_VERSION=\"0.9\" -DPACKAGE_STRING=\"stx-btree\ 0.9\" -DPACKAGE_BUGREPORT=\"\" -DPACKAGE_URL=\"\" -DPACKAGE=\"stx-btree\" -DVERSION=\"0.9\" -DSTDC_HEADERS=1 -DHAVE_SYS_TYPES_H=1 -DHAVE_SYS_STAT_H=1 -DHAVE_STDLIB_H=1 -DHAVE_STRING_H=1 -DHAVE_MEMORY_H=1 -DHAVE_STRINGS_H=1 -DHAVE_INTTYPES_H=1 -DHAVE_STDINT_H=1 -DHAVE_UNISTD_H=1 -I. -W -Wall -Wold-style-cast -Wshadow -DBTREE_DEBUG -I../include -O2 -fwrapv -pipe -Wformat -Werror=format-security -gdwarf-4 -fno-debug-types-section -fvar-tracking-assignments -g2 -Wp,-D_FORTIFY_SOURCE=2 -fstack-protector-strong --param=ssp-buffer-size=4 -Werror=trampolines -fomit-frame-pointer -march=i686 -fasynchronous-unwind-tables -mtune=pentium4 -gdwarf-4 -fno-debug-types-section -fvar-tracking-assignments -g2 -MT IteratorTest.o -MD -MP -MF .deps/IteratorTest.Tpo -c -o IteratorTest.o IteratorTest.cc mv -f .deps/IteratorTest.Tpo .deps/IteratorTest.Po make[1]: Leaving directory '/tmp/B.k6884cfv/BUILD/stx-btree-0.9/testsuite' make[1]: Entering directory '/tmp/B.k6884cfv/BUILD/stx-btree-0.9/testsuite' i686-pld-linux-g++ -DPACKAGE_NAME=\"stx-btree\" -DPACKAGE_TARNAME=\"stx-btree\" -DPACKAGE_VERSION=\"0.9\" -DPACKAGE_STRING=\"stx-btree\ 0.9\" -DPACKAGE_BUGREPORT=\"\" -DPACKAGE_URL=\"\" -DPACKAGE=\"stx-btree\" -DVERSION=\"0.9\" -DSTDC_HEADERS=1 -DHAVE_SYS_TYPES_H=1 -DHAVE_SYS_STAT_H=1 -DHAVE_STDLIB_H=1 -DHAVE_STRING_H=1 -DHAVE_MEMORY_H=1 -DHAVE_STRINGS_H=1 -DHAVE_INTTYPES_H=1 -DHAVE_STDINT_H=1 -DHAVE_UNISTD_H=1 -I. -W -Wall -Wold-style-cast -Wshadow -DBTREE_DEBUG -I../include -O2 -fwrapv -pipe -Wformat -Werror=format-security -gdwarf-4 -fno-debug-types-section -fvar-tracking-assignments -g2 -Wp,-D_FORTIFY_SOURCE=2 -fstack-protector-strong --param=ssp-buffer-size=4 -Werror=trampolines -fomit-frame-pointer -march=i686 -fasynchronous-unwind-tables -mtune=pentium4 -gdwarf-4 -fno-debug-types-section -fvar-tracking-assignments -g2 -MT InstantiationTest.o -MD -MP -MF .deps/InstantiationTest.Tpo -c -o InstantiationTest.o InstantiationTest.cc mv -f .deps/InstantiationTest.Tpo .deps/InstantiationTest.Po make[1]: Leaving directory '/tmp/B.k6884cfv/BUILD/stx-btree-0.9/testsuite' make[1]: Entering directory '/tmp/B.k6884cfv/BUILD/stx-btree-0.9/testsuite' i686-pld-linux-g++ -DPACKAGE_NAME=\"stx-btree\" -DPACKAGE_TARNAME=\"stx-btree\" -DPACKAGE_VERSION=\"0.9\" -DPACKAGE_STRING=\"stx-btree\ 0.9\" -DPACKAGE_BUGREPORT=\"\" -DPACKAGE_URL=\"\" -DPACKAGE=\"stx-btree\" -DVERSION=\"0.9\" -DSTDC_HEADERS=1 -DHAVE_SYS_TYPES_H=1 -DHAVE_SYS_STAT_H=1 -DHAVE_STDLIB_H=1 -DHAVE_STRING_H=1 -DHAVE_MEMORY_H=1 -DHAVE_STRINGS_H=1 -DHAVE_INTTYPES_H=1 -DHAVE_STDINT_H=1 -DHAVE_UNISTD_H=1 -I. -W -Wall -Wold-style-cast -Wshadow -DBTREE_DEBUG -I../include -O2 -fwrapv -pipe -Wformat -Werror=format-security -gdwarf-4 -fno-debug-types-section -fvar-tracking-assignments -g2 -Wp,-D_FORTIFY_SOURCE=2 -fstack-protector-strong --param=ssp-buffer-size=4 -Werror=trampolines -fomit-frame-pointer -march=i686 -fasynchronous-unwind-tables -mtune=pentium4 -gdwarf-4 -fno-debug-types-section -fvar-tracking-assignments -g2 -MT SimpleTest.o -MD -MP -MF .deps/SimpleTest.Tpo -c -o SimpleTest.o SimpleTest.cc mv -f .deps/SimpleTest.Tpo .deps/SimpleTest.Po make[1]: Leaving directory '/tmp/B.k6884cfv/BUILD/stx-btree-0.9/testsuite' make[1]: Entering directory '/tmp/B.k6884cfv/BUILD/stx-btree-0.9/testsuite' i686-pld-linux-g++ -W -Wall -Wold-style-cast -Wshadow -DBTREE_DEBUG -I../include -O2 -fwrapv -pipe -Wformat -Werror=format-security -gdwarf-4 -fno-debug-types-section -fvar-tracking-assignments -g2 -Wp,-D_FORTIFY_SOURCE=2 -fstack-protector-strong --param=ssp-buffer-size=4 -Werror=trampolines -fomit-frame-pointer -march=i686 -fasynchronous-unwind-tables -mtune=pentium4 -gdwarf-4 -fno-debug-types-section -fvar-tracking-assignments -g2 -Wl,--as-needed -Wl,--no-copy-dt-needed-entries -Wl,-z,relro -Wl,-z,combreloc -o testsuite tpunit.o InstantiationTest.o SimpleTest.o LargeTest.o BoundTest.o IteratorTest.o StructureTest.o DumpRestoreTest.o RelationTest.o BulkLoadTest.o make[1]: Leaving directory '/tmp/B.k6884cfv/BUILD/stx-btree-0.9/testsuite' Making all in speedtest make[1]: Nothing to be done for 'all'. Making all in memprofile make[1]: Nothing to be done for 'all'. Making all in wxbtreedemo make[1]: Entering directory '/tmp/B.k6884cfv/BUILD/stx-btree-0.9/wxbtreedemo' i686-pld-linux-g++ -DPACKAGE_NAME=\"stx-btree\" -DPACKAGE_TARNAME=\"stx-btree\" -DPACKAGE_VERSION=\"0.9\" -DPACKAGE_STRING=\"stx-btree\ 0.9\" -DPACKAGE_BUGREPORT=\"\" -DPACKAGE_URL=\"\" -DPACKAGE=\"stx-btree\" -DVERSION=\"0.9\" -DSTDC_HEADERS=1 -DHAVE_SYS_TYPES_H=1 -DHAVE_SYS_STAT_H=1 -DHAVE_STDLIB_H=1 -DHAVE_STRING_H=1 -DHAVE_MEMORY_H=1 -DHAVE_STRINGS_H=1 -DHAVE_INTTYPES_H=1 -DHAVE_STDINT_H=1 -DHAVE_UNISTD_H=1 -I. -I/usr/include -I/usr/lib/wx/include/gtk3-unicode-3.2 -I/usr/include/wx-3.2 -D_FILE_OFFSET_BITS=64 -DwxDEBUG_LEVEL=0 -DWXUSINGDLL -D__WXGTK__ -pthread -I../include -DBTREE_DEBUG -O2 -fwrapv -pipe -Wformat -Werror=format-security -gdwarf-4 -fno-debug-types-section -fvar-tracking-assignments -g2 -Wp,-D_FORTIFY_SOURCE=2 -fstack-protector-strong --param=ssp-buffer-size=4 -Werror=trampolines -fomit-frame-pointer -march=i686 -fasynchronous-unwind-tables -mtune=pentium4 -gdwarf-4 -fno-debug-types-section -fvar-tracking-assignments -g2 -MT WMain_wxg.o -MD -MP -MF .deps/WMain_wxg.Tpo -c -o WMain_wxg.o WMain_wxg.cpp WMain_wxg.cpp: In member function 'void WMain_wxg::do_layout()': WMain_wxg.cpp:93:32: error: 'wxADJUST_MINSIZE' was not declared in this scope 93 | grid_sizer_1->Add(2, 2, 0, wxADJUST_MINSIZE, 0); | ^~~~~~~~~~~~~~~~ make[1]: *** [Makefile:313: WMain_wxg.o] Error 1 make[1]: Leaving directory '/tmp/B.k6884cfv/BUILD/stx-btree-0.9/wxbtreedemo' make[1]: *** Waiting for unfinished jobs.... make[1]: Entering directory '/tmp/B.k6884cfv/BUILD/stx-btree-0.9/wxbtreedemo' i686-pld-linux-g++ -DPACKAGE_NAME=\"stx-btree\" -DPACKAGE_TARNAME=\"stx-btree\" -DPACKAGE_VERSION=\"0.9\" -DPACKAGE_STRING=\"stx-btree\ 0.9\" -DPACKAGE_BUGREPORT=\"\" -DPACKAGE_URL=\"\" -DPACKAGE=\"stx-btree\" -DVERSION=\"0.9\" -DSTDC_HEADERS=1 -DHAVE_SYS_TYPES_H=1 -DHAVE_SYS_STAT_H=1 -DHAVE_STDLIB_H=1 -DHAVE_STRING_H=1 -DHAVE_MEMORY_H=1 -DHAVE_STRINGS_H=1 -DHAVE_INTTYPES_H=1 -DHAVE_STDINT_H=1 -DHAVE_UNISTD_H=1 -I. -I/usr/include -I/usr/lib/wx/include/gtk3-unicode-3.2 -I/usr/include/wx-3.2 -D_FILE_OFFSET_BITS=64 -DwxDEBUG_LEVEL=0 -DWXUSINGDLL -D__WXGTK__ -pthread -I../include -DBTREE_DEBUG -O2 -fwrapv -pipe -Wformat -Werror=format-security -gdwarf-4 -fno-debug-types-section -fvar-tracking-assignments -g2 -Wp,-D_FORTIFY_SOURCE=2 -fstack-protector-strong --param=ssp-buffer-size=4 -Werror=trampolines -fomit-frame-pointer -march=i686 -fasynchronous-unwind-tables -mtune=pentium4 -gdwarf-4 -fno-debug-types-section -fvar-tracking-assignments -g2 -MT WTreeDrawing.o -MD -MP -MF .deps/WTreeDrawing.Tpo -c -o WTreeDrawing.o WTreeDrawing.cpp WTreeDrawing.cpp: In member function 'wxSize WTreeDrawing::BTreeOp_Draw::draw_tree(BTreeType&)': WTreeDrawing.cpp:367:1: warning: no return statement in function returning non-void [-Wreturn-type] 367 | } | ^ WTreeDrawing.cpp: In member function 'wxSize WTreeDrawing::BTreeOp_Draw::opInteger(BTreeType&)': WTreeDrawing.cpp:373:1: warning: no return statement in function returning non-void [-Wreturn-type] 373 | } | ^ WTreeDrawing.cpp: In member function 'wxSize WTreeDrawing::BTreeOp_Draw::opIntegerMulti(BTreeType&)': WTreeDrawing.cpp:379:1: warning: no return statement in function returning non-void [-Wreturn-type] 379 | } | ^ WTreeDrawing.cpp: In member function 'wxSize WTreeDrawing::BTreeOp_Draw::opString(BTreeType&)': WTreeDrawing.cpp:385:1: warning: no return statement in function returning non-void [-Wreturn-type] 385 | } | ^ WTreeDrawing.cpp: In member function 'wxSize WTreeDrawing::BTreeOp_Draw::opStringMulti(BTreeType&)': WTreeDrawing.cpp:391:1: warning: no return statement in function returning non-void [-Wreturn-type] 391 | } | ^ mv -f .deps/WTreeDrawing.Tpo .deps/WTreeDrawing.Po make[1]: Leaving directory '/tmp/B.k6884cfv/BUILD/stx-btree-0.9/wxbtreedemo' make[1]: Entering directory '/tmp/B.k6884cfv/BUILD/stx-btree-0.9/wxbtreedemo' i686-pld-linux-g++ -DPACKAGE_NAME=\"stx-btree\" -DPACKAGE_TARNAME=\"stx-btree\" -DPACKAGE_VERSION=\"0.9\" -DPACKAGE_STRING=\"stx-btree\ 0.9\" -DPACKAGE_BUGREPORT=\"\" -DPACKAGE_URL=\"\" -DPACKAGE=\"stx-btree\" -DVERSION=\"0.9\" -DSTDC_HEADERS=1 -DHAVE_SYS_TYPES_H=1 -DHAVE_SYS_STAT_H=1 -DHAVE_STDLIB_H=1 -DHAVE_STRING_H=1 -DHAVE_MEMORY_H=1 -DHAVE_STRINGS_H=1 -DHAVE_INTTYPES_H=1 -DHAVE_STDINT_H=1 -DHAVE_UNISTD_H=1 -I. -I/usr/include -I/usr/lib/wx/include/gtk3-unicode-3.2 -I/usr/include/wx-3.2 -D_FILE_OFFSET_BITS=64 -DwxDEBUG_LEVEL=0 -DWXUSINGDLL -D__WXGTK__ -pthread -I../include -DBTREE_DEBUG -O2 -fwrapv -pipe -Wformat -Werror=format-security -gdwarf-4 -fno-debug-types-section -fvar-tracking-assignments -g2 -Wp,-D_FORTIFY_SOURCE=2 -fstack-protector-strong --param=ssp-buffer-size=4 -Werror=trampolines -fomit-frame-pointer -march=i686 -fasynchronous-unwind-tables -mtune=pentium4 -gdwarf-4 -fno-debug-types-section -fvar-tracking-assignments -g2 -MT WMain.o -MD -MP -MF .deps/WMain.Tpo -c -o WMain.o WMain.cpp mv -f .deps/WMain.Tpo .deps/WMain.Po make[1]: Leaving directory '/tmp/B.k6884cfv/BUILD/stx-btree-0.9/wxbtreedemo' make: *** [Makefile:296: all-recursive] Error 1 error: Bad exit status from /tmp/B.k6884cfv/BUILD/tmp/rpm-tmp.NtJy6q (%build) RPM build warnings: Could not canonicalize hostname: nereid RPM build errors: Bad exit status from /tmp/B.k6884cfv/BUILD/tmp/rpm-tmp.NtJy6q (%build) ended at: Mon Sep 25 01:56:16 2023, done in 0:03:22.185397 error: No files produced. + chmod -R u+rwX /tmp/B.k6884cfv/BUILD + rm -rf /tmp/B.k6884cfv/tmp /tmp/B.k6884cfv/BUILD + rm -rf /tmp/B.k6884cfv Begin-PLD-Builder-Info Build-Time: user:253.42s sys:8.81s real:204.89s (faults io:1 non-io:1387960) End-PLD-Builder-Info
[Back to list of logs] [View rpm -qa of builder]