FailedOk

th/SRPMS[OK]
th/x32[OK]
th/i686[OK]
th/x86_64[OK]

ac/SRPMS[OK]
ac/i386[OK]
ac/i586[OK]
ac/i686[OK]
ac/alpha[OK]
ac/amd64[OK]
ac/athlon[OK]
ac/ppc[OK]
ac/sparc[OK]
ac/sparc64[OK]

Advanced Search
main()
Powered by PLD Linux
(c) 2002-2018 PLD Team
$Revision: 1.37 $
Powered by brain.
Your IP: 54.198.212.30

CPU-X e0e0646b-dfcd-4861-8312-f973083cab3f

Status:Failed
Source URL:ftp://buildlogs.pld-linux.org/th/x32/FAIL/CPU-X,e0e0646b-dfcd-4861-8312-f973083cab3f.bz2
text/plain URL:View!
full text:View!
rpm -qa of builder:View!
Date:2018/08/04 13:15:11
Runtime:0:00:07.907085

Toc:

  • error 1
  • rpm: error: Failed build dependencies:
  • error 2
  • rpm: error: Failed build dependencies:
  • prep
  • Executing(%prep): /bin/sh -e /tmp/B.VQoqqo/BUILD/tmp/rpm-tmp.43811
  • build
  • Executing(%build): /bin/sh -e /tmp/B.VQoqqo/BUILD/tmp/rpm-tmp.43811
  • error 3
  • collect2: error: ld returned 1 exit status
  • error 4
  • make[2]: *** [src/CMakeFiles/cpu-x.dir/build.make:121: output/bin/cpu-x] Error 1
  • error 5
  • make[1]: *** [CMakeFiles/Makefile2:358: src/CMakeFiles/cpu-x.dir/all] Error 2
  • error 6
  • error: Bad exit status from /tmp/B.VQoqqo/BUILD/tmp/rpm-tmp.43811 (%build)
  • error 7
  • RPM build errors:
  • error 8
  • error: No files produced.

Content:

checking if we should skip the build
started at: Sat Aug  4 13:14:41 2018
killing old processes on a builder
sending signal 9 to pid -1
Killed
cleaning up /tmp
fetching https://srcbuilder.pld-linux.org/th//srpms/e0e0646b-dfcd-4861-8312-f973083cab3f/CPU-X-3.2.3-1.src.rpm
fetched 1843320 bytes, 2459.0 K/s
installing srpm: CPU-X-3.2.3-1.src.rpm
+ install -d /tmp/B.VQoqqo/BUILD /tmp/B.VQoqqo/RPMS
+ LC_ALL=en_US.UTF-8
+ rpm -qp --changelog CPU-X-3.2.3-1.src.rpm
* Sat Aug 04 2018 PLD Linux Team <feedback@pld-linux.org>
- For complete changelog see: http://git.pld-linux.org/?p=packages/CPU-X.git;a=log;h=master
* Sat Aug 04 2018 Jan Rękorajski <baggins@pld-linux.org> 77406cb
- new + rpm -Uhv --nodeps --define '_topdir /tmp/B.VQoqqo' --define '_specdir %{_topdir}' --define '_sourcedir %{_specdir}' --define '_rpmdir %{_topdir}/RPMS' --define '_builddir %{_topdir}/BUILD' CPU-X-3.2.3-1.src.rpm Preparing... ################################################## CPU-X ################################################## + rm -f CPU-X-3.2.3-1.src.rpm + install -m 700 -d /tmp/B.VQoqqo/BUILD/tmp + TMPDIR=/tmp/B.VQoqqo/BUILD/tmp + exec nice -n 0 rpmbuild -bp --short-circuit --nodeps --define '_topdir /tmp/B.VQoqqo' --define '_specdir %{_topdir}' --define '_sourcedir %{_specdir}' --define '_rpmdir %{_topdir}/RPMS' --define '_builddir %{_topdir}/BUILD' --target x32-pld-linux --define 'prep exit 0' /tmp/B.VQoqqo/CPU-X.spec Building target platforms: x32-pld-linux checking BuildConflict-ing packages no BuildConflicts found checking BR rpm: error: Failed build dependencies: rpm: libcpuid >= 0.4.0 is needed by CPU-X-3.2.3-1.src rpm: Building target platforms: x32-pld-linux updating poldek cache... ready is up to date Retrieving th::packages.ndir.md... th is up to date Retrieving th::packages.ndir.md... th is up to date Retrieving th-ready::packages.ndir.md... th-ready is up to date Retrieving th-ready::packages.ndir.md... th-ready is up to date Retrieving th-test::packages.ndir.md... Retrieving th-test::packages.ndir.diff.toc.gz... Retrieving diff::packages.ndir.2018.08.03-18.16.02.gz... ..............................done Retrieving diff::packages.ndir.dscr.2018.08.03-18.16.02.gz... Loading [pndir]th-test... Applying packages.ndir.2018.08.03-18.16.02.gz... Writing /root/tmp/poldek-cache-root/[...]/packages.ndir.gz... Retrieving th-test::packages.ndir.md... Retrieving th-test::packages.ndir.diff.toc.gz... ..............................done Retrieving diff::packages.ndir.2018.08.03-19.12.01.gz... ..............................done Retrieving diff::packages.ndir.dscr.2018.08.03-19.12.01.gz... Loading [pndir]th-test... Applying packages.ndir.2018.08.03-19.12.01.gz... Retrieving diff::packages.ndir.2018.08.03-20.58.01.gz... ..............................done Retrieving diff::packages.ndir.dscr.2018.08.03-20.58.01.gz... Applying packages.ndir.2018.08.03-20.58.01.gz... Retrieving diff::packages.ndir.2018.08.03-21.51.01.gz... Retrieving diff::packages.ndir.dscr.2018.08.03-21.51.01.gz... Applying packages.ndir.2018.08.03-21.51.01.gz... Retrieving diff::packages.ndir.2018.08.03-21.52.01.gz... ..............................done Retrieving diff::packages.ndir.dscr.2018.08.03-21.52.01.gz... Applying packages.ndir.2018.08.03-21.52.01.gz... Writing /root/tmp/poldek-cache-root/[...]/packages.ndir.gz... checking conflicting packages in BRed packages poldek: Loading [pndir]ready... poldek: Loading [pndir]th-test... poldek: Loading [pndir]th-test... poldek: Loading [pndir]th-ready... poldek: Loading [pndir]th-ready... poldek: Loading [pndir]th... poldek: Loading [pndir]th... poldek: 28701 packages read poldek: Removed 5289 duplicate packages from available set poldek: Processing dependencies... poldek: There are 1 package to install: poldek: I libcpuid-0.4.0-1.x32 poldek: This operation will use 72.8KB of disk space. poldek: Need to get 26.3KB of archives. poldek: Executing pm-command.sh --upgrade -vh --test --root / --define _check_dirname_deps 1... poldek: Preparing... ################################################## no conflicts found checking BR rpm: error: Failed build dependencies: rpm: libcpuid >= 0.4.0 is needed by CPU-X-3.2.3-1.src rpm: Building target platforms: x32-pld-linux installing BR: libcpuid + poldek --noask --caplookup -Q -v '--ignore=hhvm-*' '--ignore=php4-*' '--ignore=php52-*' '--ignore=php54-*' '--ignore=php55-*' '--ignore=php56-*' '--ignore=php70-*' '--ignore=php71-*' '--ignore=php72-*' --upgrade libcpuid Loading [pndir]ready... Loading [pndir]th-test... Loading [pndir]th-test... Loading [pndir]th-ready... Loading [pndir]th-ready... Loading [pndir]th... Loading [pndir]th... 28701 packages read Removed 5289 duplicate packages from available set Processing dependencies... There are 1 package to install: I libcpuid-0.4.0-1.x32 This operation will use 72.8KB of disk space. Need to get 26.3KB of archives. Executing pm-command.sh --upgrade -vh --root / --define _check_dirname_deps 1... Preparing... ################################################## libcpuid ################################################## building RPM using: set -ex; : build-id: e0e0646b-dfcd-4861-8312-f973083cab3f; TMPDIR=/tmp/B.VQoqqo/BUILD/tmp exec nice -n 0 rpmbuild -bb --define '_smp_mflags -j9' --define '_make_opts -Otarget' --define '_pld_builder 1' --define '_topdir /tmp/B.VQoqqo' --define '_specdir %{_topdir}' --define '_sourcedir %{_specdir}' --define '_rpmdir %{_topdir}/RPMS' --define '_builddir %{_topdir}/BUILD' --target x32-pld-linux /tmp/B.VQoqqo/CPU-X.spec + : build-id: e0e0646b-dfcd-4861-8312-f973083cab3f + TMPDIR=/tmp/B.VQoqqo/BUILD/tmp + exec nice -n 0 rpmbuild -bb --define '_smp_mflags -j9' --define '_make_opts -Otarget' --define '_pld_builder 1' --define '_topdir /tmp/B.VQoqqo' --define '_specdir %{_topdir}' --define '_sourcedir %{_specdir}' --define '_rpmdir %{_topdir}/RPMS' --define '_builddir %{_topdir}/BUILD' --target x32-pld-linux /tmp/B.VQoqqo/CPU-X.spec Building target platforms: x32-pld-linux Executing(%prep): /bin/sh -e /tmp/B.VQoqqo/BUILD/tmp/rpm-tmp.43811 + umask 022 + cd /tmp/B.VQoqqo/BUILD + cd /tmp/B.VQoqqo/BUILD + rm -rf CPU-X-3.2.3 + /usr/bin/gzip -dc /tmp/B.VQoqqo/CPU-X-3.2.3.tar.gz + /bin/tar -xf - + STATUS=0 + '[' 0 -ne 0 ']' + cd CPU-X-3.2.3 + /bin/id -u + '[' 1000 '=' 0 ']' + /bin/id -u + '[' 1000 '=' 0 ']' + /bin/chmod -Rf a+rX,u+w,g-w,o-w . + exit 0 Executing(%build): /bin/sh -e /tmp/B.VQoqqo/BUILD/tmp/rpm-tmp.43811 HOME=/home/users/builder PATH=/home/users/builder/GNUstep/Tools:/usr/local/bin:/usr/bin:/bin TMPDIR=/tmp/B.VQoqqo/BUILD/tmp + umask 022 + cd /tmp/B.VQoqqo/BUILD + cd CPU-X-3.2.3 + mkdir -p build + cd build + CC=x86_64-pld-linux-gnux32-gcc CXX=x86_64-pld-linux-gnux32-g++ CPPFLAGS= /usr/bin/cmake '-DCMAKE_VERBOSE_MAKEFILE=ON' '-DCMAKE_BUILD_TYPE=PLD' '-DCMAKE_INSTALL_BINDIR:PATH=/usr/bin' '-DCMAKE_INSTALL_SBINDIR:PATH=/usr/sbin' '-DCMAKE_INSTALL_LIBEXECDIR:PATH=/usr/libexec' '-DCMAKE_INSTALL_SYSCONFDIR:PATH=/etc' '-DCMAKE_INSTALL_SHAREDSTATEDIRPATH:PATH=/var/lib' '-DCMAKE_INSTALL_LOCALSTATEDIRPATH:PATH=/var' '-DCMAKE_INSTALL_LIBDIR:PATH=/usr/libx32' '-DCMAKE_INSTALL_INCLUDEDIR:PATH=/usr/include' '-DCMAKE_INSTALL_OLDINCLUDEDIR:PATH=/usr/include' '-DCMAKE_INSTALL_DATAROOTDIR:PATH=/usr/share' '-DCMAKE_INSTALL_DATADIR:PATH=/usr/share' '-DCMAKE_INSTALL_INFODIR:PATH=/usr/share/info' '-DCMAKE_INSTALL_LOCALEDIR:PATH=/usr/share/locale' '-DCMAKE_INSTALL_MANDIR:PATH=/usr/share/man' '-DCMAKE_INSTALL_DOCDIR:PATH=/usr/share/doc' '-DCMAKE_INSTALL_PREFIX:PATH=/usr' '-DSYSCONF_INSTALL_DIR:PATH=/etc' '-DCMAKE_CXX_FLAGS_PLD=-O2 -fwrapv -pipe -Wformat -Werror=format-security -gdwarf-4 -fno-debug-types-section -fvar-tracking-assignments -g2 -Wp,-D_FORTIFY_SOURCE=2 -fstack-protector-strong --param=ssp-buffer-size=4 -fPIC -mtune=generic -march=x86-64 -gdwarf-4 -fno-debug-types-section -fvar-tracking-assignments -g2 -DNDEBUG -DQT_NO_DEBUG' '-DCMAKE_C_FLAGS_PLD=-O2 -fwrapv -pipe -Wformat -gdwarf-4 -fno-debug-types-section -fvar-tracking-assignments -g2 -Wp,-D_FORTIFY_SOURCE=2 -fstack-protector-strong --param=ssp-buffer-size=4 -fPIC -mtune=generic -march=x86-64 -gdwarf-4 -fno-debug-types-section -fvar-tracking-assignments -g2 -DNDEBUG -DQT_NO_DEBUG' '-DCMAKE_Fortran_FLAGS_PLD=-O2 -fwrapv -pipe -Wformat -gdwarf-4 -fno-debug-types-section -fvar-tracking-assignments -g2 -Wp,-D_FORTIFY_SOURCE=2 -fstack-protector-strong --param=ssp-buffer-size=4 -fPIC -mtune=generic -march=x86-64 -gdwarf-4 -fno-debug-types-section -fvar-tracking-assignments -g2 -DNDEBUG -DQT_NO_DEBUG' '-DCMAKE_EXE_LINKER_FLAGS_PLD=-Wl,--as-needed -Wl,--no-copy-dt-needed-entries -Wl,-z,relro -Wl,-z,combreloc ' '-DCMAKE_SHARED_LINKER_FLAGS_PLD=-Wl,--as-needed -Wl,--no-copy-dt-needed-entries -Wl,-z,relro -Wl,-z,combreloc ' '-DCMAKE_MODULE_LINKER_FLAGS_PLD=-Wl,--as-needed -Wl,--no-copy-dt-needed-entries -Wl,-z,relro -Wl,-z,combreloc ' '-DLIB_SUFFIX=x32' '-DBUILD_SHARED_LIBS:BOOL=ON' '-DBUILD_SHARED_LIBS:BOOL=OFF' ../ -- The C compiler identification is GNU 8.2.0 -- Check for working C compiler: /usr/bin/x86_64-pld-linux-gnux32-gcc -- Check for working C compiler: /usr/bin/x86_64-pld-linux-gnux32-gcc -- works -- Detecting C compiler ABI info -- Detecting C compiler ABI info - done -- Detecting C compile features -- Detecting C compile features - done -- Found PkgConfig: /usr/bin/pkg-config (found version "0.29.2") -- Found Gettext: /usr/bin/msgmerge (found version "0.19.8.1") -- Found Intl: /usr/include -- Looking for pthread.h -- Looking for pthread.h - found -- Looking for pthread_create -- Looking for pthread_create - not found -- Looking for pthread_create in pthreads -- Looking for pthread_create in pthreads - not found -- Looking for pthread_create in pthread -- Looking for pthread_create in pthread - found -- Found Threads: TRUE -- Looking for backtrace -- Looking for backtrace - found -- backtrace facility detected in default set of libraries -- Found Backtrace: /usr/include -- The CXX compiler identification is GNU 8.2.0 -- Check for working CXX compiler: /usr/bin/x86_64-pld-linux-gnux32-g++ -- Check for working CXX compiler: /usr/bin/x86_64-pld-linux-gnux32-g++ -- works -- Detecting CXX compiler ABI info -- Detecting CXX compiler ABI info - done -- Detecting CXX compile features -- Detecting CXX compile features - done -- Checking for module 'gtk+-3.0>=3.12.0' -- Found gtk+-3.0, version 3.22.30 -- Checking for module 'ncursesw' -- Found ncursesw, version 6.1.20180616 -- Checking for module 'libcurl' -- Found libcurl, version 7.61.0 -- Checking for module 'libcpuid>=0.4.0' -- No package 'libcpuid' found -- Checking for module 'libpci' -- Found libpci, version 3.5.6 -- Checking for module 'libprocps' -- Found libprocps, version 3.3.15 -- Using built-in dmidecode, version 3.1.20180620 -- The ASM_NASM compiler identification is NASM -- Found assembler: /usr/bin/nasm -- Using built-in bandwidth, version 1.5.1 ** cpu-x 3.2.3 configuration ** ** GTK support is enabled ** NCURSES support is enabled ** GETTEXT support is enabled ** LIBCURL support is enabled ** LIBCPUID support is disabled (not found by pkg-config) ** LIBPCI support is enabled ** LIBPROCPS support is enabled ** DMIDECODE support is enabled ** BANDWIDTH support is enabled -- Configuring done -- Generating done CMake Warning: Manually-specified variables were not used by the project: CMAKE_Fortran_FLAGS_PLD CMAKE_INSTALL_LOCALSTATEDIRPATH CMAKE_INSTALL_SHAREDSTATEDIRPATH LIB_SUFFIX SYSCONF_INSTALL_DIR -- Build files have been written to: /tmp/B.VQoqqo/BUILD/CPU-X-3.2.3/build + /usr/bin/make -Otarget -j9 /usr/bin/cmake -H/tmp/B.VQoqqo/BUILD/CPU-X-3.2.3 -B/tmp/B.VQoqqo/BUILD/CPU-X-3.2.3/build --check-build-system CMakeFiles/Makefile.cmake 0 /usr/bin/cmake -E cmake_progress_start /tmp/B.VQoqqo/BUILD/CPU-X-3.2.3/build/CMakeFiles /tmp/B.VQoqqo/BUILD/CPU-X-3.2.3/build/CMakeFiles/progress.marks /usr/bin/make -f CMakeFiles/Makefile2 all /usr/bin/make -f po/CMakeFiles/potfiles_1.dir/build.make po/CMakeFiles/potfiles_1.dir/depend /usr/bin/make -f src/CMakeFiles/tui_ncurses.dir/build.make src/CMakeFiles/tui_ncurses.dir/depend /usr/bin/make -f src/bandwidth/CMakeFiles/bandwidth.dir/build.make src/bandwidth/CMakeFiles/bandwidth.dir/depend /usr/bin/make -f src/CMakeFiles/gui_gtk.dir/build.make src/CMakeFiles/gui_gtk.dir/depend /usr/bin/make -f src/dmidecode/CMakeFiles/dmidecode.dir/build.make src/dmidecode/CMakeFiles/dmidecode.dir/depend make[2]: Entering directory '/tmp/B.VQoqqo/BUILD/CPU-X-3.2.3/build' cd /tmp/B.VQoqqo/BUILD/CPU-X-3.2.3/build && /usr/bin/cmake -E cmake_depends "Unix Makefiles" /tmp/B.VQoqqo/BUILD/CPU-X-3.2.3 /tmp/B.VQoqqo/BUILD/CPU-X-3.2.3/po /tmp/B.VQoqqo/BUILD/CPU-X-3.2.3/build /tmp/B.VQoqqo/BUILD/CPU-X-3.2.3/build/po /tmp/B.VQoqqo/BUILD/CPU-X-3.2.3/build/po/CMakeFiles/potfiles_1.dir/DependInfo.cmake --color= Scanning dependencies of target potfiles_1 make[2]: Leaving directory '/tmp/B.VQoqqo/BUILD/CPU-X-3.2.3/build' make[2]: Entering directory '/tmp/B.VQoqqo/BUILD/CPU-X-3.2.3/build' cd /tmp/B.VQoqqo/BUILD/CPU-X-3.2.3/build && /usr/bin/cmake -E cmake_depends "Unix Makefiles" /tmp/B.VQoqqo/BUILD/CPU-X-3.2.3 /tmp/B.VQoqqo/BUILD/CPU-X-3.2.3/src/dmidecode /tmp/B.VQoqqo/BUILD/CPU-X-3.2.3/build /tmp/B.VQoqqo/BUILD/CPU-X-3.2.3/build/src/dmidecode /tmp/B.VQoqqo/BUILD/CPU-X-3.2.3/build/src/dmidecode/CMakeFiles/dmidecode.dir/DependInfo.cmake --color= Scanning dependencies of target dmidecode make[2]: Leaving directory '/tmp/B.VQoqqo/BUILD/CPU-X-3.2.3/build' make[2]: Entering directory '/tmp/B.VQoqqo/BUILD/CPU-X-3.2.3/build' cd /tmp/B.VQoqqo/BUILD/CPU-X-3.2.3/build && /usr/bin/cmake -E cmake_depends "Unix Makefiles" /tmp/B.VQoqqo/BUILD/CPU-X-3.2.3 /tmp/B.VQoqqo/BUILD/CPU-X-3.2.3/src /tmp/B.VQoqqo/BUILD/CPU-X-3.2.3/build /tmp/B.VQoqqo/BUILD/CPU-X-3.2.3/build/src /tmp/B.VQoqqo/BUILD/CPU-X-3.2.3/build/src/CMakeFiles/tui_ncurses.dir/DependInfo.cmake --color= Scanning dependencies of target tui_ncurses make[2]: Leaving directory '/tmp/B.VQoqqo/BUILD/CPU-X-3.2.3/build' /usr/bin/make -f po/CMakeFiles/potfiles_1.dir/build.make po/CMakeFiles/potfiles_1.dir/build /usr/bin/make -f src/CMakeFiles/tui_ncurses.dir/build.make src/CMakeFiles/tui_ncurses.dir/build /usr/bin/make -f src/dmidecode/CMakeFiles/dmidecode.dir/build.make src/dmidecode/CMakeFiles/dmidecode.dir/build make[2]: Entering directory '/tmp/B.VQoqqo/BUILD/CPU-X-3.2.3/build' [ 3%] Generating routines-x86-64bit.o cd /tmp/B.VQoqqo/BUILD/CPU-X-3.2.3/src/bandwidth && /usr/bin/nasm -f elf64 routines-x86-64bit.asm -o /tmp/B.VQoqqo/BUILD/CPU-X-3.2.3/build/src/bandwidth/routines-x86-64bit.o make[2]: Leaving directory '/tmp/B.VQoqqo/BUILD/CPU-X-3.2.3/build' make[2]: Entering directory '/tmp/B.VQoqqo/BUILD/CPU-X-3.2.3/build' [ 12%] Generating cs_CZ.gmo cd /tmp/B.VQoqqo/BUILD/CPU-X-3.2.3/build/po && /usr/bin/msgfmt -o /tmp/B.VQoqqo/BUILD/CPU-X-3.2.3/build/po/cs_CZ.gmo /tmp/B.VQoqqo/BUILD/CPU-X-3.2.3/build/po/cs_CZ.po make[2]: Leaving directory '/tmp/B.VQoqqo/BUILD/CPU-X-3.2.3/build' make[2]: Entering directory '/tmp/B.VQoqqo/BUILD/CPU-X-3.2.3/build' [ 12%] Generating pl.gmo cd /tmp/B.VQoqqo/BUILD/CPU-X-3.2.3/build/po && /usr/bin/msgfmt -o /tmp/B.VQoqqo/BUILD/CPU-X-3.2.3/build/po/pl.gmo /tmp/B.VQoqqo/BUILD/CPU-X-3.2.3/build/po/pl.po make[2]: Leaving directory '/tmp/B.VQoqqo/BUILD/CPU-X-3.2.3/build' make[2]: Entering directory '/tmp/B.VQoqqo/BUILD/CPU-X-3.2.3/build' cd /tmp/B.VQoqqo/BUILD/CPU-X-3.2.3/build && /usr/bin/cmake -E cmake_depends "Unix Makefiles" /tmp/B.VQoqqo/BUILD/CPU-X-3.2.3 /tmp/B.VQoqqo/BUILD/CPU-X-3.2.3/src/bandwidth /tmp/B.VQoqqo/BUILD/CPU-X-3.2.3/build /tmp/B.VQoqqo/BUILD/CPU-X-3.2.3/build/src/bandwidth /tmp/B.VQoqqo/BUILD/CPU-X-3.2.3/build/src/bandwidth/CMakeFiles/bandwidth.dir/DependInfo.cmake --color= Scanning dependencies of target bandwidth make[2]: Leaving directory '/tmp/B.VQoqqo/BUILD/CPU-X-3.2.3/build' /usr/bin/make -f src/bandwidth/CMakeFiles/bandwidth.dir/build.make src/bandwidth/CMakeFiles/bandwidth.dir/build make[2]: Entering directory '/tmp/B.VQoqqo/BUILD/CPU-X-3.2.3/build' [ 25%] Generating fr.gmo cd /tmp/B.VQoqqo/BUILD/CPU-X-3.2.3/build/po && /usr/bin/msgfmt -o /tmp/B.VQoqqo/BUILD/CPU-X-3.2.3/build/po/fr.gmo /tmp/B.VQoqqo/BUILD/CPU-X-3.2.3/build/po/fr.po make[2]: Leaving directory '/tmp/B.VQoqqo/BUILD/CPU-X-3.2.3/build' make[2]: Entering directory '/tmp/B.VQoqqo/BUILD/CPU-X-3.2.3/build' [ 29%] Generating pt_BR.gmo cd /tmp/B.VQoqqo/BUILD/CPU-X-3.2.3/build/po && /usr/bin/msgfmt -o /tmp/B.VQoqqo/BUILD/CPU-X-3.2.3/build/po/pt_BR.gmo /tmp/B.VQoqqo/BUILD/CPU-X-3.2.3/build/po/pt_BR.po make[2]: Leaving directory '/tmp/B.VQoqqo/BUILD/CPU-X-3.2.3/build' make[2]: Entering directory '/tmp/B.VQoqqo/BUILD/CPU-X-3.2.3/build' cd /tmp/B.VQoqqo/BUILD/CPU-X-3.2.3/build && /usr/bin/cmake -E cmake_depends "Unix Makefiles" /tmp/B.VQoqqo/BUILD/CPU-X-3.2.3 /tmp/B.VQoqqo/BUILD/CPU-X-3.2.3/src /tmp/B.VQoqqo/BUILD/CPU-X-3.2.3/build /tmp/B.VQoqqo/BUILD/CPU-X-3.2.3/build/src /tmp/B.VQoqqo/BUILD/CPU-X-3.2.3/build/src/CMakeFiles/gui_gtk.dir/DependInfo.cmake --color= Scanning dependencies of target gui_gtk make[2]: Leaving directory '/tmp/B.VQoqqo/BUILD/CPU-X-3.2.3/build' /usr/bin/make -f src/CMakeFiles/gui_gtk.dir/build.make src/CMakeFiles/gui_gtk.dir/build make[2]: Entering directory '/tmp/B.VQoqqo/BUILD/CPU-X-3.2.3/build' [ 32%] Generating ru.gmo cd /tmp/B.VQoqqo/BUILD/CPU-X-3.2.3/build/po && /usr/bin/msgfmt -o /tmp/B.VQoqqo/BUILD/CPU-X-3.2.3/build/po/ru.gmo /tmp/B.VQoqqo/BUILD/CPU-X-3.2.3/build/po/ru.po make[2]: Leaving directory '/tmp/B.VQoqqo/BUILD/CPU-X-3.2.3/build' make[2]: Entering directory '/tmp/B.VQoqqo/BUILD/CPU-X-3.2.3/build' [ 35%] Generating zh.gmo cd /tmp/B.VQoqqo/BUILD/CPU-X-3.2.3/build/po && /usr/bin/msgfmt -o /tmp/B.VQoqqo/BUILD/CPU-X-3.2.3/build/po/zh.gmo /tmp/B.VQoqqo/BUILD/CPU-X-3.2.3/build/po/zh.po make[2]: Leaving directory '/tmp/B.VQoqqo/BUILD/CPU-X-3.2.3/build' make[1]: Entering directory '/tmp/B.VQoqqo/BUILD/CPU-X-3.2.3/build' [ 67%] Built target potfiles_1 make[1]: Leaving directory '/tmp/B.VQoqqo/BUILD/CPU-X-3.2.3/build' make[2]: Entering directory '/tmp/B.VQoqqo/BUILD/CPU-X-3.2.3/build' [ 16%] Building C object src/dmidecode/CMakeFiles/dmidecode.dir/dmioem.c.o cd /tmp/B.VQoqqo/BUILD/CPU-X-3.2.3/build/src/dmidecode && /usr/bin/x86_64-pld-linux-gnux32-gcc -DVERSION=\"3.1.20180620\" -I/usr/include/gtk-3.0 -I/usr/include/at-spi2-atk/2.0 -I/usr/include/at-spi-2.0 -I/usr/include/dbus-1.0 -I/usr/libx32/dbus-1.0/include -I/usr/include/gio-unix-2.0 -I/usr/include/cairo -I/usr/include/pango-1.0 -I/usr/include/fribidi -I/usr/include/atk-1.0 -I/usr/include/pixman-1 -I/usr/include/uuid -I/usr/include/freetype2 -I/usr/include/harfbuzz -I/usr/include/libpng16 -I/usr/include/gdk-pixbuf-2.0 -I/usr/include/glib-2.0 -I/usr/libx32/glib-2.0/include -I/usr/include/ncursesw -I/tmp/B.VQoqqo/BUILD/CPU-X-3.2.3/build/po -Wno-deprecated-declarations -Wno-unused-parameter -Wno-unused-result -Wno-format-security -O2 -fwrapv -pipe -Wformat -gdwarf-4 -fno-debug-types-section -fvar-tracking-assignments -g2 -Wp,-D_FORTIFY_SOURCE=2 -fstack-protector-strong --param=ssp-buffer-size=4 -fPIC -mtune=generic -march=x86-64 -gdwarf-4 -fno-debug-types-section -fvar-tracking-assignments -g2 -DNDEBUG -DQT_NO_DEBUG -pthread -o CMakeFiles/dmidecode.dir/dmioem.c.o -c /tmp/B.VQoqqo/BUILD/CPU-X-3.2.3/src/dmidecode/dmioem.c make[2]: Leaving directory '/tmp/B.VQoqqo/BUILD/CPU-X-3.2.3/build' make[2]: Entering directory '/tmp/B.VQoqqo/BUILD/CPU-X-3.2.3/build' [ 48%] Building C object src/bandwidth/CMakeFiles/bandwidth.dir/font.c.o cd /tmp/B.VQoqqo/BUILD/CPU-X-3.2.3/build/src/bandwidth && /usr/bin/x86_64-pld-linux-gnux32-gcc -DHAS_LIBCPUID=0 -I/usr/include/gtk-3.0 -I/usr/include/at-spi2-atk/2.0 -I/usr/include/at-spi-2.0 -I/usr/include/dbus-1.0 -I/usr/libx32/dbus-1.0/include -I/usr/include/gio-unix-2.0 -I/usr/include/cairo -I/usr/include/pango-1.0 -I/usr/include/fribidi -I/usr/include/atk-1.0 -I/usr/include/pixman-1 -I/usr/include/uuid -I/usr/include/freetype2 -I/usr/include/harfbuzz -I/usr/include/libpng16 -I/usr/include/gdk-pixbuf-2.0 -I/usr/include/glib-2.0 -I/usr/libx32/glib-2.0/include -I/usr/include/ncursesw -I/tmp/B.VQoqqo/BUILD/CPU-X-3.2.3/build/po -I/tmp/B.VQoqqo/BUILD/CPU-X-3.2.3/src/dmidecode -Wno-deprecated-declarations -Wno-unused-parameter -Wno-unused-result -Wno-format-security -O2 -fwrapv -pipe -Wformat -gdwarf-4 -fno-debug-types-section -fvar-tracking-assignments -g2 -Wp,-D_FORTIFY_SOURCE=2 -fstack-protector-strong --param=ssp-buffer-size=4 -fPIC -mtune=generic -march=x86-64 -gdwarf-4 -fno-debug-types-section -fvar-tracking-assignments -g2 -DNDEBUG -DQT_NO_DEBUG -pthread -o CMakeFiles/bandwidth.dir/font.c.o -c /tmp/B.VQoqqo/BUILD/CPU-X-3.2.3/src/bandwidth/font.c make[2]: Leaving directory '/tmp/B.VQoqqo/BUILD/CPU-X-3.2.3/build' /usr/bin/make -f po/CMakeFiles/potfiles.dir/build.make po/CMakeFiles/potfiles.dir/depend make[2]: Entering directory '/tmp/B.VQoqqo/BUILD/CPU-X-3.2.3/build' [ 22%] Building C object src/dmidecode/CMakeFiles/dmidecode.dir/util.c.o cd /tmp/B.VQoqqo/BUILD/CPU-X-3.2.3/build/src/dmidecode && /usr/bin/x86_64-pld-linux-gnux32-gcc -DVERSION=\"3.1.20180620\" -I/usr/include/gtk-3.0 -I/usr/include/at-spi2-atk/2.0 -I/usr/include/at-spi-2.0 -I/usr/include/dbus-1.0 -I/usr/libx32/dbus-1.0/include -I/usr/include/gio-unix-2.0 -I/usr/include/cairo -I/usr/include/pango-1.0 -I/usr/include/fribidi -I/usr/include/atk-1.0 -I/usr/include/pixman-1 -I/usr/include/uuid -I/usr/include/freetype2 -I/usr/include/harfbuzz -I/usr/include/libpng16 -I/usr/include/gdk-pixbuf-2.0 -I/usr/include/glib-2.0 -I/usr/libx32/glib-2.0/include -I/usr/include/ncursesw -I/tmp/B.VQoqqo/BUILD/CPU-X-3.2.3/build/po -Wno-deprecated-declarations -Wno-unused-parameter -Wno-unused-result -Wno-format-security -O2 -fwrapv -pipe -Wformat -gdwarf-4 -fno-debug-types-section -fvar-tracking-assignments -g2 -Wp,-D_FORTIFY_SOURCE=2 -fstack-protector-strong --param=ssp-buffer-size=4 -fPIC -mtune=generic -march=x86-64 -gdwarf-4 -fno-debug-types-section -fvar-tracking-assignments -g2 -DNDEBUG -DQT_NO_DEBUG -pthread -o CMakeFiles/dmidecode.dir/util.c.o -c /tmp/B.VQoqqo/BUILD/CPU-X-3.2.3/src/dmidecode/util.c make[2]: Leaving directory '/tmp/B.VQoqqo/BUILD/CPU-X-3.2.3/build' make[2]: Entering directory '/tmp/B.VQoqqo/BUILD/CPU-X-3.2.3/build' cd /tmp/B.VQoqqo/BUILD/CPU-X-3.2.3/build && /usr/bin/cmake -E cmake_depends "Unix Makefiles" /tmp/B.VQoqqo/BUILD/CPU-X-3.2.3 /tmp/B.VQoqqo/BUILD/CPU-X-3.2.3/po /tmp/B.VQoqqo/BUILD/CPU-X-3.2.3/build /tmp/B.VQoqqo/BUILD/CPU-X-3.2.3/build/po /tmp/B.VQoqqo/BUILD/CPU-X-3.2.3/build/po/CMakeFiles/potfiles.dir/DependInfo.cmake --color= Scanning dependencies of target potfiles make[2]: Leaving directory '/tmp/B.VQoqqo/BUILD/CPU-X-3.2.3/build' /usr/bin/make -f po/CMakeFiles/potfiles.dir/build.make po/CMakeFiles/potfiles.dir/build make[2]: Nothing to be done for 'po/CMakeFiles/potfiles.dir/build'. make[2]: Entering directory '/tmp/B.VQoqqo/BUILD/CPU-X-3.2.3/build' [ 74%] Building C object src/bandwidth/CMakeFiles/bandwidth.dir/minifont.c.o cd /tmp/B.VQoqqo/BUILD/CPU-X-3.2.3/build/src/bandwidth && /usr/bin/x86_64-pld-linux-gnux32-gcc -DHAS_LIBCPUID=0 -I/usr/include/gtk-3.0 -I/usr/include/at-spi2-atk/2.0 -I/usr/include/at-spi-2.0 -I/usr/include/dbus-1.0 -I/usr/libx32/dbus-1.0/include -I/usr/include/gio-unix-2.0 -I/usr/include/cairo -I/usr/include/pango-1.0 -I/usr/include/fribidi -I/usr/include/atk-1.0 -I/usr/include/pixman-1 -I/usr/include/uuid -I/usr/include/freetype2 -I/usr/include/harfbuzz -I/usr/include/libpng16 -I/usr/include/gdk-pixbuf-2.0 -I/usr/include/glib-2.0 -I/usr/libx32/glib-2.0/include -I/usr/include/ncursesw -I/tmp/B.VQoqqo/BUILD/CPU-X-3.2.3/build/po -I/tmp/B.VQoqqo/BUILD/CPU-X-3.2.3/src/dmidecode -Wno-deprecated-declarations -Wno-unused-parameter -Wno-unused-result -Wno-format-security -O2 -fwrapv -pipe -Wformat -gdwarf-4 -fno-debug-types-section -fvar-tracking-assignments -g2 -Wp,-D_FORTIFY_SOURCE=2 -fstack-protector-strong --param=ssp-buffer-size=4 -fPIC -mtune=generic -march=x86-64 -gdwarf-4 -fno-debug-types-section -fvar-tracking-assignments -g2 -DNDEBUG -DQT_NO_DEBUG -pthread -o CMakeFiles/bandwidth.dir/minifont.c.o -c /tmp/B.VQoqqo/BUILD/CPU-X-3.2.3/src/bandwidth/minifont.c make[2]: Leaving directory '/tmp/B.VQoqqo/BUILD/CPU-X-3.2.3/build' make[1]: Entering directory '/tmp/B.VQoqqo/BUILD/CPU-X-3.2.3/build' [ 74%] Built target potfiles make[1]: Leaving directory '/tmp/B.VQoqqo/BUILD/CPU-X-3.2.3/build' make[2]: Entering directory '/tmp/B.VQoqqo/BUILD/CPU-X-3.2.3/build' [ 41%] Building C object src/bandwidth/CMakeFiles/bandwidth.dir/BMPGraphing.c.o cd /tmp/B.VQoqqo/BUILD/CPU-X-3.2.3/build/src/bandwidth && /usr/bin/x86_64-pld-linux-gnux32-gcc -DHAS_LIBCPUID=0 -I/usr/include/gtk-3.0 -I/usr/include/at-spi2-atk/2.0 -I/usr/include/at-spi-2.0 -I/usr/include/dbus-1.0 -I/usr/libx32/dbus-1.0/include -I/usr/include/gio-unix-2.0 -I/usr/include/cairo -I/usr/include/pango-1.0 -I/usr/include/fribidi -I/usr/include/atk-1.0 -I/usr/include/pixman-1 -I/usr/include/uuid -I/usr/include/freetype2 -I/usr/include/harfbuzz -I/usr/include/libpng16 -I/usr/include/gdk-pixbuf-2.0 -I/usr/include/glib-2.0 -I/usr/libx32/glib-2.0/include -I/usr/include/ncursesw -I/tmp/B.VQoqqo/BUILD/CPU-X-3.2.3/build/po -I/tmp/B.VQoqqo/BUILD/CPU-X-3.2.3/src/dmidecode -Wno-deprecated-declarations -Wno-unused-parameter -Wno-unused-result -Wno-format-security -O2 -fwrapv -pipe -Wformat -gdwarf-4 -fno-debug-types-section -fvar-tracking-assignments -g2 -Wp,-D_FORTIFY_SOURCE=2 -fstack-protector-strong --param=ssp-buffer-size=4 -fPIC -mtune=generic -march=x86-64 -gdwarf-4 -fno-debug-types-section -fvar-tracking-assignments -g2 -DNDEBUG -DQT_NO_DEBUG -pthread -o CMakeFiles/bandwidth.dir/BMPGraphing.c.o -c /tmp/B.VQoqqo/BUILD/CPU-X-3.2.3/src/bandwidth/BMPGraphing.c make[2]: Leaving directory '/tmp/B.VQoqqo/BUILD/CPU-X-3.2.3/build' make[2]: Entering directory '/tmp/B.VQoqqo/BUILD/CPU-X-3.2.3/build' [ 38%] Building C object src/bandwidth/CMakeFiles/bandwidth.dir/BMP.c.o cd /tmp/B.VQoqqo/BUILD/CPU-X-3.2.3/build/src/bandwidth && /usr/bin/x86_64-pld-linux-gnux32-gcc -DHAS_LIBCPUID=0 -I/usr/include/gtk-3.0 -I/usr/include/at-spi2-atk/2.0 -I/usr/include/at-spi-2.0 -I/usr/include/dbus-1.0 -I/usr/libx32/dbus-1.0/include -I/usr/include/gio-unix-2.0 -I/usr/include/cairo -I/usr/include/pango-1.0 -I/usr/include/fribidi -I/usr/include/atk-1.0 -I/usr/include/pixman-1 -I/usr/include/uuid -I/usr/include/freetype2 -I/usr/include/harfbuzz -I/usr/include/libpng16 -I/usr/include/gdk-pixbuf-2.0 -I/usr/include/glib-2.0 -I/usr/libx32/glib-2.0/include -I/usr/include/ncursesw -I/tmp/B.VQoqqo/BUILD/CPU-X-3.2.3/build/po -I/tmp/B.VQoqqo/BUILD/CPU-X-3.2.3/src/dmidecode -Wno-deprecated-declarations -Wno-unused-parameter -Wno-unused-result -Wno-format-security -O2 -fwrapv -pipe -Wformat -gdwarf-4 -fno-debug-types-section -fvar-tracking-assignments -g2 -Wp,-D_FORTIFY_SOURCE=2 -fstack-protector-strong --param=ssp-buffer-size=4 -fPIC -mtune=generic -march=x86-64 -gdwarf-4 -fno-debug-types-section -fvar-tracking-assignments -g2 -DNDEBUG -DQT_NO_DEBUG -pthread -o CMakeFiles/bandwidth.dir/BMP.c.o -c /tmp/B.VQoqqo/BUILD/CPU-X-3.2.3/src/bandwidth/BMP.c make[2]: Leaving directory '/tmp/B.VQoqqo/BUILD/CPU-X-3.2.3/build' make[2]: Entering directory '/tmp/B.VQoqqo/BUILD/CPU-X-3.2.3/build' [ 12%] Building C object src/CMakeFiles/tui_ncurses.dir/tui_ncurses.c.o cd /tmp/B.VQoqqo/BUILD/CPU-X-3.2.3/build/src && /usr/bin/x86_64-pld-linux-gnux32-gcc -DBANDWIDTH_VERSION=\"1.5.1\" -DCC=\"GNU\" -DDMIDECODE_VERSION=\"3.1.20180620\" -DGETTEXT_PACKAGE=\"cpu-x\" -DGETTEXT_VERSION=\"0\" -DGTK_VERSION=\"3.22.30\" -DHAS_BANDWIDTH=1 -DHAS_DMIDECODE=1 -DHAS_GETTEXT=1 -DHAS_GTK=1 -DHAS_LIBCPUID=0 -DHAS_LIBCURL=1 -DHAS_LIBPCI=1 -DHAS_LIBPROCPS=1 -DHAS_LIBSTATGRAB=0 -DHAS_LIBSYSTEM=\"1\" -DHAS_NCURSES=1 -DLIBCPUID_VERSION=NULL -DLIBCURL_VERSION=\"7.61.0\" -DLIBPCI_VERSION=\"3.5.6\" -DLIBPROCPS_VERSION=\"3.3.15\" -DLIBSTATGRAB_VERSION=NULL -DLOCALEDIR=\"/usr/share/locale\" -DNCURSES_VERSION=\"6.1.20180616\" -DOS=\"linux64\" -DPORTABLE_BINARY=0 -DPRGVER=\"3.2.3\" -DTERMINFODIR=\"/lib/terminfo\" -I/usr/include/gtk-3.0 -I/usr/include/at-spi2-atk/2.0 -I/usr/include/at-spi-2.0 -I/usr/include/dbus-1.0 -I/usr/libx32/dbus-1.0/include -I/usr/include/gio-unix-2.0 -I/usr/include/cairo -I/usr/include/pango-1.0 -I/usr/include/fribidi -I/usr/include/atk-1.0 -I/usr/include/pixman-1 -I/usr/include/uuid -I/usr/include/freetype2 -I/usr/include/harfbuzz -I/usr/include/libpng16 -I/usr/include/gdk-pixbuf-2.0 -I/usr/include/glib-2.0 -I/usr/libx32/glib-2.0/include -I/usr/include/ncursesw -I/tmp/B.VQoqqo/BUILD/CPU-X-3.2.3/build/po -I/tmp/B.VQoqqo/BUILD/CPU-X-3.2.3/src/dmidecode -I/tmp/B.VQoqqo/BUILD/CPU-X-3.2.3/src/bandwidth -Wno-deprecated-declarations -Wno-unused-parameter -Wno-unused-result -Wno-format-security -O2 -fwrapv -pipe -Wformat -gdwarf-4 -fno-debug-types-section -fvar-tracking-assignments -g2 -Wp,-D_FORTIFY_SOURCE=2 -fstack-protector-strong --param=ssp-buffer-size=4 -fPIC -mtune=generic -march=x86-64 -gdwarf-4 -fno-debug-types-section -fvar-tracking-assignments -g2 -DNDEBUG -DQT_NO_DEBUG -pthread -o CMakeFiles/tui_ncurses.dir/tui_ncurses.c.o -c /tmp/B.VQoqqo/BUILD/CPU-X-3.2.3/src/tui_ncurses.c make[2]: Leaving directory '/tmp/B.VQoqqo/BUILD/CPU-X-3.2.3/build' make[2]: Entering directory '/tmp/B.VQoqqo/BUILD/CPU-X-3.2.3/build' [ 77%] Linking C static library ../output/lib/libtui_ncurses.a cd /tmp/B.VQoqqo/BUILD/CPU-X-3.2.3/build/src && /usr/bin/cmake -P CMakeFiles/tui_ncurses.dir/cmake_clean_target.cmake cd /tmp/B.VQoqqo/BUILD/CPU-X-3.2.3/build/src && /usr/bin/cmake -E cmake_link_script CMakeFiles/tui_ncurses.dir/link.txt --verbose=1 /usr/bin/ar qc ../output/lib/libtui_ncurses.a CMakeFiles/tui_ncurses.dir/tui_ncurses.c.o /usr/bin/ranlib ../output/lib/libtui_ncurses.a make[2]: Leaving directory '/tmp/B.VQoqqo/BUILD/CPU-X-3.2.3/build' make[1]: Entering directory '/tmp/B.VQoqqo/BUILD/CPU-X-3.2.3/build' [ 77%] Built target tui_ncurses make[1]: Leaving directory '/tmp/B.VQoqqo/BUILD/CPU-X-3.2.3/build' make[2]: Entering directory '/tmp/B.VQoqqo/BUILD/CPU-X-3.2.3/build' [ 48%] Building C object src/CMakeFiles/gui_gtk.dir/gui_gtk.c.o cd /tmp/B.VQoqqo/BUILD/CPU-X-3.2.3/build/src && /usr/bin/x86_64-pld-linux-gnux32-gcc -DBANDWIDTH_VERSION=\"1.5.1\" -DCC=\"GNU\" -DDMIDECODE_VERSION=\"3.1.20180620\" -DGETTEXT_PACKAGE=\"cpu-x\" -DGETTEXT_VERSION=\"0\" -DGTK_VERSION=\"3.22.30\" -DHAS_BANDWIDTH=1 -DHAS_DMIDECODE=1 -DHAS_GETTEXT=1 -DHAS_GTK=1 -DHAS_LIBCPUID=0 -DHAS_LIBCURL=1 -DHAS_LIBPCI=1 -DHAS_LIBPROCPS=1 -DHAS_LIBSTATGRAB=0 -DHAS_LIBSYSTEM=\"1\" -DHAS_NCURSES=1 -DLIBCPUID_VERSION=NULL -DLIBCURL_VERSION=\"7.61.0\" -DLIBPCI_VERSION=\"3.5.6\" -DLIBPROCPS_VERSION=\"3.3.15\" -DLIBSTATGRAB_VERSION=NULL -DLOCALEDIR=\"/usr/share/locale\" -DNCURSES_VERSION=\"6.1.20180616\" -DOS=\"linux64\" -DPORTABLE_BINARY=0 -DPRGVER=\"3.2.3\" -DTERMINFODIR=\"/lib/terminfo\" -I/usr/include/gtk-3.0 -I/usr/include/at-spi2-atk/2.0 -I/usr/include/at-spi-2.0 -I/usr/include/dbus-1.0 -I/usr/libx32/dbus-1.0/include -I/usr/include/gio-unix-2.0 -I/usr/include/cairo -I/usr/include/pango-1.0 -I/usr/include/fribidi -I/usr/include/atk-1.0 -I/usr/include/pixman-1 -I/usr/include/uuid -I/usr/include/freetype2 -I/usr/include/harfbuzz -I/usr/include/libpng16 -I/usr/include/gdk-pixbuf-2.0 -I/usr/include/glib-2.0 -I/usr/libx32/glib-2.0/include -I/usr/include/ncursesw -I/tmp/B.VQoqqo/BUILD/CPU-X-3.2.3/build/po -I/tmp/B.VQoqqo/BUILD/CPU-X-3.2.3/src/dmidecode -I/tmp/B.VQoqqo/BUILD/CPU-X-3.2.3/src/bandwidth -Wno-deprecated-declarations -Wno-unused-parameter -Wno-unused-result -Wno-format-security -O2 -fwrapv -pipe -Wformat -gdwarf-4 -fno-debug-types-section -fvar-tracking-assignments -g2 -Wp,-D_FORTIFY_SOURCE=2 -fstack-protector-strong --param=ssp-buffer-size=4 -fPIC -mtune=generic -march=x86-64 -gdwarf-4 -fno-debug-types-section -fvar-tracking-assignments -g2 -DNDEBUG -DQT_NO_DEBUG -pthread -o CMakeFiles/gui_gtk.dir/gui_gtk.c.o -c /tmp/B.VQoqqo/BUILD/CPU-X-3.2.3/src/gui_gtk.c make[2]: Leaving directory '/tmp/B.VQoqqo/BUILD/CPU-X-3.2.3/build' make[2]: Entering directory '/tmp/B.VQoqqo/BUILD/CPU-X-3.2.3/build' [ 80%] Linking C static library ../output/lib/libgui_gtk.a cd /tmp/B.VQoqqo/BUILD/CPU-X-3.2.3/build/src && /usr/bin/cmake -P CMakeFiles/gui_gtk.dir/cmake_clean_target.cmake cd /tmp/B.VQoqqo/BUILD/CPU-X-3.2.3/build/src && /usr/bin/cmake -E cmake_link_script CMakeFiles/gui_gtk.dir/link.txt --verbose=1 /usr/bin/ar qc ../output/lib/libgui_gtk.a CMakeFiles/gui_gtk.dir/gui_gtk.c.o /usr/bin/ranlib ../output/lib/libgui_gtk.a make[2]: Leaving directory '/tmp/B.VQoqqo/BUILD/CPU-X-3.2.3/build' make[1]: Entering directory '/tmp/B.VQoqqo/BUILD/CPU-X-3.2.3/build' [ 80%] Built target gui_gtk make[1]: Leaving directory '/tmp/B.VQoqqo/BUILD/CPU-X-3.2.3/build' make[2]: Entering directory '/tmp/B.VQoqqo/BUILD/CPU-X-3.2.3/build' [ 70%] Building C object src/bandwidth/CMakeFiles/bandwidth.dir/main.c.o cd /tmp/B.VQoqqo/BUILD/CPU-X-3.2.3/build/src/bandwidth && /usr/bin/x86_64-pld-linux-gnux32-gcc -DHAS_LIBCPUID=0 -I/usr/include/gtk-3.0 -I/usr/include/at-spi2-atk/2.0 -I/usr/include/at-spi-2.0 -I/usr/include/dbus-1.0 -I/usr/libx32/dbus-1.0/include -I/usr/include/gio-unix-2.0 -I/usr/include/cairo -I/usr/include/pango-1.0 -I/usr/include/fribidi -I/usr/include/atk-1.0 -I/usr/include/pixman-1 -I/usr/include/uuid -I/usr/include/freetype2 -I/usr/include/harfbuzz -I/usr/include/libpng16 -I/usr/include/gdk-pixbuf-2.0 -I/usr/include/glib-2.0 -I/usr/libx32/glib-2.0/include -I/usr/include/ncursesw -I/tmp/B.VQoqqo/BUILD/CPU-X-3.2.3/build/po -I/tmp/B.VQoqqo/BUILD/CPU-X-3.2.3/src/dmidecode -Wno-deprecated-declarations -Wno-unused-parameter -Wno-unused-result -Wno-format-security -O2 -fwrapv -pipe -Wformat -gdwarf-4 -fno-debug-types-section -fvar-tracking-assignments -g2 -Wp,-D_FORTIFY_SOURCE=2 -fstack-protector-strong --param=ssp-buffer-size=4 -fPIC -mtune=generic -march=x86-64 -gdwarf-4 -fno-debug-types-section -fvar-tracking-assignments -g2 -DNDEBUG -DQT_NO_DEBUG -pthread -o CMakeFiles/bandwidth.dir/main.c.o -c /tmp/B.VQoqqo/BUILD/CPU-X-3.2.3/src/bandwidth/main.c /tmp/B.VQoqqo/BUILD/CPU-X-3.2.3/src/bandwidth/main.c: In function 'do_write': /tmp/B.VQoqqo/BUILD/CPU-X-3.2.3/src/bandwidth/main.c:541:24: warning: unsigned conversion from 'long long int' to 'long unsigned int' changes value from '1311768458587524591' to '2309737967' [-Woverflow] unsigned long value = 0x1234567689abcdef; ^~~~~~~~~~~~~~~~~~ /tmp/B.VQoqqo/BUILD/CPU-X-3.2.3/src/bandwidth/main.c: In function 'fb_readwrite': /tmp/B.VQoqqo/BUILD/CPU-X-3.2.3/src/bandwidth/main.c:1107:24: warning: unsigned conversion from 'long long int' to 'long unsigned int' changes value from '1311768458587524591' to '2309737967' [-Woverflow] unsigned long value = 0x1234567689abcdef; ^~~~~~~~~~~~~~~~~~ make[2]: Leaving directory '/tmp/B.VQoqqo/BUILD/CPU-X-3.2.3/build' make[2]: Entering directory '/tmp/B.VQoqqo/BUILD/CPU-X-3.2.3/build' [ 83%] Linking C static library ../../output/lib/libbandwidth.a cd /tmp/B.VQoqqo/BUILD/CPU-X-3.2.3/build/src/bandwidth && /usr/bin/cmake -P CMakeFiles/bandwidth.dir/cmake_clean_target.cmake cd /tmp/B.VQoqqo/BUILD/CPU-X-3.2.3/build/src/bandwidth && /usr/bin/cmake -E cmake_link_script CMakeFiles/bandwidth.dir/link.txt --verbose=1 /usr/bin/ar qc ../../output/lib/libbandwidth.a CMakeFiles/bandwidth.dir/BMP.c.o CMakeFiles/bandwidth.dir/BMPGraphing.c.o CMakeFiles/bandwidth.dir/font.c.o CMakeFiles/bandwidth.dir/main.c.o CMakeFiles/bandwidth.dir/minifont.c.o routines-x86-64bit.o /usr/bin/ranlib ../../output/lib/libbandwidth.a make[2]: Leaving directory '/tmp/B.VQoqqo/BUILD/CPU-X-3.2.3/build' make[1]: Entering directory '/tmp/B.VQoqqo/BUILD/CPU-X-3.2.3/build' [ 83%] Built target bandwidth make[1]: Leaving directory '/tmp/B.VQoqqo/BUILD/CPU-X-3.2.3/build' make[2]: Entering directory '/tmp/B.VQoqqo/BUILD/CPU-X-3.2.3/build' [ 19%] Building C object src/dmidecode/CMakeFiles/dmidecode.dir/dmidecode.c.o cd /tmp/B.VQoqqo/BUILD/CPU-X-3.2.3/build/src/dmidecode && /usr/bin/x86_64-pld-linux-gnux32-gcc -DVERSION=\"3.1.20180620\" -I/usr/include/gtk-3.0 -I/usr/include/at-spi2-atk/2.0 -I/usr/include/at-spi-2.0 -I/usr/include/dbus-1.0 -I/usr/libx32/dbus-1.0/include -I/usr/include/gio-unix-2.0 -I/usr/include/cairo -I/usr/include/pango-1.0 -I/usr/include/fribidi -I/usr/include/atk-1.0 -I/usr/include/pixman-1 -I/usr/include/uuid -I/usr/include/freetype2 -I/usr/include/harfbuzz -I/usr/include/libpng16 -I/usr/include/gdk-pixbuf-2.0 -I/usr/include/glib-2.0 -I/usr/libx32/glib-2.0/include -I/usr/include/ncursesw -I/tmp/B.VQoqqo/BUILD/CPU-X-3.2.3/build/po -Wno-deprecated-declarations -Wno-unused-parameter -Wno-unused-result -Wno-format-security -O2 -fwrapv -pipe -Wformat -gdwarf-4 -fno-debug-types-section -fvar-tracking-assignments -g2 -Wp,-D_FORTIFY_SOURCE=2 -fstack-protector-strong --param=ssp-buffer-size=4 -fPIC -mtune=generic -march=x86-64 -gdwarf-4 -fno-debug-types-section -fvar-tracking-assignments -g2 -DNDEBUG -DQT_NO_DEBUG -pthread -o CMakeFiles/dmidecode.dir/dmidecode.c.o -c /tmp/B.VQoqqo/BUILD/CPU-X-3.2.3/src/dmidecode/dmidecode.c make[2]: Leaving directory '/tmp/B.VQoqqo/BUILD/CPU-X-3.2.3/build' make[2]: Entering directory '/tmp/B.VQoqqo/BUILD/CPU-X-3.2.3/build' [ 87%] Linking C static library ../../output/lib/libdmidecode.a cd /tmp/B.VQoqqo/BUILD/CPU-X-3.2.3/build/src/dmidecode && /usr/bin/cmake -P CMakeFiles/dmidecode.dir/cmake_clean_target.cmake cd /tmp/B.VQoqqo/BUILD/CPU-X-3.2.3/build/src/dmidecode && /usr/bin/cmake -E cmake_link_script CMakeFiles/dmidecode.dir/link.txt --verbose=1 /usr/bin/ar qc ../../output/lib/libdmidecode.a CMakeFiles/dmidecode.dir/util.c.o CMakeFiles/dmidecode.dir/dmioem.c.o CMakeFiles/dmidecode.dir/dmidecode.c.o /usr/bin/ranlib ../../output/lib/libdmidecode.a make[2]: Leaving directory '/tmp/B.VQoqqo/BUILD/CPU-X-3.2.3/build' make[1]: Entering directory '/tmp/B.VQoqqo/BUILD/CPU-X-3.2.3/build' [ 87%] Built target dmidecode make[1]: Leaving directory '/tmp/B.VQoqqo/BUILD/CPU-X-3.2.3/build' /usr/bin/make -f src/CMakeFiles/cpu-x.dir/build.make src/CMakeFiles/cpu-x.dir/depend make[2]: Entering directory '/tmp/B.VQoqqo/BUILD/CPU-X-3.2.3/build' cd /tmp/B.VQoqqo/BUILD/CPU-X-3.2.3/build && /usr/bin/cmake -E cmake_depends "Unix Makefiles" /tmp/B.VQoqqo/BUILD/CPU-X-3.2.3 /tmp/B.VQoqqo/BUILD/CPU-X-3.2.3/src /tmp/B.VQoqqo/BUILD/CPU-X-3.2.3/build /tmp/B.VQoqqo/BUILD/CPU-X-3.2.3/build/src /tmp/B.VQoqqo/BUILD/CPU-X-3.2.3/build/src/CMakeFiles/cpu-x.dir/DependInfo.cmake --color= Scanning dependencies of target cpu-x make[2]: Leaving directory '/tmp/B.VQoqqo/BUILD/CPU-X-3.2.3/build' /usr/bin/make -f src/CMakeFiles/cpu-x.dir/build.make src/CMakeFiles/cpu-x.dir/build make[2]: Entering directory '/tmp/B.VQoqqo/BUILD/CPU-X-3.2.3/build' [ 93%] Building C object src/CMakeFiles/cpu-x.dir/util.c.o cd /tmp/B.VQoqqo/BUILD/CPU-X-3.2.3/build/src && /usr/bin/x86_64-pld-linux-gnux32-gcc -DBANDWIDTH_VERSION=\"1.5.1\" -DCC=\"GNU\" -DDMIDECODE_VERSION=\"3.1.20180620\" -DGETTEXT_PACKAGE=\"cpu-x\" -DGETTEXT_VERSION=\"0\" -DGTK_VERSION=\"3.22.30\" -DHAS_BANDWIDTH=1 -DHAS_DMIDECODE=1 -DHAS_GETTEXT=1 -DHAS_GTK=1 -DHAS_LIBCPUID=0 -DHAS_LIBCURL=1 -DHAS_LIBPCI=1 -DHAS_LIBPROCPS=1 -DHAS_LIBSTATGRAB=0 -DHAS_LIBSYSTEM=\"1\" -DHAS_NCURSES=1 -DLIBCPUID_VERSION=NULL -DLIBCURL_VERSION=\"7.61.0\" -DLIBPCI_VERSION=\"3.5.6\" -DLIBPROCPS_VERSION=\"3.3.15\" -DLIBSTATGRAB_VERSION=NULL -DLOCALEDIR=\"/usr/share/locale\" -DNCURSES_VERSION=\"6.1.20180616\" -DOS=\"linux64\" -DPORTABLE_BINARY=0 -DPRGVER=\"3.2.3\" -DTERMINFODIR=\"/lib/terminfo\" -I/usr/include/gtk-3.0 -I/usr/include/at-spi2-atk/2.0 -I/usr/include/at-spi-2.0 -I/usr/include/dbus-1.0 -I/usr/libx32/dbus-1.0/include -I/usr/include/gio-unix-2.0 -I/usr/include/cairo -I/usr/include/pango-1.0 -I/usr/include/fribidi -I/usr/include/atk-1.0 -I/usr/include/pixman-1 -I/usr/include/uuid -I/usr/include/freetype2 -I/usr/include/harfbuzz -I/usr/include/libpng16 -I/usr/include/gdk-pixbuf-2.0 -I/usr/include/glib-2.0 -I/usr/libx32/glib-2.0/include -I/usr/include/ncursesw -I/tmp/B.VQoqqo/BUILD/CPU-X-3.2.3/build/po -I/tmp/B.VQoqqo/BUILD/CPU-X-3.2.3/src/dmidecode -I/tmp/B.VQoqqo/BUILD/CPU-X-3.2.3/src/bandwidth -Wno-deprecated-declarations -Wno-unused-parameter -Wno-unused-result -Wno-format-security -O2 -fwrapv -pipe -Wformat -gdwarf-4 -fno-debug-types-section -fvar-tracking-assignments -g2 -Wp,-D_FORTIFY_SOURCE=2 -fstack-protector-strong --param=ssp-buffer-size=4 -fPIC -mtune=generic -march=x86-64 -gdwarf-4 -fno-debug-types-section -fvar-tracking-assignments -g2 -DNDEBUG -DQT_NO_DEBUG -pthread -o CMakeFiles/cpu-x.dir/util.c.o -c /tmp/B.VQoqqo/BUILD/CPU-X-3.2.3/src/util.c make[2]: Leaving directory '/tmp/B.VQoqqo/BUILD/CPU-X-3.2.3/build' make[2]: Entering directory '/tmp/B.VQoqqo/BUILD/CPU-X-3.2.3/build' [ 90%] Building C object src/CMakeFiles/cpu-x.dir/main.c.o cd /tmp/B.VQoqqo/BUILD/CPU-X-3.2.3/build/src && /usr/bin/x86_64-pld-linux-gnux32-gcc -DBANDWIDTH_VERSION=\"1.5.1\" -DCC=\"GNU\" -DDMIDECODE_VERSION=\"3.1.20180620\" -DGETTEXT_PACKAGE=\"cpu-x\" -DGETTEXT_VERSION=\"0\" -DGTK_VERSION=\"3.22.30\" -DHAS_BANDWIDTH=1 -DHAS_DMIDECODE=1 -DHAS_GETTEXT=1 -DHAS_GTK=1 -DHAS_LIBCPUID=0 -DHAS_LIBCURL=1 -DHAS_LIBPCI=1 -DHAS_LIBPROCPS=1 -DHAS_LIBSTATGRAB=0 -DHAS_LIBSYSTEM=\"1\" -DHAS_NCURSES=1 -DLIBCPUID_VERSION=NULL -DLIBCURL_VERSION=\"7.61.0\" -DLIBPCI_VERSION=\"3.5.6\" -DLIBPROCPS_VERSION=\"3.3.15\" -DLIBSTATGRAB_VERSION=NULL -DLOCALEDIR=\"/usr/share/locale\" -DNCURSES_VERSION=\"6.1.20180616\" -DOS=\"linux64\" -DPORTABLE_BINARY=0 -DPRGVER=\"3.2.3\" -DTERMINFODIR=\"/lib/terminfo\" -I/usr/include/gtk-3.0 -I/usr/include/at-spi2-atk/2.0 -I/usr/include/at-spi-2.0 -I/usr/include/dbus-1.0 -I/usr/libx32/dbus-1.0/include -I/usr/include/gio-unix-2.0 -I/usr/include/cairo -I/usr/include/pango-1.0 -I/usr/include/fribidi -I/usr/include/atk-1.0 -I/usr/include/pixman-1 -I/usr/include/uuid -I/usr/include/freetype2 -I/usr/include/harfbuzz -I/usr/include/libpng16 -I/usr/include/gdk-pixbuf-2.0 -I/usr/include/glib-2.0 -I/usr/libx32/glib-2.0/include -I/usr/include/ncursesw -I/tmp/B.VQoqqo/BUILD/CPU-X-3.2.3/build/po -I/tmp/B.VQoqqo/BUILD/CPU-X-3.2.3/src/dmidecode -I/tmp/B.VQoqqo/BUILD/CPU-X-3.2.3/src/bandwidth -Wno-deprecated-declarations -Wno-unused-parameter -Wno-unused-result -Wno-format-security -O2 -fwrapv -pipe -Wformat -gdwarf-4 -fno-debug-types-section -fvar-tracking-assignments -g2 -Wp,-D_FORTIFY_SOURCE=2 -fstack-protector-strong --param=ssp-buffer-size=4 -fPIC -mtune=generic -march=x86-64 -gdwarf-4 -fno-debug-types-section -fvar-tracking-assignments -g2 -DNDEBUG -DQT_NO_DEBUG -pthread -o CMakeFiles/cpu-x.dir/main.c.o -c /tmp/B.VQoqqo/BUILD/CPU-X-3.2.3/src/main.c make[2]: Leaving directory '/tmp/B.VQoqqo/BUILD/CPU-X-3.2.3/build' make[2]: Entering directory '/tmp/B.VQoqqo/BUILD/CPU-X-3.2.3/build' [ 96%] Building C object src/CMakeFiles/cpu-x.dir/core.c.o cd /tmp/B.VQoqqo/BUILD/CPU-X-3.2.3/build/src && /usr/bin/x86_64-pld-linux-gnux32-gcc -DBANDWIDTH_VERSION=\"1.5.1\" -DCC=\"GNU\" -DDMIDECODE_VERSION=\"3.1.20180620\" -DGETTEXT_PACKAGE=\"cpu-x\" -DGETTEXT_VERSION=\"0\" -DGTK_VERSION=\"3.22.30\" -DHAS_BANDWIDTH=1 -DHAS_DMIDECODE=1 -DHAS_GETTEXT=1 -DHAS_GTK=1 -DHAS_LIBCPUID=0 -DHAS_LIBCURL=1 -DHAS_LIBPCI=1 -DHAS_LIBPROCPS=1 -DHAS_LIBSTATGRAB=0 -DHAS_LIBSYSTEM=\"1\" -DHAS_NCURSES=1 -DLIBCPUID_VERSION=NULL -DLIBCURL_VERSION=\"7.61.0\" -DLIBPCI_VERSION=\"3.5.6\" -DLIBPROCPS_VERSION=\"3.3.15\" -DLIBSTATGRAB_VERSION=NULL -DLOCALEDIR=\"/usr/share/locale\" -DNCURSES_VERSION=\"6.1.20180616\" -DOS=\"linux64\" -DPORTABLE_BINARY=0 -DPRGVER=\"3.2.3\" -DTERMINFODIR=\"/lib/terminfo\" -I/usr/include/gtk-3.0 -I/usr/include/at-spi2-atk/2.0 -I/usr/include/at-spi-2.0 -I/usr/include/dbus-1.0 -I/usr/libx32/dbus-1.0/include -I/usr/include/gio-unix-2.0 -I/usr/include/cairo -I/usr/include/pango-1.0 -I/usr/include/fribidi -I/usr/include/atk-1.0 -I/usr/include/pixman-1 -I/usr/include/uuid -I/usr/include/freetype2 -I/usr/include/harfbuzz -I/usr/include/libpng16 -I/usr/include/gdk-pixbuf-2.0 -I/usr/include/glib-2.0 -I/usr/libx32/glib-2.0/include -I/usr/include/ncursesw -I/tmp/B.VQoqqo/BUILD/CPU-X-3.2.3/build/po -I/tmp/B.VQoqqo/BUILD/CPU-X-3.2.3/src/dmidecode -I/tmp/B.VQoqqo/BUILD/CPU-X-3.2.3/src/bandwidth -Wno-deprecated-declarations -Wno-unused-parameter -Wno-unused-result -Wno-format-security -O2 -fwrapv -pipe -Wformat -gdwarf-4 -fno-debug-types-section -fvar-tracking-assignments -g2 -Wp,-D_FORTIFY_SOURCE=2 -fstack-protector-strong --param=ssp-buffer-size=4 -fPIC -mtune=generic -march=x86-64 -gdwarf-4 -fno-debug-types-section -fvar-tracking-assignments -g2 -DNDEBUG -DQT_NO_DEBUG -pthread -o CMakeFiles/cpu-x.dir/core.c.o -c /tmp/B.VQoqqo/BUILD/CPU-X-3.2.3/src/core.c /tmp/B.VQoqqo/BUILD/CPU-X-3.2.3/src/core.c: In function 'fallback_mode_static': /tmp/B.VQoqqo/BUILD/CPU-X-3.2.3/src/core.c:1306:10: warning: implicit declaration of function 'cputab_package_fallback'; did you mean 'cputab_multipliers_fallback'? [-Wimplicit-function-declaration] err += cputab_package_fallback(data); ^~~~~~~~~~~~~~~~~~~~~~~ cputab_multipliers_fallback In file included from /tmp/B.VQoqqo/BUILD/CPU-X-3.2.3/src/core.c:36: /tmp/B.VQoqqo/BUILD/CPU-X-3.2.3/src/core.c: At top level: /tmp/B.VQoqqo/BUILD/CPU-X-3.2.3/src/core.h:37:12: warning: 'call_libcpuid_static' used but never defined static int call_libcpuid_static(Labels *data); ^~~~~~~~~~~~~~~~~~~~ /tmp/B.VQoqqo/BUILD/CPU-X-3.2.3/src/core.h:41:12: warning: 'call_libcpuid_dynamic' used but never defined static int call_libcpuid_dynamic(Labels *data); ^~~~~~~~~~~~~~~~~~~~~ /tmp/B.VQoqqo/BUILD/CPU-X-3.2.3/src/core.h:45:12: warning: 'call_libcpuid_msr_static' used but never defined static int call_libcpuid_msr_static(Labels *data); ^~~~~~~~~~~~~~~~~~~~~~~~ /tmp/B.VQoqqo/BUILD/CPU-X-3.2.3/src/core.h:49:12: warning: 'call_libcpuid_msr_dynamic' used but never defined static int call_libcpuid_msr_dynamic(Labels *data); ^~~~~~~~~~~~~~~~~~~~~~~~~ make[2]: Leaving directory '/tmp/B.VQoqqo/BUILD/CPU-X-3.2.3/build' make[2]: Entering directory '/tmp/B.VQoqqo/BUILD/CPU-X-3.2.3/build' [100%] Linking C executable ../output/bin/cpu-x cd /tmp/B.VQoqqo/BUILD/CPU-X-3.2.3/build/src && /usr/bin/cmake -E cmake_link_script CMakeFiles/cpu-x.dir/link.txt --verbose=1 /usr/bin/x86_64-pld-linux-gnux32-gcc -Wno-deprecated-declarations -Wno-unused-parameter -Wno-unused-result -Wno-format-security -O2 -fwrapv -pipe -Wformat -gdwarf-4 -fno-debug-types-section -fvar-tracking-assignments -g2 -Wp,-D_FORTIFY_SOURCE=2 -fstack-protector-strong --param=ssp-buffer-size=4 -fPIC -mtune=generic -march=x86-64 -gdwarf-4 -fno-debug-types-section -fvar-tracking-assignments -g2 -DNDEBUG -DQT_NO_DEBUG -Wl,-z,noexecstack -Wl,-z,relro -Wl,-z,now -Wl,--as-needed -Wl,--no-copy-dt-needed-entries -Wl,-z,relro -Wl,-z,combreloc -rdynamic CMakeFiles/cpu-x.dir/main.c.o CMakeFiles/cpu-x.dir/util.c.o CMakeFiles/cpu-x.dir/core.c.o -o ../output/bin/cpu-x -lm -lpthread ../output/lib/libgui_gtk.a -lgtk-3 -lgdk-3 -lpangocairo-1.0 -lpango-1.0 -lfribidi -latk-1.0 -lcairo-gobject -lcairo -lgdk_pixbuf-2.0 -lgio-2.0 -lgobject-2.0 -lglib-2.0 ../output/lib/libtui_ncurses.a -lncursesw -lcurl -lpci -lprocps ../output/lib/libdmidecode.a ../output/lib/libbandwidth.a /usr/bin/ld: i386:x86-64 architecture of input file `../output/lib/libbandwidth.a(routines-x86-64bit.o)' is incompatible with i386:x64-32 output collect2: error: ld returned 1 exit status make[2]: *** [src/CMakeFiles/cpu-x.dir/build.make:121: output/bin/cpu-x] Error 1 make[2]: Leaving directory '/tmp/B.VQoqqo/BUILD/CPU-X-3.2.3/build' make[1]: *** [CMakeFiles/Makefile2:358: src/CMakeFiles/cpu-x.dir/all] Error 2 make: *** [Makefile:133: all] Error 2 error: Bad exit status from /tmp/B.VQoqqo/BUILD/tmp/rpm-tmp.43811 (%build) RPM build errors: Bad exit status from /tmp/B.VQoqqo/BUILD/tmp/rpm-tmp.43811 (%build) ended at: Sat Aug 4 13:15:10 2018, done in 0:00:07.907085 error: No files produced. + chmod -R u+rwX /tmp/B.VQoqqo/BUILD + rm -rf /tmp/B.VQoqqo/tmp /tmp/B.VQoqqo/BUILD + rm -rf /tmp/B.VQoqqo Begin-PLD-Builder-Info Build-Time: user:21.90s sys:5.87s real:30.00s (faults io:7 non-io:565646) End-PLD-Builder-Info
[Back to list of logs] [View rpm -qa of builder]