FailedOk

th/SRPMS[OK]
th/x32[OK]
th/i686[OK]
th/x86_64[OK]

ac/SRPMS[OK]
ac/i386[OK]
ac/i586[OK]
ac/i686[OK]
ac/alpha[OK]
ac/amd64[OK]
ac/athlon[OK]
ac/ppc[OK]
ac/sparc[OK]
ac/sparc64[OK]

Advanced Search
main()
Powered by PLD Linux
(c) 2002-2020 PLD Team
$Revision: 1.37 $
Powered by computron.
Your IP: 3.216.79.60

WireGuard bd839227-2098-4fcd-af19-a893697498eb

Status:Failed
Source URL:https://buildlogs.pld-linux.org/pld/th/x32/FAIL/WireGuard,bd839227-2098-4fcd-af19-a893697498eb.bz2
text/plain URL:View!
rpm -qa of builder:View!
Date:2020/11/17 21:15:47
Runtime:0:00:09.466122

Toc:

  • prep
  • Executing(%prep): /bin/sh -e /tmp/B.KOtecG/BUILD/tmp/rpm-tmp.19194
  • build
  • Executing(%build): /bin/sh -e /tmp/B.KOtecG/BUILD/tmp/rpm-tmp.19194
  • error 1
  • /tmp/B.KOtecG/BUILD/wireguard-linux-compat-1.0.20200520/src/crypto/zinc/blake2s/blake2s-x86_64.S:50: Error: invalid character '(' in mnemonic
  • error 2
  • /tmp/B.KOtecG/BUILD/wireguard-linux-compat-1.0.20200520/src/crypto/zinc/blake2s/blake2s-x86_64.S:176: Error: invalid character '(' in mnemonic
  • error 3
  • /tmp/B.KOtecG/BUILD/wireguard-linux-compat-1.0.20200520/src/crypto/zinc/blake2s/blake2s-x86_64.S:180: Error: invalid character '(' in mnemonic
  • error 4
  • /tmp/B.KOtecG/BUILD/wireguard-linux-compat-1.0.20200520/src/crypto/zinc/blake2s/blake2s-x86_64.S:257: Error: invalid character '(' in mnemonic
  • error 5
  • make[1]: *** [scripts/Makefile.build:348: /tmp/B.KOtecG/BUILD/wireguard-linux-compat-1.0.20200520/src/crypto/zinc/blake2s/blake2s-x86_64.o] Error 1
  • error 6
  • error: Bad exit status from /tmp/B.KOtecG/BUILD/tmp/rpm-tmp.19194 (%build)
  • error 7
  • RPM build errors:
  • error 8
  • error: No files produced.

Content:

request from: baggins
checking if we should skip the build
started at: Tue Nov 17 21:15:31 2020
killing old processes on a builder
sending signal 9 to pid -1
Killed
cleaning up /tmp
fetching https://srcbuilder.pld-linux.org/th//srpms/bd839227-2098-4fcd-af19-a893697498eb/WireGuard-1.0.20200520-1%405.9.8_1.src.rpm
fetched 277349 bytes, 562.1 K/s
installing srpm: WireGuard-1.0.20200520-1@5.9.8_1.src.rpm
+ install -d /tmp/B.KOtecG/BUILD /tmp/B.KOtecG/RPMS
+ LC_ALL=en_US.UTF-8
+ rpm -qp --changelog WireGuard-1.0.20200520-1@5.9.8_1.src.rpm
* Tue Nov 17 2020 PLD Linux Team <feedback@pld-linux.org>
- For complete changelog see: http://git.pld-linux.org/?p=packages/WireGuard.git;a=log;h=auto/th/WireGuard-1.0.20200520-1
* Sat May 30 2020 Jan Rękorajski <baggins@pld-linux.org> deb45b8
- up to 1.0.20200520 * Mon May 04 2020 Jan Rękorajski <baggins@pld-linux.org> 8ff7e6a
- fix version macros - rel 2 * Mon May 04 2020 Jan Rękorajski <baggins@pld-linux.org> 0fe76ed
- tools had been split by upstram to wireguard-tools package - switch sources to wireguard-linux-compat for Linux 3.10 - 5.5 - updated to 1.0.20200429 * Sun Apr 05 2020 Jan Rękorajski <baggins@pld-linux.org> fdb609f
- fix building on kernel 5.4.29+ - rel 2 * Sun Dec 22 2019 Jan Rękorajski <baggins@pld-linux.org> 2b10bf9
- up to 0.0.20191219 * Mon Nov 25 2019 Patryk Szczygłowski <patryk@patryk.net> fc2111f
- up to 0.0.20191012 + rpm -Uhv --nodeps --define '_topdir /tmp/B.KOtecG' --define '_specdir %{_topdir}' --define '_sourcedir %{_specdir}' --define '_rpmdir %{_topdir}/RPMS' --define '_builddir %{_topdir}/BUILD' --without userspace --define 'build_kernels 5.4,4.19,4.14,4.9' WireGuard-1.0.20200520-1@5.9.8_1.src.rpm Preparing... ################################################## WireGuard ################################################## + rm -f WireGuard-1.0.20200520-1@5.9.8_1.src.rpm + install -m 700 -d /tmp/B.KOtecG/BUILD/tmp + TMPDIR=/tmp/B.KOtecG/BUILD/tmp + exec nice -n 0 rpmbuild -bp --short-circuit --nodeps --define '_topdir /tmp/B.KOtecG' --define '_specdir %{_topdir}' --define '_sourcedir %{_specdir}' --define '_rpmdir %{_topdir}/RPMS' --define '_builddir %{_topdir}/BUILD' --without userspace --target x32-pld-linux --define 'build_kernels 5.4,4.19,4.14,4.9' --define 'prep exit 0' /tmp/B.KOtecG/WireGuard.spec Building target platforms: x32-pld-linux checking BuildConflict-ing packages no BuildConflicts found checking BR rpm: Building target platforms: x32-pld-linux no BR needed building RPM using: set -ex; : build-id: bd839227-2098-4fcd-af19-a893697498eb; TMPDIR=/tmp/B.KOtecG/BUILD/tmp exec nice -n 0 rpmbuild -bb --define '_smp_mflags -j9' --define '_make_opts -Otarget' --define '_pld_builder 1' --define '_topdir /tmp/B.KOtecG' --define '_specdir %{_topdir}' --define '_sourcedir %{_specdir}' --define '_rpmdir %{_topdir}/RPMS' --define '_builddir %{_topdir}/BUILD' --without userspace --target x32-pld-linux --define 'build_kernels 5.4,4.19,4.14,4.9' /tmp/B.KOtecG/WireGuard.spec + : build-id: bd839227-2098-4fcd-af19-a893697498eb + TMPDIR=/tmp/B.KOtecG/BUILD/tmp + exec nice -n 0 rpmbuild -bb --define '_smp_mflags -j9' --define '_make_opts -Otarget' --define '_pld_builder 1' --define '_topdir /tmp/B.KOtecG' --define '_specdir %{_topdir}' --define '_sourcedir %{_specdir}' --define '_rpmdir %{_topdir}/RPMS' --define '_builddir %{_topdir}/BUILD' --without userspace --target x32-pld-linux --define 'build_kernels 5.4,4.19,4.14,4.9' /tmp/B.KOtecG/WireGuard.spec Building target platforms: x32-pld-linux Executing(%prep): /bin/sh -e /tmp/B.KOtecG/BUILD/tmp/rpm-tmp.19194 + umask 022 + cd /tmp/B.KOtecG/BUILD + cd /tmp/B.KOtecG/BUILD + rm -rf wireguard-linux-compat-1.0.20200520 + /usr/bin/xz -dc /tmp/B.KOtecG/wireguard-linux-compat-1.0.20200520.tar.xz + /bin/tar -xf - + STATUS=0 + '[' 0 -ne 0 ']' + cd wireguard-linux-compat-1.0.20200520 + /bin/id -u + '[' 1000 '=' 0 ']' + /bin/id -u + '[' 1000 '=' 0 ']' + /bin/chmod -Rf a+rX,u+w,g-w,o-w . + exit 0 Executing(%build): /bin/sh -e /tmp/B.KOtecG/BUILD/tmp/rpm-tmp.19194 HOME=/home/users/builder PATH=/home/users/builder/GNUstep/Tools:/bin:/usr/bin:/usr/local/bin TMPDIR=/tmp/B.KOtecG/BUILD/tmp + umask 022 + cd /tmp/B.KOtecG/BUILD + cd wireguard-linux-compat-1.0.20200520 + cd src + compile + typeset 'L=<' PATCH_SH + set -e -x + '[' -r /usr/src/linux-5.4/.config ']' + rm -rf o + install -d o/include/linux o/include/generated o/arch/x86/include o/arch/powerpc/lib + ln -sf /usr/src/linux-5.4/.config o/.config + ln -sf /usr/src/linux-5.4/Module.symvers o/Module.symvers + '[' -f /usr/src/linux-5.4/include/generated/autoconf.h ']' + ln -sf /usr/src/linux-5.4/include/generated/autoconf.h o/include/generated/autoconf.h + ln -s ../generated/autoconf.h o/include/linux/autoconf.h + '[' -d /usr/src/linux-5.4/arch/x86/include/generated ']' + ln -s /usr/src/linux-5.4/arch/x86/include/generated o/arch/x86/include + set +x + install -d o/include/config + touch o/include/config/MARKER + ln -sf /usr/src/linux-5.4/include/config/auto.conf o/include/config/auto.conf + ln -sf /usr/src/linux-5.4/scripts o/scripts + /usr/bin/make -Otarget -j9 -C /usr/src/linux-5.4 clean 'RCS_FIND_IGNORE=-name '\''*.[ks]o'\'' -o' 'M=/tmp/B.KOtecG/BUILD/wireguard-linux-compat-1.0.20200520/src' 'HOSTCC=x86_64-pld-linux-gnux32-gcc' 'SYSSRC=/usr/src/linux-5.4' 'SYSOUT=/tmp/B.KOtecG/BUILD/wireguard-linux-compat-1.0.20200520/src/o' 'CC=x86_64-pld-linux-gnux32-gcc' + /usr/bin/make -Otarget -j9 -C /usr/src/linux-5.4 modules 'M=/tmp/B.KOtecG/BUILD/wireguard-linux-compat-1.0.20200520/src' 'CONSTIFY_PLUGIN=' 'HOSTCC=x86_64-pld-linux-gnux32-gcc' 'SYSSRC=/usr/src/linux-5.4' 'SYSOUT=/tmp/B.KOtecG/BUILD/wireguard-linux-compat-1.0.20200520/src/o' 'CC=x86_64-pld-linux-gnux32-gcc' CC [M] /tmp/B.KOtecG/BUILD/wireguard-linux-compat-1.0.20200520/src/main.o CC [M] /tmp/B.KOtecG/BUILD/wireguard-linux-compat-1.0.20200520/src/queueing.o CC [M] /tmp/B.KOtecG/BUILD/wireguard-linux-compat-1.0.20200520/src/timers.o CC [M] /tmp/B.KOtecG/BUILD/wireguard-linux-compat-1.0.20200520/src/socket.o CC [M] /tmp/B.KOtecG/BUILD/wireguard-linux-compat-1.0.20200520/src/send.o CC [M] /tmp/B.KOtecG/BUILD/wireguard-linux-compat-1.0.20200520/src/noise.o CC [M] /tmp/B.KOtecG/BUILD/wireguard-linux-compat-1.0.20200520/src/peer.o CC [M] /tmp/B.KOtecG/BUILD/wireguard-linux-compat-1.0.20200520/src/device.o PERLASM /tmp/B.KOtecG/BUILD/wireguard-linux-compat-1.0.20200520/src/crypto/zinc/chacha20/chacha20-x86_64.S PERLASM /tmp/B.KOtecG/BUILD/wireguard-linux-compat-1.0.20200520/src/crypto/zinc/poly1305/poly1305-x86_64.S CC [M] /tmp/B.KOtecG/BUILD/wireguard-linux-compat-1.0.20200520/src/receive.o CC [M] /tmp/B.KOtecG/BUILD/wireguard-linux-compat-1.0.20200520/src/peerlookup.o CC [M] /tmp/B.KOtecG/BUILD/wireguard-linux-compat-1.0.20200520/src/ratelimiter.o AS [M] /tmp/B.KOtecG/BUILD/wireguard-linux-compat-1.0.20200520/src/crypto/zinc/blake2s/blake2s-x86_64.o In file included from <command-line>: /tmp/B.KOtecG/BUILD/wireguard-linux-compat-1.0.20200520/src/compat/compat-asm.h:44: warning: "SYM_FUNC_START" redefined 44 | #define SYM_FUNC_START ENTRY | In file included from /tmp/B.KOtecG/BUILD/wireguard-linux-compat-1.0.20200520/src/compat/compat-asm.h:9, from <command-line>: ./include/linux/linkage.h:218: note: this is the location of the previous definition 218 | #define SYM_FUNC_START(name) \ | In file included from <command-line>: /tmp/B.KOtecG/BUILD/wireguard-linux-compat-1.0.20200520/src/compat/compat-asm.h:45: warning: "SYM_FUNC_END" redefined 45 | #define SYM_FUNC_END ENDPROC | In file included from /tmp/B.KOtecG/BUILD/wireguard-linux-compat-1.0.20200520/src/compat/compat-asm.h:9, from <command-line>: ./include/linux/linkage.h:265: note: this is the location of the previous definition 265 | #define SYM_FUNC_END(name) \ | /tmp/B.KOtecG/BUILD/wireguard-linux-compat-1.0.20200520/src/crypto/zinc/blake2s/blake2s-x86_64.S: Assembler messages: /tmp/B.KOtecG/BUILD/wireguard-linux-compat-1.0.20200520/src/crypto/zinc/blake2s/blake2s-x86_64.S:50: Error: invalid character '(' in mnemonic /tmp/B.KOtecG/BUILD/wireguard-linux-compat-1.0.20200520/src/crypto/zinc/blake2s/blake2s-x86_64.S:176: Error: invalid character '(' in mnemonic /tmp/B.KOtecG/BUILD/wireguard-linux-compat-1.0.20200520/src/crypto/zinc/blake2s/blake2s-x86_64.S:180: Error: invalid character '(' in mnemonic /tmp/B.KOtecG/BUILD/wireguard-linux-compat-1.0.20200520/src/crypto/zinc/blake2s/blake2s-x86_64.S:257: Error: invalid character '(' in mnemonic make[1]: *** [scripts/Makefile.build:348: /tmp/B.KOtecG/BUILD/wireguard-linux-compat-1.0.20200520/src/crypto/zinc/blake2s/blake2s-x86_64.o] Error 1 make[1]: *** Waiting for unfinished jobs.... CC [M] /tmp/B.KOtecG/BUILD/wireguard-linux-compat-1.0.20200520/src/allowedips.o CC [M] /tmp/B.KOtecG/BUILD/wireguard-linux-compat-1.0.20200520/src/cookie.o CC [M] /tmp/B.KOtecG/BUILD/wireguard-linux-compat-1.0.20200520/src/crypto/zinc/poly1305/poly1305.o CC [M] /tmp/B.KOtecG/BUILD/wireguard-linux-compat-1.0.20200520/src/netlink.o CC [M] /tmp/B.KOtecG/BUILD/wireguard-linux-compat-1.0.20200520/src/crypto/zinc/chacha20poly1305.o CC [M] /tmp/B.KOtecG/BUILD/wireguard-linux-compat-1.0.20200520/src/crypto/zinc/chacha20/chacha20.o CC [M] /tmp/B.KOtecG/BUILD/wireguard-linux-compat-1.0.20200520/src/crypto/zinc/blake2s/blake2s.o CC [M] /tmp/B.KOtecG/BUILD/wireguard-linux-compat-1.0.20200520/src/crypto/zinc/curve25519/curve25519.o make: *** [Makefile:1729: /tmp/B.KOtecG/BUILD/wireguard-linux-compat-1.0.20200520/src] Error 2 error: Bad exit status from /tmp/B.KOtecG/BUILD/tmp/rpm-tmp.19194 (%build) RPM build errors: Bad exit status from /tmp/B.KOtecG/BUILD/tmp/rpm-tmp.19194 (%build) ended at: Tue Nov 17 21:15:46 2020, done in 0:00:09.466122 error: No files produced. + chmod -R u+rwX /tmp/B.KOtecG/BUILD + rm -rf /tmp/B.KOtecG/tmp /tmp/B.KOtecG/BUILD + rm -rf /tmp/B.KOtecG Begin-PLD-Builder-Info Build-Time: user:32.88s sys:4.50s real:15.49s (faults io:2 non-io:936647) End-PLD-Builder-Info
[Back to list of logs] [View rpm -qa of builder]