Advanced Search
Powered by PLD Linux
(c) 2002-2019 PLD Team
$Revision: 1.37 $
Powered by KDE.
Your IP:

autogen 642ee61f-4b06-4249-9c18-5a1d0cc4b422

Source URL:,642ee61f-4b06-4249-9c18-5a1d0cc4b422.bz2
text/plain URL:View!
full text:View!
rpm -qa of builder:View!
Date:2018/08/02 20:43:41


  • error 1
  • usage.c:790:38: error: 's ' directive output may be truncated writing 2 bytes into a region of size between 0 and 9 [-Werror=format-truncation=]
  • error 2
  • make[4]: *** [Makefile:695: libopts_la-libopts.lo] Error 1
  • error 3
  • make[3]: *** [Makefile:929: all-recursive] Error 1
  • error 4
  • make[2]: *** [Makefile:554: all] Error 2
  • error 5
  • make[1]: *** [Makefile:541: all-recursive] Error 1
  • error 6
  • error: Bad exit status from /tmp/B.BJRYDk/BUILD/tmp/rpm-tmp.18831 (%build)
  • error 7
  • RPM build errors:
  • error 8
  • error: No files produced.


checking whether we have a functional realpath(3C)... yes
checking whether strftime() works... yes
checking whether fopen accepts "b" mode... yes
checking whether fopen accepts "t" mode... yes
checking whether not wanting optional option args... yes
checking for fopencookie... yes
checking for static inline... static inline
checking for working stdnoreturn.h... (cached) yes
checking if malloc debugging is wanted... no
checking for gawk... (cached) gawk
checking for runetype.h... (cached) no
checking for wchar.h... (cached) yes
checking for stdarg.h... (cached) yes
checking for wchar_t... (cached) yes
checking for wint_t... (cached) yes
checking for long double... yes
checking for strtoul... yes
checking for ldexpl... yes
checking for frexpl... yes
checking for log in -lm... yes
checking for copysign... yes
checking for copysignl... yes
checking whether ln -s works... yes
checking that generated files are newer than configure... done
configure: creating ./config.status
config.status: creating autoopts/mk-autoopts-pc
config.status: creating autoopts/autoopts-config
config.status: creating autoopts/tpl/tpl-config.tlib
config.status: creating doc/auto_gen.tpl
config.status: creating autoopts/test/defs
config.status: creating config/mk-shdefs
config.status: creating pkg/pkg-env
config.status: creating Makefile
config.status: creating agen5/Makefile
config.status: creating agen5/test/Makefile
config.status: creating autoopts/Makefile
config.status: creating autoopts/test/Makefile
config.status: creating columns/Makefile
config.status: creating compat/Makefile
config.status: creating doc/Makefile
config.status: creating getdefs/Makefile
config.status: creating getdefs/test/Makefile
config.status: creating pkg/Makefile
config.status: creating snprintfv/Makefile
config.status: creating xml2ag/Makefile
config.status: creating xml2ag/test/Makefile
config.status: creating config.h
config.status: executing depfiles commands
config.status: executing libtool commands
config.status: executing stamp-h commands

  Source code location:   .
  Compiler:               x86_64-pld-linux-gnux32-gcc
  Compiler flags:         -O2 -fwrapv -pipe -Wformat -Werror=format-security -gdwarf-4 -fno-debug-types-section -fvar-tracking-assignments -g2 -Wp,-D_FORTIFY_SOURCE=2 -fstack-protector-strong --param=ssp-buffer-size=4 -fPIC -mtune=generic -march=x86-64 -gdwarf-4 -fno-debug-types-section -fvar-tracking-assignments -g2  -Wno-format-contains-nul -fno-strict-aliasing
  Host System Type:       x86_64-pld-linux-gnux32
  Install path:           /usr

  See config.h for further configuration information.
+ /usr/bin/make -Otarget -j9
/bin/sh config/mk-shdefs config/shdefs
config.status: creating shdef-temp
/usr/bin/make  all-recursive
Making all in compat
make[2]: Entering directory '/tmp/B.BJRYDk/BUILD/autogen-5.18.14/compat'
make[2]: Leaving directory '/tmp/B.BJRYDk/BUILD/autogen-5.18.14/compat'
Making all in snprintfv
make[2]: Entering directory '/tmp/B.BJRYDk/BUILD/autogen-5.18.14/snprintfv'
for f in filament.c format.c printf.c mem.c stream.c custom.c ; do echo "#include \"$f\"" ; done > snv.c
make[2]: Leaving directory '/tmp/B.BJRYDk/BUILD/autogen-5.18.14/snprintfv'
make[2]: Entering directory '/tmp/B.BJRYDk/BUILD/autogen-5.18.14/snprintfv'
/bin/sh ../libtool  --tag=CC   --mode=compile x86_64-pld-linux-gnux32-gcc -DHAVE_CONFIG_H -I. -I..  -I..   -O2 -fwrapv -pipe -Wformat -Werror=format-security -gdwarf-4 -fno-debug-types-section -fvar-tracking-assignments -g2 -Wp,-D_FORTIFY_SOURCE=2 -fstack-protector-strong --param=ssp-buffer-size=4 -fPIC -mtune=generic -march=x86-64 -gdwarf-4 -fno-debug-types-section -fvar-tracking-assignments -g2  -Wno-format-contains-nul -fno-strict-aliasing -MT snv.lo -MD -MP -MF .deps/snv.Tpo -c -o snv.lo snv.c
libtool: compile:  x86_64-pld-linux-gnux32-gcc -DHAVE_CONFIG_H -I. -I.. -I.. -O2 -fwrapv -pipe -Wformat -Werror=format-security -gdwarf-4 -fno-debug-types-section -fvar-tracking-assignments -g2 -Wp,-D_FORTIFY_SOURCE=2 -fstack-protector-strong --param=ssp-buffer-size=4 -fPIC -mtune=generic -march=x86-64 -gdwarf-4 -fno-debug-types-section -fvar-tracking-assignments -g2 -Wno-format-contains-nul -fno-strict-aliasing -MT snv.lo -MD -MP -MF .deps/snv.Tpo -c snv.c  -fPIC -DPIC -o .libs/snv.o
libtool: compile:  x86_64-pld-linux-gnux32-gcc -DHAVE_CONFIG_H -I. -I.. -I.. -O2 -fwrapv -pipe -Wformat -Werror=format-security -gdwarf-4 -fno-debug-types-section -fvar-tracking-assignments -g2 -Wp,-D_FORTIFY_SOURCE=2 -fstack-protector-strong --param=ssp-buffer-size=4 -fPIC -mtune=generic -march=x86-64 -gdwarf-4 -fno-debug-types-section -fvar-tracking-assignments -g2 -Wno-format-contains-nul -fno-strict-aliasing -MT snv.lo -MD -MP -MF .deps/snv.Tpo -c snv.c -o snv.o >/dev/null 2>&1
mv -f .deps/snv.Tpo .deps/snv.Plo
make[2]: Leaving directory '/tmp/B.BJRYDk/BUILD/autogen-5.18.14/snprintfv'
make[2]: Entering directory '/tmp/B.BJRYDk/BUILD/autogen-5.18.14/snprintfv'
/bin/sh ../libtool  --tag=CC   --mode=link x86_64-pld-linux-gnux32-gcc  -O2 -fwrapv -pipe -Wformat -Werror=format-security -gdwarf-4 -fno-debug-types-section -fvar-tracking-assignments -g2 -Wp,-D_FORTIFY_SOURCE=2 -fstack-protector-strong --param=ssp-buffer-size=4 -fPIC -mtune=generic -march=x86-64 -gdwarf-4 -fno-debug-types-section -fvar-tracking-assignments -g2  -Wno-format-contains-nul -fno-strict-aliasing -no-undefined -Wl,--as-needed -Wl,--no-copy-dt-needed-entries -Wl,-z,relro -Wl,-z,combreloc  -o  snv.lo  -lm -ldl 
libtool: link: ar cru .libs/libsnprintfv.a .libs/snv.o 
libtool: link: ranlib .libs/libsnprintfv.a
libtool: link: ( cd ".libs" && rm -f "" && ln -s "../" "" )
make[2]: Leaving directory '/tmp/B.BJRYDk/BUILD/autogen-5.18.14/snprintfv'
Making all in autoopts
/usr/bin/make  all-recursive
Making all in test
make[4]: Nothing to be done for 'all'.
make[4]: Entering directory '/tmp/B.BJRYDk/BUILD/autogen-5.18.14/autoopts'
LGCFLAGS="-pthread -I/usr/include/guile/2.0" \
AGexe="/tmp/B.BJRYDk/BUILD/autogen-5.18.14/agen5/autogen" GDexe="/tmp/B.BJRYDk/BUILD/autogen-5.18.14/getdefs/getdefs" CLexe="/tmp/B.BJRYDk/BUILD/autogen-5.18.14/columns/columns" srcdir="."     top_srcdir=".." builddir="." top_builddir=".." AO_AGE="16"     AO_CURRENT="41" AO_REVISION="1" POSIX_SHELL="/bin/bash" \
    /bin/bash ./ tpl-config-stamp autoopts/options.h autoopts/usage-txt.h genshell.h option-xat-attribute.h option-value-type.h ao-strs.h ag-char-map.h autoopts.h project.h proto.h parse-duration.c ao-strs.c option-value-type.c option-xat-attribute.c autoopts.c alias.c    boolean.c   check.c     configfile.c cook.c enum.c     env.c       file.c      find.c       genshell.c load.c     makeshell.c nested.c    numeric.c    pgusage.c putshell.c reset.c     restore.c   save.c       sort.c stack.c    streqvcmp.c text_mmap.c time.c       tokenize.c usage.c    version.c   init.c
make[4]: Leaving directory '/tmp/B.BJRYDk/BUILD/autogen-5.18.14/autoopts'
make[4]: Entering directory '/tmp/B.BJRYDk/BUILD/autogen-5.18.14/autoopts'
/bin/sh ../libtool  --tag=CC   --mode=compile x86_64-pld-linux-gnux32-gcc -DHAVE_CONFIG_H -I. -I..  -I.. -I../autoopts  -DPKGDATADIR='"/usr/share/autogen"' -O2 -fwrapv -pipe -Wformat -Werror=format-security -gdwarf-4 -fno-debug-types-section -fvar-tracking-assignments -g2 -Wp,-D_FORTIFY_SOURCE=2 -fstack-protector-strong --param=ssp-buffer-size=4 -fPIC -mtune=generic -march=x86-64 -gdwarf-4 -fno-debug-types-section -fvar-tracking-assignments -g2  -Wno-format-contains-nul -fno-strict-aliasing -Wall -Werror -Wcast-align -Wmissing-prototypes -Wpointer-arith -Wshadow -Wstrict-prototypes -Wwrite-strings -Wstrict-aliasing=3 -Wextra -Wno-cast-qual -O2 -fwrapv -pipe -Wformat -Werror=format-security -gdwarf-4 -fno-debug-types-section -fvar-tracking-assignments -g2 -Wp,-D_FORTIFY_SOURCE=2 -fstack-protector-strong --param=ssp-buffer-size=4 -fPIC -mtune=generic -march=x86-64 -gdwarf-4 -fno-debug-types-section -fvar-tracking-assignments -g2  -Wno-format-contains-nul -fno-strict-aliasing -MT libopts_la-libopts.lo -MD -MP -MF .deps/libopts_la-libopts.Tpo -c -o libopts_la-libopts.lo `test -f 'libopts.c' || echo './'`libopts.c
libtool: compile:  x86_64-pld-linux-gnux32-gcc -DHAVE_CONFIG_H -I. -I.. -I.. -I../autoopts -DPKGDATADIR=\"/usr/share/autogen\" -O2 -fwrapv -pipe -Wformat -Werror=format-security -gdwarf-4 -fno-debug-types-section -fvar-tracking-assignments -g2 -Wp,-D_FORTIFY_SOURCE=2 -fstack-protector-strong --param=ssp-buffer-size=4 -fPIC -mtune=generic -march=x86-64 -gdwarf-4 -fno-debug-types-section -fvar-tracking-assignments -g2 -Wno-format-contains-nul -fno-strict-aliasing -Wall -Werror -Wcast-align -Wmissing-prototypes -Wpointer-arith -Wshadow -Wstrict-prototypes -Wwrite-strings -Wstrict-aliasing=3 -Wextra -Wno-cast-qual -O2 -fwrapv -pipe -Wformat -Werror=format-security -gdwarf-4 -fno-debug-types-section -fvar-tracking-assignments -g2 -Wp,-D_FORTIFY_SOURCE=2 -fstack-protector-strong --param=ssp-buffer-size=4 -fPIC -mtune=generic -march=x86-64 -gdwarf-4 -fno-debug-types-section -fvar-tracking-assignments -g2 -Wno-format-contains-nul -fno-strict-aliasing -MT libopts_la-libopts.lo -MD -MP -MF .deps/libopts_la-libopts.Tpo -c libopts.c  -fPIC -DPIC -o .libs/libopts_la-libopts.o
In file included from libopts.c:46:
usage.c: In function 'prt_extd_usage':
usage.c:790:38: error: 's ' directive output may be truncated writing 2 bytes into a region of size between 0 and 9 [-Werror=format-truncation=]
         snprintf(vfmt, sizeof(vfmt), vfmtfmt, (unsigned int)nmlen + 4);
In file included from /usr/include/stdio.h:862,
                 from ../compat/compat.h:112,
                 from ../autoopts/project.h:30,
                 from libopts.c:2:
/usr/include/bits/stdio2.h:64:10: note: '__builtin___snprintf_chk' output between 9 and 18 bytes into a destination of size 12
   return __builtin___snprintf_chk (__s, __n, __USE_FORTIFY_LEVEL - 1,
        __bos (__s), __fmt, __va_arg_pack ());
cc1: all warnings being treated as errors
make[4]: *** [Makefile:695: libopts_la-libopts.lo] Error 1
make[4]: Leaving directory '/tmp/B.BJRYDk/BUILD/autogen-5.18.14/autoopts'
make[3]: *** [Makefile:929: all-recursive] Error 1
make[2]: *** [Makefile:554: all] Error 2
make[1]: *** [Makefile:541: all-recursive] Error 1
make: *** [Makefile:448: all] Error 2
error: Bad exit status from /tmp/B.BJRYDk/BUILD/tmp/rpm-tmp.18831 (%build)

RPM build errors:
    Bad exit status from /tmp/B.BJRYDk/BUILD/tmp/rpm-tmp.18831 (%build)
ended at: Thu Aug  2 20:43:41 2018, done in 0:00:21.228782
error: No files produced.
+ chmod -R u+rwX /tmp/B.BJRYDk/BUILD
+ rm -rf /tmp/B.BJRYDk/tmp /tmp/B.BJRYDk/BUILD
+ rm -rf /tmp/B.BJRYDk
Build-Time: user:15.88s sys:3.86s real:25.26s (faults io:0 non-io:1255989)

[Back to list of logs] [View rpm -qa of builder]