FailedOk

th/SRPMS[OK]
th/x32[OK]
th/i686[OK]
th/x86_64[OK]

ac/SRPMS[OK]
ac/i386[OK]
ac/i586[OK]
ac/i686[OK]
ac/alpha[OK]
ac/amd64[OK]
ac/athlon[OK]
ac/ppc[OK]
ac/sparc[OK]
ac/sparc64[OK]

Advanced Search
main()
Powered by PLD Linux
(c) 2002-2018 PLD Team
$Revision: 1.37 $
Powered by /dev/zero.
Your IP: 54.221.147.93

autogen ed7212c5-5b7c-4451-ae71-e3dd269660a2

Status:Failed
Source URL:ftp://buildlogs.pld-linux.org/th/x32/FAIL/autogen,ed7212c5-5b7c-4451-ae71-e3dd269660a2.bz2
text/plain URL:View!
full text:View!
rpm -qa of builder:View!
Date:2018/08/01 21:38:50
Runtime:0:00:20.462535

Toc:

  • error 1
  • configfile.c:467:20: error: this statement may fall through [-Werror=implicit-fallthrough=]
  • error 2
  • boolean.c:63:5: error: this statement may fall through [-Werror=implicit-fallthrough=]
  • error 3
  • makeshell.c:324:14: error: this statement may fall through [-Werror=implicit-fallthrough=]
  • error 4
  • makeshell.c:328:14: error: this statement may fall through [-Werror=implicit-fallthrough=]
  • error 5
  • makeshell.c:337:13: error: this statement may fall through [-Werror=implicit-fallthrough=]
  • error 6
  • makeshell.c:887:9: error: this statement may fall through [-Werror=implicit-fallthrough=]
  • error 7
  • makeshell.c:932:9: error: this statement may fall through [-Werror=implicit-fallthrough=]
  • error 8
  • numeric.c:139:24: error: this statement may fall through [-Werror=implicit-fallthrough=]
  • error 9
  • numeric.c:140:24: error: this statement may fall through [-Werror=implicit-fallthrough=]
  • error 10
  • numeric.c:141:24: error: this statement may fall through [-Werror=implicit-fallthrough=]
  • error 11
  • numeric.c:144:24: error: this statement may fall through [-Werror=implicit-fallthrough=]
  • error 12
  • numeric.c:145:24: error: this statement may fall through [-Werror=implicit-fallthrough=]
  • error 13
  • numeric.c:146:24: error: this statement may fall through [-Werror=implicit-fallthrough=]
  • error 14
  • usage.c:790:38: error: 's ' directive output may be truncated writing 2 bytes into a region of size between 0 and 9 [-Werror=format-truncation=]
  • error 15
  • make[4]: *** [Makefile:695: libopts_la-libopts.lo] Error 1
  • error 16
  • make[3]: *** [Makefile:929: all-recursive] Error 1
  • error 17
  • make[2]: *** [Makefile:554: all] Error 2
  • error 18
  • make[1]: *** [Makefile:541: all-recursive] Error 1
  • error 19
  • error: Bad exit status from /tmp/B.GZ3831/BUILD/tmp/rpm-tmp.69542 (%build)
  • error 20
  • RPM build errors:
  • error 21
  • error: No files produced.

Content:

checking whether we have a functional realpath(3C)... yes
checking whether strftime() works... yes
checking whether fopen accepts "b" mode... yes
checking whether fopen accepts "t" mode... yes
checking whether not wanting optional option args... yes
checking for fopencookie... yes
checking for static inline... static inline
checking for working stdnoreturn.h... (cached) yes
checking if malloc debugging is wanted... no
checking for gawk... (cached) gawk
checking for runetype.h... (cached) no
checking for wchar.h... (cached) yes
checking for stdarg.h... (cached) yes
checking for wchar_t... (cached) yes
checking for wint_t... (cached) yes
checking for long double... yes
checking for strtoul... yes
checking for ldexpl... yes
checking for frexpl... yes
checking for log in -lm... yes
checking for copysign... yes
checking for copysignl... yes
checking whether ln -s works... yes
checking that generated files are newer than configure... done
configure: creating ./config.status
config.status: creating autoopts/mk-autoopts-pc
config.status: creating autoopts/autoopts-config
config.status: creating autoopts/tpl/tpl-config.tlib
config.status: creating doc/auto_gen.tpl
config.status: creating autoopts/test/defs
config.status: creating config/mk-shdefs
config.status: creating pkg/pkg-env
config.status: creating Makefile
config.status: creating agen5/Makefile
config.status: creating agen5/test/Makefile
config.status: creating autoopts/Makefile
config.status: creating autoopts/test/Makefile
config.status: creating columns/Makefile
config.status: creating compat/Makefile
config.status: creating doc/Makefile
config.status: creating getdefs/Makefile
config.status: creating getdefs/test/Makefile
config.status: creating pkg/Makefile
config.status: creating snprintfv/Makefile
config.status: creating xml2ag/Makefile
config.status: creating xml2ag/test/Makefile
config.status: creating config.h
config.status: executing depfiles commands
config.status: executing libtool commands
config.status: executing stamp-h commands
------------------------------------------------------------------------
Configuration:

  Source code location:   .
  Compiler:               x86_64-pld-linux-gnux32-gcc
  Compiler flags:         -O2 -fwrapv -pipe -Wformat -Werror=format-security -gdwarf-4 -fno-debug-types-section -fvar-tracking-assignments -g2 -Wp,-D_FORTIFY_SOURCE=2 -fstack-protector-strong --param=ssp-buffer-size=4 -fPIC -mtune=generic -march=x86-64 -gdwarf-4 -fno-debug-types-section -fvar-tracking-assignments -g2  -Wno-format-contains-nul -fno-strict-aliasing
  Host System Type:       x86_64-pld-linux-gnux32
  Install path:           /usr

  See config.h for further configuration information.
------------------------------------------------------------------------
+ /usr/bin/make -Otarget -j9
/bin/sh config/mk-shdefs config/shdefs
config.status: creating shdef-temp
/usr/bin/make  all-recursive
Making all in compat
make[2]: Entering directory '/tmp/B.GZ3831/BUILD/autogen-5.18.14/compat'
:
make[2]: Leaving directory '/tmp/B.GZ3831/BUILD/autogen-5.18.14/compat'
Making all in snprintfv
make[2]: Entering directory '/tmp/B.GZ3831/BUILD/autogen-5.18.14/snprintfv'
for f in filament.c format.c printf.c mem.c stream.c custom.c ; do echo "#include \"$f\"" ; done > snv.c
make[2]: Leaving directory '/tmp/B.GZ3831/BUILD/autogen-5.18.14/snprintfv'
make[2]: Entering directory '/tmp/B.GZ3831/BUILD/autogen-5.18.14/snprintfv'
/bin/sh ../libtool  --tag=CC   --mode=compile x86_64-pld-linux-gnux32-gcc -DHAVE_CONFIG_H -I. -I..  -I..   -O2 -fwrapv -pipe -Wformat -Werror=format-security -gdwarf-4 -fno-debug-types-section -fvar-tracking-assignments -g2 -Wp,-D_FORTIFY_SOURCE=2 -fstack-protector-strong --param=ssp-buffer-size=4 -fPIC -mtune=generic -march=x86-64 -gdwarf-4 -fno-debug-types-section -fvar-tracking-assignments -g2  -Wno-format-contains-nul -fno-strict-aliasing -MT snv.lo -MD -MP -MF .deps/snv.Tpo -c -o snv.lo snv.c
libtool: compile:  x86_64-pld-linux-gnux32-gcc -DHAVE_CONFIG_H -I. -I.. -I.. -O2 -fwrapv -pipe -Wformat -Werror=format-security -gdwarf-4 -fno-debug-types-section -fvar-tracking-assignments -g2 -Wp,-D_FORTIFY_SOURCE=2 -fstack-protector-strong --param=ssp-buffer-size=4 -fPIC -mtune=generic -march=x86-64 -gdwarf-4 -fno-debug-types-section -fvar-tracking-assignments -g2 -Wno-format-contains-nul -fno-strict-aliasing -MT snv.lo -MD -MP -MF .deps/snv.Tpo -c snv.c  -fPIC -DPIC -o .libs/snv.o
libtool: compile:  x86_64-pld-linux-gnux32-gcc -DHAVE_CONFIG_H -I. -I.. -I.. -O2 -fwrapv -pipe -Wformat -Werror=format-security -gdwarf-4 -fno-debug-types-section -fvar-tracking-assignments -g2 -Wp,-D_FORTIFY_SOURCE=2 -fstack-protector-strong --param=ssp-buffer-size=4 -fPIC -mtune=generic -march=x86-64 -gdwarf-4 -fno-debug-types-section -fvar-tracking-assignments -g2 -Wno-format-contains-nul -fno-strict-aliasing -MT snv.lo -MD -MP -MF .deps/snv.Tpo -c snv.c -o snv.o >/dev/null 2>&1
mv -f .deps/snv.Tpo .deps/snv.Plo
make[2]: Leaving directory '/tmp/B.GZ3831/BUILD/autogen-5.18.14/snprintfv'
make[2]: Entering directory '/tmp/B.GZ3831/BUILD/autogen-5.18.14/snprintfv'
/bin/sh ../libtool  --tag=CC   --mode=link x86_64-pld-linux-gnux32-gcc  -O2 -fwrapv -pipe -Wformat -Werror=format-security -gdwarf-4 -fno-debug-types-section -fvar-tracking-assignments -g2 -Wp,-D_FORTIFY_SOURCE=2 -fstack-protector-strong --param=ssp-buffer-size=4 -fPIC -mtune=generic -march=x86-64 -gdwarf-4 -fno-debug-types-section -fvar-tracking-assignments -g2  -Wno-format-contains-nul -fno-strict-aliasing -no-undefined -Wl,--as-needed -Wl,--no-copy-dt-needed-entries -Wl,-z,relro -Wl,-z,combreloc  -o libsnprintfv.la  snv.lo  -lm -ldl 
libtool: link: ar cru .libs/libsnprintfv.a .libs/snv.o 
libtool: link: ranlib .libs/libsnprintfv.a
libtool: link: ( cd ".libs" && rm -f "libsnprintfv.la" && ln -s "../libsnprintfv.la" "libsnprintfv.la" )
make[2]: Leaving directory '/tmp/B.GZ3831/BUILD/autogen-5.18.14/snprintfv'
Making all in autoopts
/usr/bin/make  all-recursive
Making all in test
make[4]: Nothing to be done for 'all'.
make[4]: Entering directory '/tmp/B.GZ3831/BUILD/autogen-5.18.14/autoopts'
LGCFLAGS="-pthread -I/usr/include/guile/2.0" \
AGexe="/tmp/B.GZ3831/BUILD/autogen-5.18.14/agen5/autogen" GDexe="/tmp/B.GZ3831/BUILD/autogen-5.18.14/getdefs/getdefs" CLexe="/tmp/B.GZ3831/BUILD/autogen-5.18.14/columns/columns" srcdir="."     top_srcdir=".." builddir="." top_builddir=".." AO_AGE="16"     AO_CURRENT="41" AO_REVISION="1" POSIX_SHELL="/bin/bash" \
    /bin/bash ./mk-tpl-config.sh tpl-config-stamp autoopts/options.h autoopts/usage-txt.h genshell.h option-xat-attribute.h option-value-type.h ao-strs.h ag-char-map.h autoopts.h project.h proto.h parse-duration.c ao-strs.c option-value-type.c option-xat-attribute.c autoopts.c alias.c    boolean.c   check.c     configfile.c cook.c enum.c     env.c       file.c      find.c       genshell.c load.c     makeshell.c nested.c    numeric.c    pgusage.c putshell.c reset.c     restore.c   save.c       sort.c stack.c    streqvcmp.c text_mmap.c time.c       tokenize.c usage.c    version.c   init.c
make[4]: Leaving directory '/tmp/B.GZ3831/BUILD/autogen-5.18.14/autoopts'
make[4]: Entering directory '/tmp/B.GZ3831/BUILD/autogen-5.18.14/autoopts'
/bin/sh ../libtool  --tag=CC   --mode=compile x86_64-pld-linux-gnux32-gcc -DHAVE_CONFIG_H -I. -I..  -I.. -I../autoopts  -DPKGDATADIR='"/usr/share/autogen"' -O2 -fwrapv -pipe -Wformat -Werror=format-security -gdwarf-4 -fno-debug-types-section -fvar-tracking-assignments -g2 -Wp,-D_FORTIFY_SOURCE=2 -fstack-protector-strong --param=ssp-buffer-size=4 -fPIC -mtune=generic -march=x86-64 -gdwarf-4 -fno-debug-types-section -fvar-tracking-assignments -g2  -Wno-format-contains-nul -fno-strict-aliasing -Wall -Werror -Wcast-align -Wmissing-prototypes -Wpointer-arith -Wshadow -Wstrict-prototypes -Wwrite-strings -Wstrict-aliasing=3 -Wextra -Wno-cast-qual -O2 -fwrapv -pipe -Wformat -Werror=format-security -gdwarf-4 -fno-debug-types-section -fvar-tracking-assignments -g2 -Wp,-D_FORTIFY_SOURCE=2 -fstack-protector-strong --param=ssp-buffer-size=4 -fPIC -mtune=generic -march=x86-64 -gdwarf-4 -fno-debug-types-section -fvar-tracking-assignments -g2  -Wno-format-contains-nul -fno-strict-aliasing -MT libopts_la-libopts.lo -MD -MP -MF .deps/libopts_la-libopts.Tpo -c -o libopts_la-libopts.lo `test -f 'libopts.c' || echo './'`libopts.c
libtool: compile:  x86_64-pld-linux-gnux32-gcc -DHAVE_CONFIG_H -I. -I.. -I.. -I../autoopts -DPKGDATADIR=\"/usr/share/autogen\" -O2 -fwrapv -pipe -Wformat -Werror=format-security -gdwarf-4 -fno-debug-types-section -fvar-tracking-assignments -g2 -Wp,-D_FORTIFY_SOURCE=2 -fstack-protector-strong --param=ssp-buffer-size=4 -fPIC -mtune=generic -march=x86-64 -gdwarf-4 -fno-debug-types-section -fvar-tracking-assignments -g2 -Wno-format-contains-nul -fno-strict-aliasing -Wall -Werror -Wcast-align -Wmissing-prototypes -Wpointer-arith -Wshadow -Wstrict-prototypes -Wwrite-strings -Wstrict-aliasing=3 -Wextra -Wno-cast-qual -O2 -fwrapv -pipe -Wformat -Werror=format-security -gdwarf-4 -fno-debug-types-section -fvar-tracking-assignments -g2 -Wp,-D_FORTIFY_SOURCE=2 -fstack-protector-strong --param=ssp-buffer-size=4 -fPIC -mtune=generic -march=x86-64 -gdwarf-4 -fno-debug-types-section -fvar-tracking-assignments -g2 -Wno-format-contains-nul -fno-strict-aliasing -MT libopts_la-libopts.lo -MD -MP -MF .deps/libopts_la-libopts.Tpo -c libopts.c  -fPIC -DPIC -o .libs/libopts_la-libopts.o
In file included from libopts.c:24:
configfile.c: In function 'file_preset':
configfile.c:467:20: error: this statement may fall through [-Werror=implicit-fallthrough=]
                 if (ftext++ != NULL)
                    ^
configfile.c:470:13: note: here
             default:
             ^~~~~~~
In file included from libopts.c:22:
boolean.c: In function 'optionBooleanVal':
boolean.c:63:5: error: this statement may fall through [-Werror=implicit-fallthrough=]
     {
     ^
boolean.c:69:5: note: here
     case 'N':
     ^~~~
In file included from libopts.c:32:
makeshell.c: In function 'text_to_var':
makeshell.c:324:14: error: this statement may fall through [-Werror=implicit-fallthrough=]
             (*(opts->pUsageProc))(opts, EXIT_SUCCESS);
             ~^~~~~~~~~~~~~~~~~~~~~~~~~~~~~~~~~~~~~~~~
makeshell.c:327:9: note: here
         case TT_USAGE:
         ^~~~
makeshell.c:328:14: error: this statement may fall through [-Werror=implicit-fallthrough=]
             (*(opts->pUsageProc))(opts, EXIT_FAILURE);
             ~^~~~~~~~~~~~~~~~~~~~~~~~~~~~~~~~~~~~~~~~
makeshell.c:331:9: note: here
         case TT_VERSION:
         ^~~~
makeshell.c:337:13: error: this statement may fall through [-Werror=implicit-fallthrough=]
             optionPrintVersion(opts, od);
             ^~~~~~~~~~~~~~~~~~~~~~~~~~~~
makeshell.c:340:9: note: here
         default:
         ^~~~~~~
makeshell.c: In function 'genshelloptUsage':
makeshell.c:887:9: error: this statement may fall through [-Werror=implicit-fallthrough=]
         optionUsage(opts, EXIT_FAILURE);
         ^~~~~~~~~~~~~~~~~~~~~~~~~~~~~~~
makeshell.c:890:5: note: here
     case 0:
     ^~~~
makeshell.c:932:9: error: this statement may fall through [-Werror=implicit-fallthrough=]
         optionUsage(optionParseShellOptions, EXIT_FAILURE);
         ^~~~~~~~~~~~~~~~~~~~~~~~~~~~~~~~~~~~~~~~~~~~~~~~~~
makeshell.c:934:5: note: here
     default:
     ^~~~~~~
In file included from libopts.c:34:
numeric.c: In function 'optionNumericVal':
numeric.c:139:24: error: this statement may fall through [-Werror=implicit-fallthrough=]
         case 't':  val *= 1000;
                    ~~~~^~~~~~~
numeric.c:140:9: note: here
         case 'g':  val *= 1000;
         ^~~~
numeric.c:140:24: error: this statement may fall through [-Werror=implicit-fallthrough=]
         case 'g':  val *= 1000;
                    ~~~~^~~~~~~
numeric.c:141:9: note: here
         case 'm':  val *= 1000;
         ^~~~
numeric.c:141:24: error: this statement may fall through [-Werror=implicit-fallthrough=]
         case 'm':  val *= 1000;
                    ~~~~^~~~~~~
numeric.c:142:9: note: here
         case 'k':  val *= 1000; break;
         ^~~~
numeric.c:144:24: error: this statement may fall through [-Werror=implicit-fallthrough=]
         case 'T':  val *= 1024;
                    ~~~~^~~~~~~
numeric.c:145:9: note: here
         case 'G':  val *= 1024;
         ^~~~
numeric.c:145:24: error: this statement may fall through [-Werror=implicit-fallthrough=]
         case 'G':  val *= 1024;
                    ~~~~^~~~~~~
numeric.c:146:9: note: here
         case 'M':  val *= 1024;
         ^~~~
numeric.c:146:24: error: this statement may fall through [-Werror=implicit-fallthrough=]
         case 'M':  val *= 1024;
                    ~~~~^~~~~~~
numeric.c:147:9: note: here
         case 'K':  val *= 1024; break;
         ^~~~
In file included from libopts.c:46:
usage.c: In function 'prt_extd_usage':
usage.c:790:38: error: 's ' directive output may be truncated writing 2 bytes into a region of size between 0 and 9 [-Werror=format-truncation=]
         snprintf(vfmt, sizeof(vfmt), vfmtfmt, (unsigned int)nmlen + 4);
                                      ^~~~~~~
In file included from /usr/include/stdio.h:862,
                 from ../compat/compat.h:112,
                 from ../autoopts/project.h:30,
                 from libopts.c:2:
/usr/include/bits/stdio2.h:64:10: note: '__builtin___snprintf_chk' output between 9 and 18 bytes into a destination of size 12
   return __builtin___snprintf_chk (__s, __n, __USE_FORTIFY_LEVEL - 1,
          ^~~~~~~~~~~~~~~~~~~~~~~~~~~~~~~~~~~~~~~~~~~~~~~~~~~~~~~~~~~~
        __bos (__s), __fmt, __va_arg_pack ());
        ~~~~~~~~~~~~~~~~~~~~~~~~~~~~~~~~~~~~~
cc1: all warnings being treated as errors
make[4]: *** [Makefile:695: libopts_la-libopts.lo] Error 1
make[4]: Leaving directory '/tmp/B.GZ3831/BUILD/autogen-5.18.14/autoopts'
make[3]: *** [Makefile:929: all-recursive] Error 1
make[2]: *** [Makefile:554: all] Error 2
make[1]: *** [Makefile:541: all-recursive] Error 1
make: *** [Makefile:448: all] Error 2
error: Bad exit status from /tmp/B.GZ3831/BUILD/tmp/rpm-tmp.69542 (%build)


RPM build errors:
    Bad exit status from /tmp/B.GZ3831/BUILD/tmp/rpm-tmp.69542 (%build)
ended at: Wed Aug  1 21:38:50 2018, done in 0:00:20.462535
error: No files produced.
+ chmod -R u+rwX /tmp/B.GZ3831/BUILD
+ rm -rf /tmp/B.GZ3831/tmp /tmp/B.GZ3831/BUILD
+ rm -rf /tmp/B.GZ3831
Begin-PLD-Builder-Info
Build-Time: user:14.34s sys:3.81s real:23.56s (faults io:5 non-io:1256268)

End-PLD-Builder-Info
[Back to list of logs] [View rpm -qa of builder]