FailedOk

th/SRPMS[OK]
th/x32[OK]
th/i686[OK]
th/x86_64[OK]

ac/SRPMS[OK]
ac/i386[OK]
ac/i586[OK]
ac/i686[OK]
ac/alpha[OK]
ac/amd64[OK]
ac/athlon[OK]
ac/ppc[OK]
ac/sparc[OK]
ac/sparc64[OK]

Advanced Search
main()
Powered by PLD Linux
(c) 2002-2019 PLD Team
$Revision: 1.37 $
Powered by PDP-7.
Your IP: 100.26.182.28

camwire c2b26dda-6a3f-427a-a50d-aaa613788875

Status:Failed
Source URL:ftp://buildlogs.pld-linux.org/th/x32/FAIL/camwire,c2b26dda-6a3f-427a-a50d-aaa613788875.bz2
text/plain URL:View!
rpm -qa of builder:View!
Date:2019/08/08 15:55:26
Runtime:0:00:05.997200

Toc:

  • prep
  • Executing(%prep): /bin/sh -e /tmp/B.83blWt/BUILD/tmp/rpm-tmp.36651
  • build
  • Executing(%build): /bin/sh -e /tmp/B.83blWt/BUILD/tmp/rpm-tmp.36651
  • error 1
  • /tmp/B.83blWt/BUILD/camwire2-2.0.0-Source/examples/cammonitor/cammonitor.c:2325:59: error: '%s' directive output may be truncated writing up to 1000 bytes into a region of size 980 [-Werror=format-truncation=]
  • error 2
  • /tmp/B.83blWt/BUILD/camwire2-2.0.0-Source/examples/cammonitor/cammonitor.c:2288:53: error: '%s' directive output may be truncated writing up to 1000 bytes into a region of size 986 [-Werror=format-truncation=]
  • error 3
  • /tmp/B.83blWt/BUILD/camwire2-2.0.0-Source/examples/cammonitor/cammonitor.c:2161:53: error: '%s' directive output may be truncated writing up to 1000 bytes into a region of size 986 [-Werror=format-truncation=]
  • error 4
  • make[2]: *** [examples/cammonitor/CMakeFiles/cammonitor.dir/build.make:67: examples/cammonitor/CMakeFiles/cammonitor.dir/cammonitor.c.o] Error 1
  • error 5
  • make[1]: *** [CMakeFiles/Makefile2:362: examples/cammonitor/CMakeFiles/cammonitor.dir/all] Error 2
  • error 6
  • error: Bad exit status from /tmp/B.83blWt/BUILD/tmp/rpm-tmp.36651 (%build)
  • error 7
  • RPM build errors:
  • error 8
  • error: No files produced.

Content:

request from: qboosh
checking if we should skip the build
started at: Thu Aug  8 15:55:17 2019
killing old processes on a builder
sending signal 9 to pid -1
Killed
cleaning up /tmp
fetching https://srcbuilder.pld-linux.org/th//srpms/c2b26dda-6a3f-427a-a50d-aaa613788875/camwire-2.0.0-1.src.rpm
fetched 164956 bytes, 448.5 K/s
installing srpm: camwire-2.0.0-1.src.rpm
+ install -d /tmp/B.83blWt/BUILD /tmp/B.83blWt/RPMS
+ LC_ALL=en_US.UTF-8
+ rpm -qp --changelog camwire-2.0.0-1.src.rpm
* Thu Aug 08 2019 PLD Linux Team <feedback@pld-linux.org>
- For complete changelog see: http://git.pld-linux.org/?p=packages/camwire.git;a=log;h=master
* Thu Aug 08 2019 Jakub Bogusz <qboosh@pld-linux.org> 3792ff8
- updated to 2.0.0 (guessed, as download directory is not browstable atm.) - added bogus-inline patch (don't use "inline" keyword when definition is not in the scope) + rpm -Uhv --nodeps --define '_topdir /tmp/B.83blWt' --define '_specdir %{_topdir}' --define '_sourcedir %{_specdir}' --define '_rpmdir %{_topdir}/RPMS' --define '_builddir %{_topdir}/BUILD' camwire-2.0.0-1.src.rpm Preparing... ################################################## camwire ################################################## + rm -f camwire-2.0.0-1.src.rpm + install -m 700 -d /tmp/B.83blWt/BUILD/tmp + TMPDIR=/tmp/B.83blWt/BUILD/tmp + exec nice -n 0 rpmbuild -bp --short-circuit --nodeps --define '_topdir /tmp/B.83blWt' --define '_specdir %{_topdir}' --define '_sourcedir %{_specdir}' --define '_rpmdir %{_topdir}/RPMS' --define '_builddir %{_topdir}/BUILD' --target x32-pld-linux --define 'prep exit 0' /tmp/B.83blWt/camwire.spec Building target platforms: x32-pld-linux checking BuildConflict-ing packages no BuildConflicts found checking BR rpm: Building target platforms: x32-pld-linux no BR needed building RPM using: set -ex; : build-id: c2b26dda-6a3f-427a-a50d-aaa613788875; TMPDIR=/tmp/B.83blWt/BUILD/tmp exec nice -n 0 rpmbuild -bb --define '_smp_mflags -j9' --define '_make_opts -Otarget' --define '_pld_builder 1' --define '_topdir /tmp/B.83blWt' --define '_specdir %{_topdir}' --define '_sourcedir %{_specdir}' --define '_rpmdir %{_topdir}/RPMS' --define '_builddir %{_topdir}/BUILD' --target x32-pld-linux /tmp/B.83blWt/camwire.spec + : build-id: c2b26dda-6a3f-427a-a50d-aaa613788875 + TMPDIR=/tmp/B.83blWt/BUILD/tmp + exec nice -n 0 rpmbuild -bb --define '_smp_mflags -j9' --define '_make_opts -Otarget' --define '_pld_builder 1' --define '_topdir /tmp/B.83blWt' --define '_specdir %{_topdir}' --define '_sourcedir %{_specdir}' --define '_rpmdir %{_topdir}/RPMS' --define '_builddir %{_topdir}/BUILD' --target x32-pld-linux /tmp/B.83blWt/camwire.spec Building target platforms: x32-pld-linux Executing(%prep): /bin/sh -e /tmp/B.83blWt/BUILD/tmp/rpm-tmp.36651 + umask 022 + cd /tmp/B.83blWt/BUILD + cd /tmp/B.83blWt/BUILD + rm -rf camwire2-2.0.0-Source + /usr/bin/gzip -dc /tmp/B.83blWt/camwire2-2.0.0-Source.tar.gz + /bin/tar -xf - + STATUS=0 + '[' 0 -ne 0 ']' + cd camwire2-2.0.0-Source + /bin/id -u + '[' 1000 '=' 0 ']' + /bin/id -u + '[' 1000 '=' 0 ']' + /bin/chmod -Rf a+rX,u+w,g-w,o-w . + echo 'Patch #0 (camwire-link.patch):' Patch #0 (camwire-link.patch): + '[' -f /tmp/B.83blWt/camwire-link.patch ']' + /bin/cat /tmp/B.83blWt/camwire-link.patch + /usr/bin/patch -s -p1 + echo 'Patch #1 (camwire-etc.patch):' Patch #1 (camwire-etc.patch): + '[' -f /tmp/B.83blWt/camwire-etc.patch ']' + /bin/cat /tmp/B.83blWt/camwire-etc.patch + /usr/bin/patch -s -p1 + echo 'Patch #2 (camwire-lib.patch):' Patch #2 (camwire-lib.patch): + '[' -f /tmp/B.83blWt/camwire-lib.patch ']' + /bin/cat /tmp/B.83blWt/camwire-lib.patch + /usr/bin/patch -s -p1 + echo 'Patch #3 (camwire-bogus-inline.patch):' Patch #3 (camwire-bogus-inline.patch): + '[' -f /tmp/B.83blWt/camwire-bogus-inline.patch ']' + /bin/cat /tmp/B.83blWt/camwire-bogus-inline.patch + /usr/bin/patch -s -p1 + exit 0 Executing(%build): /bin/sh -e /tmp/B.83blWt/BUILD/tmp/rpm-tmp.36651 HOME=/home/users/builder PATH=/home/users/builder/GNUstep/Tools:/usr/local/bin:/usr/bin:/bin TMPDIR=/tmp/B.83blWt/BUILD/tmp + umask 022 + cd /tmp/B.83blWt/BUILD + cd camwire2-2.0.0-Source + CFLAGS='-O2 -fwrapv -pipe -Wformat -Werror=format-security -gdwarf-4 -fno-debug-types-section -fvar-tracking-assignments -g2 -Wp,-D_FORTIFY_SOURCE=2 -fstack-protector-strong --param=ssp-buffer-size=4 -Werror=trampolines -fPIC -mtune=generic -march=x86-64 -gdwarf-4 -fno-debug-types-section -fvar-tracking-assignments -g2 -Wno-unused-result' + CC=x86_64-pld-linux-gnux32-gcc CXX=x86_64-pld-linux-gnux32-g++ CPPFLAGS='' /usr/bin/cmake -Wno-dev '-DCMAKE_VERBOSE_MAKEFILE=ON' '-DCMAKE_BUILD_TYPE=PLD' '-DCMAKE_INSTALL_BINDIR:PATH=/usr/bin' '-DCMAKE_INSTALL_SBINDIR:PATH=/usr/sbin' '-DCMAKE_INSTALL_LIBEXECDIR:PATH=/usr/libexec' '-DCMAKE_INSTALL_SYSCONFDIR:PATH=/etc' '-DCMAKE_INSTALL_SHAREDSTATEDIRPATH:PATH=/var/lib' '-DCMAKE_INSTALL_LOCALSTATEDIRPATH:PATH=/var' '-DCMAKE_INSTALL_LIBDIR:PATH=/usr/libx32' '-DCMAKE_INSTALL_INCLUDEDIR:PATH=/usr/include' '-DCMAKE_INSTALL_OLDINCLUDEDIR:PATH=/usr/include' '-DCMAKE_INSTALL_DATAROOTDIR:PATH=/usr/share' '-DCMAKE_INSTALL_DATADIR:PATH=/usr/share' '-DCMAKE_INSTALL_INFODIR:PATH=/usr/share/info' '-DCMAKE_INSTALL_LOCALEDIR:PATH=/usr/share/locale' '-DCMAKE_INSTALL_MANDIR:PATH=/usr/share/man' '-DCMAKE_INSTALL_DOCDIR:PATH=/usr/share/doc' '-DCMAKE_INSTALL_PREFIX:PATH=/usr' '-DSYSCONF_INSTALL_DIR:PATH=/etc' '-DCMAKE_CXX_FLAGS_PLD=-O2 -fwrapv -pipe -Wformat -Werror=format-security -gdwarf-4 -fno-debug-types-section -fvar-tracking-assignments -g2 -Wp,-D_FORTIFY_SOURCE=2 -fstack-protector-strong --param=ssp-buffer-size=4 -Werror=trampolines -fPIC -mtune=generic -march=x86-64 -gdwarf-4 -fno-debug-types-section -fvar-tracking-assignments -g2 -DNDEBUG -DQT_NO_DEBUG' '-DCMAKE_C_FLAGS_PLD=-O2 -fwrapv -pipe -Wformat -Werror=format-security -gdwarf-4 -fno-debug-types-section -fvar-tracking-assignments -g2 -Wp,-D_FORTIFY_SOURCE=2 -fstack-protector-strong --param=ssp-buffer-size=4 -Werror=trampolines -fPIC -mtune=generic -march=x86-64 -gdwarf-4 -fno-debug-types-section -fvar-tracking-assignments -g2 -Wno-unused-result' '-DCMAKE_Fortran_FLAGS_PLD=-O2 -fwrapv -pipe -Wformat -Werror=format-security -gdwarf-4 -fno-debug-types-section -fvar-tracking-assignments -g2 -Wp,-D_FORTIFY_SOURCE=2 -fstack-protector-strong --param=ssp-buffer-size=4 -Werror=trampolines -fPIC -mtune=generic -march=x86-64 -gdwarf-4 -fno-debug-types-section -fvar-tracking-assignments -g2 -Wno-unused-result' '-DCMAKE_EXE_LINKER_FLAGS_PLD=-Wl,--as-needed -Wl,--no-copy-dt-needed-entries -Wl,-z,relro -Wl,-z,combreloc ' '-DCMAKE_SHARED_LINKER_FLAGS_PLD=-Wl,--as-needed -Wl,--no-copy-dt-needed-entries -Wl,-z,relro -Wl,-z,combreloc ' '-DCMAKE_MODULE_LINKER_FLAGS_PLD=-Wl,--as-needed -Wl,--no-copy-dt-needed-entries -Wl,-z,relro -Wl,-z,combreloc ' '-DLIB_SUFFIX=x32' '-DBUILD_SHARED_LIBS:BOOL=ON' CMake Warning: No source or binary directory provided. Both will be assumed to be the same as the current working directory, but note that this warning will become a fatal error in future CMake releases. -- The C compiler identification is GNU 8.3.0 -- Check for working C compiler: /usr/bin/x86_64-pld-linux-gnux32-gcc -- Check for working C compiler: /usr/bin/x86_64-pld-linux-gnux32-gcc -- works -- Detecting C compiler ABI info -- Detecting C compiler ABI info - done -- Detecting C compile features -- Detecting C compile features - done -- Configuring done -- Generating done CMake Warning: Manually-specified variables were not used by the project: CMAKE_CXX_FLAGS_PLD CMAKE_Fortran_FLAGS_PLD CMAKE_INSTALL_BINDIR CMAKE_INSTALL_DATADIR CMAKE_INSTALL_DATAROOTDIR CMAKE_INSTALL_DOCDIR CMAKE_INSTALL_INCLUDEDIR CMAKE_INSTALL_INFODIR CMAKE_INSTALL_LIBDIR CMAKE_INSTALL_LIBEXECDIR CMAKE_INSTALL_LOCALEDIR CMAKE_INSTALL_LOCALSTATEDIRPATH CMAKE_INSTALL_MANDIR CMAKE_INSTALL_OLDINCLUDEDIR CMAKE_INSTALL_SBINDIR CMAKE_INSTALL_SHAREDSTATEDIRPATH CMAKE_INSTALL_SYSCONFDIR SYSCONF_INSTALL_DIR -- Build files have been written to: /tmp/B.83blWt/BUILD/camwire2-2.0.0-Source + /usr/bin/make -Otarget -j9 -j1 /usr/bin/cmake -S/tmp/B.83blWt/BUILD/camwire2-2.0.0-Source -B/tmp/B.83blWt/BUILD/camwire2-2.0.0-Source --check-build-system CMakeFiles/Makefile.cmake 0 /usr/bin/cmake -E cmake_progress_start /tmp/B.83blWt/BUILD/camwire2-2.0.0-Source/CMakeFiles /tmp/B.83blWt/BUILD/camwire2-2.0.0-Source/CMakeFiles/progress.marks /usr/bin/make -f CMakeFiles/Makefile2 all make[1]: Entering directory '/tmp/B.83blWt/BUILD/camwire2-2.0.0-Source' /usr/bin/make -f camwire/CMakeFiles/camwire_static.dir/build.make camwire/CMakeFiles/camwire_static.dir/depend make[2]: Entering directory '/tmp/B.83blWt/BUILD/camwire2-2.0.0-Source' cd /tmp/B.83blWt/BUILD/camwire2-2.0.0-Source && /usr/bin/cmake -E cmake_depends "Unix Makefiles" /tmp/B.83blWt/BUILD/camwire2-2.0.0-Source /tmp/B.83blWt/BUILD/camwire2-2.0.0-Source/camwire /tmp/B.83blWt/BUILD/camwire2-2.0.0-Source /tmp/B.83blWt/BUILD/camwire2-2.0.0-Source/camwire /tmp/B.83blWt/BUILD/camwire2-2.0.0-Source/camwire/CMakeFiles/camwire_static.dir/DependInfo.cmake --color= Scanning dependencies of target camwire_static make[2]: Leaving directory '/tmp/B.83blWt/BUILD/camwire2-2.0.0-Source' /usr/bin/make -f camwire/CMakeFiles/camwire_static.dir/build.make camwire/CMakeFiles/camwire_static.dir/build make[2]: Entering directory '/tmp/B.83blWt/BUILD/camwire2-2.0.0-Source' [ 5%] Building C object camwire/CMakeFiles/camwire_static.dir/camwirebus.c.o cd /tmp/B.83blWt/BUILD/camwire2-2.0.0-Source/camwire && /usr/bin/x86_64-pld-linux-gnux32-gcc -I/tmp/B.83blWt/BUILD/camwire2-2.0.0-Source -Wall -Werror -O2 -fwrapv -pipe -Wformat -Werror=format-security -gdwarf-4 -fno-debug-types-section -fvar-tracking-assignments -g2 -Wp,-D_FORTIFY_SOURCE=2 -fstack-protector-strong --param=ssp-buffer-size=4 -Werror=trampolines -fPIC -mtune=generic -march=x86-64 -gdwarf-4 -fno-debug-types-section -fvar-tracking-assignments -g2 -Wno-unused-result -o CMakeFiles/camwire_static.dir/camwirebus.c.o -c /tmp/B.83blWt/BUILD/camwire2-2.0.0-Source/camwire/camwirebus.c [ 10%] Building C object camwire/CMakeFiles/camwire_static.dir/camwire.c.o cd /tmp/B.83blWt/BUILD/camwire2-2.0.0-Source/camwire && /usr/bin/x86_64-pld-linux-gnux32-gcc -I/tmp/B.83blWt/BUILD/camwire2-2.0.0-Source -Wall -Werror -O2 -fwrapv -pipe -Wformat -Werror=format-security -gdwarf-4 -fno-debug-types-section -fvar-tracking-assignments -g2 -Wp,-D_FORTIFY_SOURCE=2 -fstack-protector-strong --param=ssp-buffer-size=4 -Werror=trampolines -fPIC -mtune=generic -march=x86-64 -gdwarf-4 -fno-debug-types-section -fvar-tracking-assignments -g2 -Wno-unused-result -o CMakeFiles/camwire_static.dir/camwire.c.o -c /tmp/B.83blWt/BUILD/camwire2-2.0.0-Source/camwire/camwire.c [ 15%] Linking C static library libcamwire.a cd /tmp/B.83blWt/BUILD/camwire2-2.0.0-Source/camwire && /usr/bin/cmake -P CMakeFiles/camwire_static.dir/cmake_clean_target.cmake cd /tmp/B.83blWt/BUILD/camwire2-2.0.0-Source/camwire && /usr/bin/cmake -E cmake_link_script CMakeFiles/camwire_static.dir/link.txt --verbose=1 /usr/bin/ar qc libcamwire.a CMakeFiles/camwire_static.dir/camwirebus.c.o CMakeFiles/camwire_static.dir/camwire.c.o /usr/bin/ranlib libcamwire.a make[2]: Leaving directory '/tmp/B.83blWt/BUILD/camwire2-2.0.0-Source' [ 15%] Built target camwire_static /usr/bin/make -f camwire/CMakeFiles/camwire.dir/build.make camwire/CMakeFiles/camwire.dir/depend make[2]: Entering directory '/tmp/B.83blWt/BUILD/camwire2-2.0.0-Source' cd /tmp/B.83blWt/BUILD/camwire2-2.0.0-Source && /usr/bin/cmake -E cmake_depends "Unix Makefiles" /tmp/B.83blWt/BUILD/camwire2-2.0.0-Source /tmp/B.83blWt/BUILD/camwire2-2.0.0-Source/camwire /tmp/B.83blWt/BUILD/camwire2-2.0.0-Source /tmp/B.83blWt/BUILD/camwire2-2.0.0-Source/camwire /tmp/B.83blWt/BUILD/camwire2-2.0.0-Source/camwire/CMakeFiles/camwire.dir/DependInfo.cmake --color= Scanning dependencies of target camwire make[2]: Leaving directory '/tmp/B.83blWt/BUILD/camwire2-2.0.0-Source' /usr/bin/make -f camwire/CMakeFiles/camwire.dir/build.make camwire/CMakeFiles/camwire.dir/build make[2]: Entering directory '/tmp/B.83blWt/BUILD/camwire2-2.0.0-Source' [ 21%] Building C object camwire/CMakeFiles/camwire.dir/camwirebus.c.o cd /tmp/B.83blWt/BUILD/camwire2-2.0.0-Source/camwire && /usr/bin/x86_64-pld-linux-gnux32-gcc -Dcamwire_EXPORTS -I/tmp/B.83blWt/BUILD/camwire2-2.0.0-Source -Wall -Werror -O2 -fwrapv -pipe -Wformat -Werror=format-security -gdwarf-4 -fno-debug-types-section -fvar-tracking-assignments -g2 -Wp,-D_FORTIFY_SOURCE=2 -fstack-protector-strong --param=ssp-buffer-size=4 -Werror=trampolines -fPIC -mtune=generic -march=x86-64 -gdwarf-4 -fno-debug-types-section -fvar-tracking-assignments -g2 -Wno-unused-result -fPIC -o CMakeFiles/camwire.dir/camwirebus.c.o -c /tmp/B.83blWt/BUILD/camwire2-2.0.0-Source/camwire/camwirebus.c [ 26%] Building C object camwire/CMakeFiles/camwire.dir/camwire.c.o cd /tmp/B.83blWt/BUILD/camwire2-2.0.0-Source/camwire && /usr/bin/x86_64-pld-linux-gnux32-gcc -Dcamwire_EXPORTS -I/tmp/B.83blWt/BUILD/camwire2-2.0.0-Source -Wall -Werror -O2 -fwrapv -pipe -Wformat -Werror=format-security -gdwarf-4 -fno-debug-types-section -fvar-tracking-assignments -g2 -Wp,-D_FORTIFY_SOURCE=2 -fstack-protector-strong --param=ssp-buffer-size=4 -Werror=trampolines -fPIC -mtune=generic -march=x86-64 -gdwarf-4 -fno-debug-types-section -fvar-tracking-assignments -g2 -Wno-unused-result -fPIC -o CMakeFiles/camwire.dir/camwire.c.o -c /tmp/B.83blWt/BUILD/camwire2-2.0.0-Source/camwire/camwire.c [ 31%] Linking C shared library libcamwire.so cd /tmp/B.83blWt/BUILD/camwire2-2.0.0-Source/camwire && /usr/bin/cmake -E cmake_link_script CMakeFiles/camwire.dir/link.txt --verbose=1 /usr/bin/x86_64-pld-linux-gnux32-gcc -fPIC -Wall -Werror -O2 -fwrapv -pipe -Wformat -Werror=format-security -gdwarf-4 -fno-debug-types-section -fvar-tracking-assignments -g2 -Wp,-D_FORTIFY_SOURCE=2 -fstack-protector-strong --param=ssp-buffer-size=4 -Werror=trampolines -fPIC -mtune=generic -march=x86-64 -gdwarf-4 -fno-debug-types-section -fvar-tracking-assignments -g2 -Wno-unused-result -Wl,--as-needed -Wl,--no-copy-dt-needed-entries -Wl,-z,relro -Wl,-z,combreloc -shared -Wl,-soname,libcamwire.so.2 -o libcamwire.so.2.0.0 CMakeFiles/camwire.dir/camwirebus.c.o CMakeFiles/camwire.dir/camwire.c.o -ldc1394 -lm cd /tmp/B.83blWt/BUILD/camwire2-2.0.0-Source/camwire && /usr/bin/cmake -E cmake_symlink_library libcamwire.so.2.0.0 libcamwire.so.2 libcamwire.so make[2]: Leaving directory '/tmp/B.83blWt/BUILD/camwire2-2.0.0-Source' [ 31%] Built target camwire /usr/bin/make -f examples/CMakeFiles/camlatency.dir/build.make examples/CMakeFiles/camlatency.dir/depend make[2]: Entering directory '/tmp/B.83blWt/BUILD/camwire2-2.0.0-Source' cd /tmp/B.83blWt/BUILD/camwire2-2.0.0-Source && /usr/bin/cmake -E cmake_depends "Unix Makefiles" /tmp/B.83blWt/BUILD/camwire2-2.0.0-Source /tmp/B.83blWt/BUILD/camwire2-2.0.0-Source/examples /tmp/B.83blWt/BUILD/camwire2-2.0.0-Source /tmp/B.83blWt/BUILD/camwire2-2.0.0-Source/examples /tmp/B.83blWt/BUILD/camwire2-2.0.0-Source/examples/CMakeFiles/camlatency.dir/DependInfo.cmake --color= Scanning dependencies of target camlatency make[2]: Leaving directory '/tmp/B.83blWt/BUILD/camwire2-2.0.0-Source' /usr/bin/make -f examples/CMakeFiles/camlatency.dir/build.make examples/CMakeFiles/camlatency.dir/build make[2]: Entering directory '/tmp/B.83blWt/BUILD/camwire2-2.0.0-Source' [ 36%] Building C object examples/CMakeFiles/camlatency.dir/camlatency.c.o cd /tmp/B.83blWt/BUILD/camwire2-2.0.0-Source/examples && /usr/bin/x86_64-pld-linux-gnux32-gcc -I/tmp/B.83blWt/BUILD/camwire2-2.0.0-Source -Wall -Werror -O2 -fwrapv -pipe -Wformat -Werror=format-security -gdwarf-4 -fno-debug-types-section -fvar-tracking-assignments -g2 -Wp,-D_FORTIFY_SOURCE=2 -fstack-protector-strong --param=ssp-buffer-size=4 -Werror=trampolines -fPIC -mtune=generic -march=x86-64 -gdwarf-4 -fno-debug-types-section -fvar-tracking-assignments -g2 -Wno-unused-result -o CMakeFiles/camlatency.dir/camlatency.c.o -c /tmp/B.83blWt/BUILD/camwire2-2.0.0-Source/examples/camlatency.c [ 42%] Linking C executable camlatency cd /tmp/B.83blWt/BUILD/camwire2-2.0.0-Source/examples && /usr/bin/cmake -E cmake_link_script CMakeFiles/camlatency.dir/link.txt --verbose=1 /usr/bin/x86_64-pld-linux-gnux32-gcc -Wall -Werror -O2 -fwrapv -pipe -Wformat -Werror=format-security -gdwarf-4 -fno-debug-types-section -fvar-tracking-assignments -g2 -Wp,-D_FORTIFY_SOURCE=2 -fstack-protector-strong --param=ssp-buffer-size=4 -Werror=trampolines -fPIC -mtune=generic -march=x86-64 -gdwarf-4 -fno-debug-types-section -fvar-tracking-assignments -g2 -Wno-unused-result -Wl,--as-needed -Wl,--no-copy-dt-needed-entries -Wl,-z,relro -Wl,-z,combreloc -rdynamic CMakeFiles/camlatency.dir/camlatency.c.o -o camlatency -L/tmp/B.83blWt/BUILD/camwire2-2.0.0-Source/camwire ../camwire/libcamwire.so.2.0.0 -ldc1394 -lm make[2]: Leaving directory '/tmp/B.83blWt/BUILD/camwire2-2.0.0-Source' [ 42%] Built target camlatency /usr/bin/make -f examples/CMakeFiles/hello.dir/build.make examples/CMakeFiles/hello.dir/depend make[2]: Entering directory '/tmp/B.83blWt/BUILD/camwire2-2.0.0-Source' cd /tmp/B.83blWt/BUILD/camwire2-2.0.0-Source && /usr/bin/cmake -E cmake_depends "Unix Makefiles" /tmp/B.83blWt/BUILD/camwire2-2.0.0-Source /tmp/B.83blWt/BUILD/camwire2-2.0.0-Source/examples /tmp/B.83blWt/BUILD/camwire2-2.0.0-Source /tmp/B.83blWt/BUILD/camwire2-2.0.0-Source/examples /tmp/B.83blWt/BUILD/camwire2-2.0.0-Source/examples/CMakeFiles/hello.dir/DependInfo.cmake --color= Scanning dependencies of target hello make[2]: Leaving directory '/tmp/B.83blWt/BUILD/camwire2-2.0.0-Source' /usr/bin/make -f examples/CMakeFiles/hello.dir/build.make examples/CMakeFiles/hello.dir/build make[2]: Entering directory '/tmp/B.83blWt/BUILD/camwire2-2.0.0-Source' [ 47%] Building C object examples/CMakeFiles/hello.dir/hello.c.o cd /tmp/B.83blWt/BUILD/camwire2-2.0.0-Source/examples && /usr/bin/x86_64-pld-linux-gnux32-gcc -I/tmp/B.83blWt/BUILD/camwire2-2.0.0-Source -Wall -Werror -O2 -fwrapv -pipe -Wformat -Werror=format-security -gdwarf-4 -fno-debug-types-section -fvar-tracking-assignments -g2 -Wp,-D_FORTIFY_SOURCE=2 -fstack-protector-strong --param=ssp-buffer-size=4 -Werror=trampolines -fPIC -mtune=generic -march=x86-64 -gdwarf-4 -fno-debug-types-section -fvar-tracking-assignments -g2 -Wno-unused-result -o CMakeFiles/hello.dir/hello.c.o -c /tmp/B.83blWt/BUILD/camwire2-2.0.0-Source/examples/hello.c [ 52%] Linking C executable hello cd /tmp/B.83blWt/BUILD/camwire2-2.0.0-Source/examples && /usr/bin/cmake -E cmake_link_script CMakeFiles/hello.dir/link.txt --verbose=1 /usr/bin/x86_64-pld-linux-gnux32-gcc -Wall -Werror -O2 -fwrapv -pipe -Wformat -Werror=format-security -gdwarf-4 -fno-debug-types-section -fvar-tracking-assignments -g2 -Wp,-D_FORTIFY_SOURCE=2 -fstack-protector-strong --param=ssp-buffer-size=4 -Werror=trampolines -fPIC -mtune=generic -march=x86-64 -gdwarf-4 -fno-debug-types-section -fvar-tracking-assignments -g2 -Wno-unused-result -Wl,--as-needed -Wl,--no-copy-dt-needed-entries -Wl,-z,relro -Wl,-z,combreloc -rdynamic CMakeFiles/hello.dir/hello.c.o -o hello -L/tmp/B.83blWt/BUILD/camwire2-2.0.0-Source/camwire ../camwire/libcamwire.so.2.0.0 -ldc1394 -lm make[2]: Leaving directory '/tmp/B.83blWt/BUILD/camwire2-2.0.0-Source' [ 52%] Built target hello /usr/bin/make -f examples/CMakeFiles/measureconf_1394.dir/build.make examples/CMakeFiles/measureconf_1394.dir/depend make[2]: Entering directory '/tmp/B.83blWt/BUILD/camwire2-2.0.0-Source' cd /tmp/B.83blWt/BUILD/camwire2-2.0.0-Source && /usr/bin/cmake -E cmake_depends "Unix Makefiles" /tmp/B.83blWt/BUILD/camwire2-2.0.0-Source /tmp/B.83blWt/BUILD/camwire2-2.0.0-Source/examples /tmp/B.83blWt/BUILD/camwire2-2.0.0-Source /tmp/B.83blWt/BUILD/camwire2-2.0.0-Source/examples /tmp/B.83blWt/BUILD/camwire2-2.0.0-Source/examples/CMakeFiles/measureconf_1394.dir/DependInfo.cmake --color= Scanning dependencies of target measureconf_1394 make[2]: Leaving directory '/tmp/B.83blWt/BUILD/camwire2-2.0.0-Source' /usr/bin/make -f examples/CMakeFiles/measureconf_1394.dir/build.make examples/CMakeFiles/measureconf_1394.dir/build make[2]: Entering directory '/tmp/B.83blWt/BUILD/camwire2-2.0.0-Source' [ 57%] Building C object examples/CMakeFiles/measureconf_1394.dir/measureconf_1394.c.o cd /tmp/B.83blWt/BUILD/camwire2-2.0.0-Source/examples && /usr/bin/x86_64-pld-linux-gnux32-gcc -I/tmp/B.83blWt/BUILD/camwire2-2.0.0-Source -Wall -Werror -O2 -fwrapv -pipe -Wformat -Werror=format-security -gdwarf-4 -fno-debug-types-section -fvar-tracking-assignments -g2 -Wp,-D_FORTIFY_SOURCE=2 -fstack-protector-strong --param=ssp-buffer-size=4 -Werror=trampolines -fPIC -mtune=generic -march=x86-64 -gdwarf-4 -fno-debug-types-section -fvar-tracking-assignments -g2 -Wno-unused-result -o CMakeFiles/measureconf_1394.dir/measureconf_1394.c.o -c /tmp/B.83blWt/BUILD/camwire2-2.0.0-Source/examples/measureconf_1394.c [ 63%] Linking C executable measureconf_1394 cd /tmp/B.83blWt/BUILD/camwire2-2.0.0-Source/examples && /usr/bin/cmake -E cmake_link_script CMakeFiles/measureconf_1394.dir/link.txt --verbose=1 /usr/bin/x86_64-pld-linux-gnux32-gcc -Wall -Werror -O2 -fwrapv -pipe -Wformat -Werror=format-security -gdwarf-4 -fno-debug-types-section -fvar-tracking-assignments -g2 -Wp,-D_FORTIFY_SOURCE=2 -fstack-protector-strong --param=ssp-buffer-size=4 -Werror=trampolines -fPIC -mtune=generic -march=x86-64 -gdwarf-4 -fno-debug-types-section -fvar-tracking-assignments -g2 -Wno-unused-result -Wl,--as-needed -Wl,--no-copy-dt-needed-entries -Wl,-z,relro -Wl,-z,combreloc -rdynamic CMakeFiles/measureconf_1394.dir/measureconf_1394.c.o -o measureconf_1394 -L/tmp/B.83blWt/BUILD/camwire2-2.0.0-Source/camwire ../camwire/libcamwire.so.2.0.0 -ldc1394 -lm make[2]: Leaving directory '/tmp/B.83blWt/BUILD/camwire2-2.0.0-Source' [ 63%] Built target measureconf_1394 /usr/bin/make -f examples/CMakeFiles/resetbus_1394.dir/build.make examples/CMakeFiles/resetbus_1394.dir/depend make[2]: Entering directory '/tmp/B.83blWt/BUILD/camwire2-2.0.0-Source' cd /tmp/B.83blWt/BUILD/camwire2-2.0.0-Source && /usr/bin/cmake -E cmake_depends "Unix Makefiles" /tmp/B.83blWt/BUILD/camwire2-2.0.0-Source /tmp/B.83blWt/BUILD/camwire2-2.0.0-Source/examples /tmp/B.83blWt/BUILD/camwire2-2.0.0-Source /tmp/B.83blWt/BUILD/camwire2-2.0.0-Source/examples /tmp/B.83blWt/BUILD/camwire2-2.0.0-Source/examples/CMakeFiles/resetbus_1394.dir/DependInfo.cmake --color= Scanning dependencies of target resetbus_1394 make[2]: Leaving directory '/tmp/B.83blWt/BUILD/camwire2-2.0.0-Source' /usr/bin/make -f examples/CMakeFiles/resetbus_1394.dir/build.make examples/CMakeFiles/resetbus_1394.dir/build make[2]: Entering directory '/tmp/B.83blWt/BUILD/camwire2-2.0.0-Source' [ 68%] Building C object examples/CMakeFiles/resetbus_1394.dir/resetbus_1394.c.o cd /tmp/B.83blWt/BUILD/camwire2-2.0.0-Source/examples && /usr/bin/x86_64-pld-linux-gnux32-gcc -I/tmp/B.83blWt/BUILD/camwire2-2.0.0-Source -Wall -Werror -O2 -fwrapv -pipe -Wformat -Werror=format-security -gdwarf-4 -fno-debug-types-section -fvar-tracking-assignments -g2 -Wp,-D_FORTIFY_SOURCE=2 -fstack-protector-strong --param=ssp-buffer-size=4 -Werror=trampolines -fPIC -mtune=generic -march=x86-64 -gdwarf-4 -fno-debug-types-section -fvar-tracking-assignments -g2 -Wno-unused-result -o CMakeFiles/resetbus_1394.dir/resetbus_1394.c.o -c /tmp/B.83blWt/BUILD/camwire2-2.0.0-Source/examples/resetbus_1394.c [ 73%] Linking C executable resetbus_1394 cd /tmp/B.83blWt/BUILD/camwire2-2.0.0-Source/examples && /usr/bin/cmake -E cmake_link_script CMakeFiles/resetbus_1394.dir/link.txt --verbose=1 /usr/bin/x86_64-pld-linux-gnux32-gcc -Wall -Werror -O2 -fwrapv -pipe -Wformat -Werror=format-security -gdwarf-4 -fno-debug-types-section -fvar-tracking-assignments -g2 -Wp,-D_FORTIFY_SOURCE=2 -fstack-protector-strong --param=ssp-buffer-size=4 -Werror=trampolines -fPIC -mtune=generic -march=x86-64 -gdwarf-4 -fno-debug-types-section -fvar-tracking-assignments -g2 -Wno-unused-result -Wl,--as-needed -Wl,--no-copy-dt-needed-entries -Wl,-z,relro -Wl,-z,combreloc -rdynamic CMakeFiles/resetbus_1394.dir/resetbus_1394.c.o -o resetbus_1394 -L/tmp/B.83blWt/BUILD/camwire2-2.0.0-Source/camwire ../camwire/libcamwire.so.2.0.0 -ldc1394 -lm make[2]: Leaving directory '/tmp/B.83blWt/BUILD/camwire2-2.0.0-Source' [ 73%] Built target resetbus_1394 /usr/bin/make -f examples/cammonitor/CMakeFiles/cammonitor.dir/build.make examples/cammonitor/CMakeFiles/cammonitor.dir/depend make[2]: Entering directory '/tmp/B.83blWt/BUILD/camwire2-2.0.0-Source' cd /tmp/B.83blWt/BUILD/camwire2-2.0.0-Source && /usr/bin/cmake -E cmake_depends "Unix Makefiles" /tmp/B.83blWt/BUILD/camwire2-2.0.0-Source /tmp/B.83blWt/BUILD/camwire2-2.0.0-Source/examples/cammonitor /tmp/B.83blWt/BUILD/camwire2-2.0.0-Source /tmp/B.83blWt/BUILD/camwire2-2.0.0-Source/examples/cammonitor /tmp/B.83blWt/BUILD/camwire2-2.0.0-Source/examples/cammonitor/CMakeFiles/cammonitor.dir/DependInfo.cmake --color= Scanning dependencies of target cammonitor make[2]: Leaving directory '/tmp/B.83blWt/BUILD/camwire2-2.0.0-Source' /usr/bin/make -f examples/cammonitor/CMakeFiles/cammonitor.dir/build.make examples/cammonitor/CMakeFiles/cammonitor.dir/build make[2]: Entering directory '/tmp/B.83blWt/BUILD/camwire2-2.0.0-Source' [ 78%] Building C object examples/cammonitor/CMakeFiles/cammonitor.dir/cammonitor.c.o cd /tmp/B.83blWt/BUILD/camwire2-2.0.0-Source/examples/cammonitor && /usr/bin/x86_64-pld-linux-gnux32-gcc -I/tmp/B.83blWt/BUILD/camwire2-2.0.0-Source -I/tmp/B.83blWt/BUILD/camwire2-2.0.0-Source/examples/cammonitor -I/usr/include/netpbm -Wall -Werror -O2 -fwrapv -pipe -Wformat -Werror=format-security -gdwarf-4 -fno-debug-types-section -fvar-tracking-assignments -g2 -Wp,-D_FORTIFY_SOURCE=2 -fstack-protector-strong --param=ssp-buffer-size=4 -Werror=trampolines -fPIC -mtune=generic -march=x86-64 -gdwarf-4 -fno-debug-types-section -fvar-tracking-assignments -g2 -Wno-unused-result -I/usr/include/SDL -D_GNU_SOURCE=1 -D_REENTRANT -o CMakeFiles/cammonitor.dir/cammonitor.c.o -c /tmp/B.83blWt/BUILD/camwire2-2.0.0-Source/examples/cammonitor/cammonitor.c /tmp/B.83blWt/BUILD/camwire2-2.0.0-Source/examples/cammonitor/cammonitor.c: In function 'save_numbered_image': /tmp/B.83blWt/BUILD/camwire2-2.0.0-Source/examples/cammonitor/cammonitor.c:2325:59: error: '%s' directive output may be truncated writing up to 1000 bytes into a region of size 980 [-Werror=format-truncation=] snprintf(errormessage, MAX_MESSAGE, "Could not write to '%s'", ^~ numbered_name); ~~~~~~~~~~~~~ In file included from /usr/include/stdio.h:867, from /tmp/B.83blWt/BUILD/camwire2-2.0.0-Source/examples/cammonitor/cammonitor.c:37: /usr/include/bits/stdio2.h:67:10: note: '__builtin___snprintf_chk' output between 22 and 1022 bytes into a destination of size 1000 return __builtin___snprintf_chk (__s, __n, __USE_FORTIFY_LEVEL - 1, ^~~~~~~~~~~~~~~~~~~~~~~~~~~~~~~~~~~~~~~~~~~~~~~~~~~~~~~~~~~~ __bos (__s), __fmt, __va_arg_pack ()); ~~~~~~~~~~~~~~~~~~~~~~~~~~~~~~~~~~~~~ /tmp/B.83blWt/BUILD/camwire2-2.0.0-Source/examples/cammonitor/cammonitor.c:2288:53: error: '%s' directive output may be truncated writing up to 1000 bytes into a region of size 986 [-Werror=format-truncation=] snprintf(errormessage, MAX_MESSAGE, "Can't create '%s'", ^~ numbered_name); ~~~~~~~~~~~~~ In file included from /usr/include/stdio.h:867, from /tmp/B.83blWt/BUILD/camwire2-2.0.0-Source/examples/cammonitor/cammonitor.c:37: /usr/include/bits/stdio2.h:67:10: note: '__builtin___snprintf_chk' output between 16 and 1016 bytes into a destination of size 1000 return __builtin___snprintf_chk (__s, __n, __USE_FORTIFY_LEVEL - 1, ^~~~~~~~~~~~~~~~~~~~~~~~~~~~~~~~~~~~~~~~~~~~~~~~~~~~~~~~~~~~ __bos (__s), __fmt, __va_arg_pack ()); ~~~~~~~~~~~~~~~~~~~~~~~~~~~~~~~~~~~~~ /tmp/B.83blWt/BUILD/camwire2-2.0.0-Source/examples/cammonitor/cammonitor.c: In function 'main': /tmp/B.83blWt/BUILD/camwire2-2.0.0-Source/examples/cammonitor/cammonitor.c:2161:53: error: '%s' directive output may be truncated writing up to 1000 bytes into a region of size 986 [-Werror=format-truncation=] snprintf(errormessage, MAX_MESSAGE, "Can't create '%s'", ^~ logfile_name); ~~~~~~~~~~~~ In file included from /usr/include/stdio.h:867, from /tmp/B.83blWt/BUILD/camwire2-2.0.0-Source/examples/cammonitor/cammonitor.c:37: /usr/include/bits/stdio2.h:67:10: note: '__builtin___snprintf_chk' output between 16 and 1016 bytes into a destination of size 1000 return __builtin___snprintf_chk (__s, __n, __USE_FORTIFY_LEVEL - 1, ^~~~~~~~~~~~~~~~~~~~~~~~~~~~~~~~~~~~~~~~~~~~~~~~~~~~~~~~~~~~ __bos (__s), __fmt, __va_arg_pack ()); ~~~~~~~~~~~~~~~~~~~~~~~~~~~~~~~~~~~~~ cc1: all warnings being treated as errors make[2]: *** [examples/cammonitor/CMakeFiles/cammonitor.dir/build.make:67: examples/cammonitor/CMakeFiles/cammonitor.dir/cammonitor.c.o] Error 1 make[2]: Leaving directory '/tmp/B.83blWt/BUILD/camwire2-2.0.0-Source' make[1]: *** [CMakeFiles/Makefile2:362: examples/cammonitor/CMakeFiles/cammonitor.dir/all] Error 2 make[1]: Leaving directory '/tmp/B.83blWt/BUILD/camwire2-2.0.0-Source' make: *** [Makefile:155: all] Error 2 error: Bad exit status from /tmp/B.83blWt/BUILD/tmp/rpm-tmp.36651 (%build) RPM build errors: Bad exit status from /tmp/B.83blWt/BUILD/tmp/rpm-tmp.36651 (%build) ended at: Thu Aug 8 15:55:26 2019, done in 0:00:05.997200 error: No files produced. + chmod -R u+rwX /tmp/B.83blWt/BUILD + rm -rf /tmp/B.83blWt/tmp /tmp/B.83blWt/BUILD + rm -rf /tmp/B.83blWt Begin-PLD-Builder-Info Build-Time: user:7.45s sys:0.73s real:9.66s (faults io:0 non-io:238603) End-PLD-Builder-Info
[Back to list of logs] [View rpm -qa of builder]