Advanced Search
Powered by PLD Linux
(c) 2002-2018 PLD Team
$Revision: 1.37 $
Powered by nasi tu byli.
Your IP:

courier-authlib d702e8ff-3924-4a56-90bf-b337d63911d3

Source URL:,d702e8ff-3924-4a56-90bf-b337d63911d3.bz2
text/plain URL:View!
full text:View!
rpm -qa of builder:View!
Date:2018/03/07 10:36:21


  • error 1
  • make[2]: *** [Makefile:539: aclocal.m4] Error 127
  • error 2
  • make[1]: *** [Makefile:1470: all-recursive] Error 1
  • error 3
  • error: Bad exit status from /tmp/B.eUbVH6/BUILD/tmp/rpm-tmp.54809 (%build)
  • error 4
  • RPM build errors:
  • error 5
  • error: No files produced.


checking for x86_64-pld-linux-gnux32-dlltool... no
checking for dlltool... no
checking how to associate runtime and link libraries... print -r --
checking for x86_64-pld-linux-gnux32-ar... no
checking for ar... ar
checking for archiver @FILE support... @
checking for x86_64-pld-linux-gnux32-strip... no
checking for strip... strip
checking for x86_64-pld-linux-gnux32-ranlib... no
checking for ranlib... ranlib
checking command to parse /usr/bin/nm -B output from x86_64-pld-linux-gnux32-gcc object... ok
checking for sysroot... no
checking for a working dd... /bin/dd
checking how to truncate binary pipes... /bin/dd bs=4096 count=1
checking for x86_64-pld-linux-gnux32-mt... no
checking for mt... no
checking if : is a manifest tool... no
checking how to run the C preprocessor... x86_64-pld-linux-gnux32-gcc -E
checking for ANSI C header files... yes
checking for sys/types.h... yes
checking for sys/stat.h... yes
checking for stdlib.h... yes
checking for string.h... yes
checking for memory.h... yes
checking for strings.h... yes
checking for inttypes.h... yes
checking for stdint.h... yes
checking for unistd.h... yes
checking for dlfcn.h... yes
checking for objdir... .libs
checking if x86_64-pld-linux-gnux32-gcc supports -fno-rtti -fno-exceptions... no
checking for x86_64-pld-linux-gnux32-gcc option to produce PIC... -fPIC -DPIC
checking if x86_64-pld-linux-gnux32-gcc PIC flag -fPIC -DPIC works... yes
checking if x86_64-pld-linux-gnux32-gcc static flag -static works... yes
checking if x86_64-pld-linux-gnux32-gcc supports -c -o file.o... yes
checking if x86_64-pld-linux-gnux32-gcc supports -c -o file.o... (cached) yes
checking whether the x86_64-pld-linux-gnux32-gcc linker (/usr/bin/ld -m elf32_x86_64) supports shared libraries... yes
checking whether -lc should be explicitly linked in... no
checking dynamic linker characteristics... GNU/Linux
checking how to hardcode library paths into programs... immediate
checking whether stripping libraries is possible... yes
checking if libtool supports shared libraries... yes
checking whether to build shared libraries... yes
checking whether to build static libraries... yes
checking for an ANSI C-conforming const... yes
checking for ANSI C header files... (cached) yes
checking fcntl.h usability... yes
checking fcntl.h presence... yes
checking for fcntl.h... yes
checking for string.h... (cached) yes
checking syslog.h usability... yes
checking syslog.h presence... yes
checking for syslog.h... yes
checking for uid_t in sys/types.h... yes
checking for special C compiler options needed for large files... no
checking for _FILE_OFFSET_BITS value needed for large files... no
checking for strchr... yes
checking that generated files are newer than configure... done
configure: creating ./config.status
config.status: creating Makefile
config.status: creating config.h
config.status: executing depfiles commands
config.status: executing libtool commands
+ /usr/bin/make -Otarget -j9 -j1 'LDFLAGS=-Wl,--as-needed -Wl,--no-copy-dt-needed-entries -Wl,-z,relro -Wl,-z,combreloc  -lcrypt'
/bin/sh ./config.status --file=authlib.html
config.status: creating authlib.html
echo "#define AUTHLDAPRC \"/etc/authlib/authldaprc\"" >authldaprc.h
echo "#define AUTHMYSQLRC \"/etc/authlib/authmysqlrc\"" >authmysqlrc.h
echo "#define AUTHPGSQLRC \"/etc/authlib/authpgsqlrc\"" >authpgsqlrc.h
echo "#define PIPE_PROGRAM \"/etc/authlib/authProg\"" >authpiperc.h
echo "#define AUTHDAEMONRC \"/etc/authlib/authdaemonrc\"" >authdaemonrc.h
echo "#define AUTHDAEMONVAR \"/var/spool/authdaemon\"" >>authdaemonrc.h
echo "#define AUTHDAEMONPID AUTHDAEMONVAR \"/pid\"" >>authdaemonrc.h
echo "#define AUTHDAEMONSOCK AUTHDAEMONVAR \"/socket\"" >>authdaemonrc.h
echo "#define AUTHDAEMONLOCK AUTHDAEMONVAR \"/lock\"" >>authdaemonrc.h
echo '#define PKGVERSION "0.65.0"' >packageversion.h
echo '#define AUTHCHANGEPWDIR "/usr/libexec/courier-authlib"' >authchangepwdir.h
echo '#define SBINDIR "/usr/sbin"' >sbindir.h
echo '#define PKGLIBDIR "/usr/libx32/courier-authlib"' >pkglibdir.h
echo '#define PKGINCLUDEDIR "/usr/include"' >pkgincludedir.h
echo '#define MAILUSER "daemon"' >mailusergroup.h
echo '#define MAILGROUP "daemon"' >>mailusergroup.h
/bin/sh ./config.status --file=README_authlib.html
config.status: creating README_authlib.html
/usr/bin/make  all-recursive
make[1]: Entering directory '/tmp/B.eUbVH6/BUILD/courier-authlib-0.65.0'
Making all in libltdl
make[2]: Entering directory '/tmp/B.eUbVH6/BUILD/courier-authlib-0.65.0/libltdl'
CDPATH="${ZSH_VERSION+.}:" && cd . && /bin/sh /tmp/B.eUbVH6/BUILD/courier-authlib-0.65.0/missing aclocal-1.15 -I m4
/tmp/B.eUbVH6/BUILD/courier-authlib-0.65.0/missing[81]: aclocal-1.15: not found
WARNING: 'aclocal-1.15' is missing on your system.
         You should only need it if you modified 'acinclude.m4' or
         '' or m4 files included by ''.
         The 'aclocal' program is part of the GNU Automake package:
         It also requires GNU Autoconf, GNU m4 and Perl in order to run:
make[2]: *** [Makefile:539: aclocal.m4] Error 127
make[2]: Leaving directory '/tmp/B.eUbVH6/BUILD/courier-authlib-0.65.0/libltdl'
make[1]: *** [Makefile:1470: all-recursive] Error 1
make[1]: Leaving directory '/tmp/B.eUbVH6/BUILD/courier-authlib-0.65.0'
make: *** [Makefile:891: all] Error 2
error: Bad exit status from /tmp/B.eUbVH6/BUILD/tmp/rpm-tmp.54809 (%build)

RPM build errors:
    Bad exit status from /tmp/B.eUbVH6/BUILD/tmp/rpm-tmp.54809 (%build)
ended at: Wed Mar  7 10:36:21 2018, done in 0:02:01.913402
error: No files produced.
+ chmod -R u+rwX /tmp/B.eUbVH6/BUILD
+ rm -rf /tmp/B.eUbVH6/tmp /tmp/B.eUbVH6/BUILD
+ rm -rf /tmp/B.eUbVH6
Build-Time: user:82.49s sys:12.21s real:125.34s (faults io:1 non-io:6566603)

[Back to list of logs] [View rpm -qa of builder]