FailedOk

th/SRPMS[OK]
th/x32[OK]
th/i686[OK]
th/x86_64[OK]

ac/SRPMS[OK]
ac/i386[OK]
ac/i586[OK]
ac/i686[OK]
ac/alpha[OK]
ac/amd64[OK]
ac/athlon[OK]
ac/ppc[OK]
ac/sparc[OK]
ac/sparc64[OK]

Advanced Search
main()
Powered by PLD Linux
(c) 2002-2020 PLD Team
$Revision: 1.37 $
Powered by matrix.
Your IP: 3.238.8.102

docsis 059ae1cd-7195-4a2d-85ed-eea0368a467b

Status:Failed
Source URL:https://buildlogs.pld-linux.org/pld/th/x32/FAIL/docsis,059ae1cd-7195-4a2d-85ed-eea0368a467b.bz2
text/plain URL:View!
full text:View!
rpm -qa of builder:View!
Date:2020/10/05 09:19:14
Runtime:0:00:09.643486

Toc:

  • error 1
  • collect2: error: ld returned 1 exit status
  • error 2
  • make[2]: *** [Makefile:430: docsis] Error 1
  • error 3
  • make[1]: *** [Makefile:476: all-recursive] Error 1
  • error 4
  • error: Bad exit status from /tmp/B.75ifF9/BUILD/tmp/rpm-tmp.3813 (%build)
  • error 5
  • RPM build errors:
  • error 6
  • error: No files produced.

Content:

checking for stdint.h... yes
checking for unistd.h... yes
checking for dlfcn.h... yes
checking for objdir... .libs
checking if x86_64-pld-linux-gnux32-gcc supports -fno-rtti -fno-exceptions... no
checking for x86_64-pld-linux-gnux32-gcc option to produce PIC... -fPIC -DPIC
checking if x86_64-pld-linux-gnux32-gcc PIC flag -fPIC -DPIC works... yes
checking if x86_64-pld-linux-gnux32-gcc static flag -static works... yes
checking if x86_64-pld-linux-gnux32-gcc supports -c -o file.o... yes
checking if x86_64-pld-linux-gnux32-gcc supports -c -o file.o... (cached) yes
checking whether the x86_64-pld-linux-gnux32-gcc linker (/usr/bin/ld -m elf32_x86_64) supports shared libraries... yes
checking whether -lc should be explicitly linked in... no
checking dynamic linker characteristics... GNU/Linux ld.so
checking how to hardcode library paths into programs... immediate
checking whether stripping libraries is possible... yes
checking if libtool supports shared libraries... yes
checking whether to build shared libraries... yes
checking whether to build static libraries... yes
checking for flex... flex
checking lex output file root... lex.yy
checking lex library... -lfl
checking whether yytext is a pointer... yes
checking for inet_aton in -lresolv... yes
checking for trunc in -lm... yes
checking for gm4... no
checking for gnum4... no
checking for m4... /usr/bin/m4
   found m4 (GNU M4) 1.4.18 at /usr/bin/m4 
checking for bison... /usr/bin/bison
   found bison version 3007002, using /usr/bin/bison -t -d -y
checking for net-snmp-config... /usr/bin/net-snmp-config
   found net-snmp version 5009000
checking for Cygwin... no
checking that generated files are newer than configure... done
configure: creating ./config.status
config.status: creating Makefile
config.status: creating src/Makefile
config.status: creating doc/Makefile
config.status: creating examples/Makefile
config.status: creating mibs/Makefile
config.status: creating config.h
config.status: executing depfiles commands
config.status: executing libtool commands
+ /usr/bin/make -Otarget -j9
/usr/bin/make  all-recursive
Making all in src
make[2]: Entering directory '/tmp/B.75ifF9/BUILD/docsis-0.9.5/src'
x86_64-pld-linux-gnux32-gcc -DHAVE_CONFIG_H -I. -I..  -I/usr/include/libnl3 -I. -I/usr/include    -O2 -fwrapv -pipe -Wformat -Werror=format-security -gdwarf-4 -fno-debug-types-section -fvar-tracking-assignments -g2 -Wp,-D_FORTIFY_SOURCE=2 -fstack-protector-strong --param=ssp-buffer-size=4 -Werror=trampolines -fPIC -mtune=generic -march=x86-64 -gdwarf-4 -fno-debug-types-section -fvar-tracking-assignments -g2  -MT ethermac.o -MD -MP -MF .deps/ethermac.Tpo -c -o ethermac.o ethermac.c
mv -f .deps/ethermac.Tpo .deps/ethermac.Po
make[2]: Leaving directory '/tmp/B.75ifF9/BUILD/docsis-0.9.5/src'
make[2]: Entering directory '/tmp/B.75ifF9/BUILD/docsis-0.9.5/src'
x86_64-pld-linux-gnux32-gcc -DHAVE_CONFIG_H -I. -I..  -I/usr/include/libnl3 -I. -I/usr/include    -O2 -fwrapv -pipe -Wformat -Werror=format-security -gdwarf-4 -fno-debug-types-section -fvar-tracking-assignments -g2 -Wp,-D_FORTIFY_SOURCE=2 -fstack-protector-strong --param=ssp-buffer-size=4 -Werror=trampolines -fPIC -mtune=generic -march=x86-64 -gdwarf-4 -fno-debug-types-section -fvar-tracking-assignments -g2  -MT hmac_md5.o -MD -MP -MF .deps/hmac_md5.Tpo -c -o hmac_md5.o hmac_md5.c
mv -f .deps/hmac_md5.Tpo .deps/hmac_md5.Po
make[2]: Leaving directory '/tmp/B.75ifF9/BUILD/docsis-0.9.5/src'
make[2]: Entering directory '/tmp/B.75ifF9/BUILD/docsis-0.9.5/src'
x86_64-pld-linux-gnux32-gcc -DHAVE_CONFIG_H -I. -I..  -I/usr/include/libnl3 -I. -I/usr/include    -O2 -fwrapv -pipe -Wformat -Werror=format-security -gdwarf-4 -fno-debug-types-section -fvar-tracking-assignments -g2 -Wp,-D_FORTIFY_SOURCE=2 -fstack-protector-strong --param=ssp-buffer-size=4 -Werror=trampolines -fPIC -mtune=generic -march=x86-64 -gdwarf-4 -fno-debug-types-section -fvar-tracking-assignments -g2  -MT md5.o -MD -MP -MF .deps/md5.Tpo -c -o md5.o md5.c
mv -f .deps/md5.Tpo .deps/md5.Po
make[2]: Leaving directory '/tmp/B.75ifF9/BUILD/docsis-0.9.5/src'
make[2]: Entering directory '/tmp/B.75ifF9/BUILD/docsis-0.9.5/src'
x86_64-pld-linux-gnux32-gcc -DHAVE_CONFIG_H -I. -I..  -I/usr/include/libnl3 -I. -I/usr/include    -O2 -fwrapv -pipe -Wformat -Werror=format-security -gdwarf-4 -fno-debug-types-section -fvar-tracking-assignments -g2 -Wp,-D_FORTIFY_SOURCE=2 -fstack-protector-strong --param=ssp-buffer-size=4 -Werror=trampolines -fPIC -mtune=generic -march=x86-64 -gdwarf-4 -fno-debug-types-section -fvar-tracking-assignments -g2  -MT docsis.o -MD -MP -MF .deps/docsis.Tpo -c -o docsis.o docsis.c
In file included from /usr/include/string.h:519,
                 from docsis.c:28:
In function 'strncpy',
    inlined from 'get_output_name' at docsis.c:484:3:
/usr/include/bits/string_fortified.h:106:10: warning: '__builtin_strncpy' specified bound depends on the length of the source argument [-Wstringop-overflow=]
  106 |   return __builtin___strncpy_chk (__dest, __src, __len, __bos (__dest));
      |          ^~~~~~~~~~~~~~~~~~~~~~~~~~~~~~~~~~~~~~~~~~~~~~~~~~~~~~~~~~~~~~
docsis.c: In function 'get_output_name':
docsis.c:484:3: note: length computed here
  484 |   strncpy (&new_path[pathlen - old_ext_len], extension_string, strlen(extension_string) );
      |   ^~~~~~~~~~~~~~~~~~~~~~~~~~~~~~~~~~~~~~~~~~~~~~~~~~~~~~~~~~~~~~~~~~~~~~~~~~~~~~~~~~~~~~~
mv -f .deps/docsis.Tpo .deps/docsis.Po
make[2]: Leaving directory '/tmp/B.75ifF9/BUILD/docsis-0.9.5/src'
make[2]: Entering directory '/tmp/B.75ifF9/BUILD/docsis-0.9.5/src'
x86_64-pld-linux-gnux32-gcc -DHAVE_CONFIG_H -I. -I..  -I/usr/include/libnl3 -I. -I/usr/include    -O2 -fwrapv -pipe -Wformat -Werror=format-security -gdwarf-4 -fno-debug-types-section -fvar-tracking-assignments -g2 -Wp,-D_FORTIFY_SOURCE=2 -fstack-protector-strong --param=ssp-buffer-size=4 -Werror=trampolines -fPIC -mtune=generic -march=x86-64 -gdwarf-4 -fno-debug-types-section -fvar-tracking-assignments -g2  -MT docsis_encode.o -MD -MP -MF .deps/docsis_encode.Tpo -c -o docsis_encode.o docsis_encode.c
mv -f .deps/docsis_encode.Tpo .deps/docsis_encode.Po
make[2]: Leaving directory '/tmp/B.75ifF9/BUILD/docsis-0.9.5/src'
make[2]: Entering directory '/tmp/B.75ifF9/BUILD/docsis-0.9.5/src'
x86_64-pld-linux-gnux32-gcc -DHAVE_CONFIG_H -I. -I..  -I/usr/include/libnl3 -I. -I/usr/include    -O2 -fwrapv -pipe -Wformat -Werror=format-security -gdwarf-4 -fno-debug-types-section -fvar-tracking-assignments -g2 -Wp,-D_FORTIFY_SOURCE=2 -fstack-protector-strong --param=ssp-buffer-size=4 -Werror=trampolines -fPIC -mtune=generic -march=x86-64 -gdwarf-4 -fno-debug-types-section -fvar-tracking-assignments -g2  -MT docsis_decode.o -MD -MP -MF .deps/docsis_decode.Tpo -c -o docsis_decode.o docsis_decode.c
mv -f .deps/docsis_decode.Tpo .deps/docsis_decode.Po
make[2]: Leaving directory '/tmp/B.75ifF9/BUILD/docsis-0.9.5/src'
make[2]: Entering directory '/tmp/B.75ifF9/BUILD/docsis-0.9.5/src'
x86_64-pld-linux-gnux32-gcc -DHAVE_CONFIG_H -I. -I..  -I/usr/include/libnl3 -I. -I/usr/include    -O2 -fwrapv -pipe -Wformat -Werror=format-security -gdwarf-4 -fno-debug-types-section -fvar-tracking-assignments -g2 -Wp,-D_FORTIFY_SOURCE=2 -fstack-protector-strong --param=ssp-buffer-size=4 -Werror=trampolines -fPIC -mtune=generic -march=x86-64 -gdwarf-4 -fno-debug-types-section -fvar-tracking-assignments -g2  -MT docsis_snmp.o -MD -MP -MF .deps/docsis_snmp.Tpo -c -o docsis_snmp.o docsis_snmp.c
mv -f .deps/docsis_snmp.Tpo .deps/docsis_snmp.Po
make[2]: Leaving directory '/tmp/B.75ifF9/BUILD/docsis-0.9.5/src'
make[2]: Entering directory '/tmp/B.75ifF9/BUILD/docsis-0.9.5/src'
x86_64-pld-linux-gnux32-gcc -DHAVE_CONFIG_H -I. -I..  -I/usr/include/libnl3 -I. -I/usr/include    -O2 -fwrapv -pipe -Wformat -Werror=format-security -gdwarf-4 -fno-debug-types-section -fvar-tracking-assignments -g2 -Wp,-D_FORTIFY_SOURCE=2 -fstack-protector-strong --param=ssp-buffer-size=4 -Werror=trampolines -fPIC -mtune=generic -march=x86-64 -gdwarf-4 -fno-debug-types-section -fvar-tracking-assignments -g2  -MT docsis_lex.o -MD -MP -MF .deps/docsis_lex.Tpo -c -o docsis_lex.o docsis_lex.c
mv -f .deps/docsis_lex.Tpo .deps/docsis_lex.Po
make[2]: Leaving directory '/tmp/B.75ifF9/BUILD/docsis-0.9.5/src'
make[2]: Entering directory '/tmp/B.75ifF9/BUILD/docsis-0.9.5/src'
x86_64-pld-linux-gnux32-gcc -DHAVE_CONFIG_H -I. -I..  -I/usr/include/libnl3 -I. -I/usr/include    -O2 -fwrapv -pipe -Wformat -Werror=format-security -gdwarf-4 -fno-debug-types-section -fvar-tracking-assignments -g2 -Wp,-D_FORTIFY_SOURCE=2 -fstack-protector-strong --param=ssp-buffer-size=4 -Werror=trampolines -fPIC -mtune=generic -march=x86-64 -gdwarf-4 -fno-debug-types-section -fvar-tracking-assignments -g2  -MT docsis_yy.o -MD -MP -MF .deps/docsis_yy.Tpo -c -o docsis_yy.o docsis_yy.c
mv -f .deps/docsis_yy.Tpo .deps/docsis_yy.Po
make[2]: Leaving directory '/tmp/B.75ifF9/BUILD/docsis-0.9.5/src'
make[2]: Entering directory '/tmp/B.75ifF9/BUILD/docsis-0.9.5/src'
/bin/sh ../libtool  --tag=CC   --mode=link x86_64-pld-linux-gnux32-gcc  -O2 -fwrapv -pipe -Wformat -Werror=format-security -gdwarf-4 -fno-debug-types-section -fvar-tracking-assignments -g2 -Wp,-D_FORTIFY_SOURCE=2 -fstack-protector-strong --param=ssp-buffer-size=4 -Werror=trampolines -fPIC -mtune=generic -march=x86-64 -gdwarf-4 -fno-debug-types-section -fvar-tracking-assignments -g2   -L/usr/libx32 -lnetsnmp -lm -lcom_err -lkrb5 -lssh2 -lssl -lssl -lcrypto -lfl  -Wl,--as-needed -Wl,--no-copy-dt-needed-entries -Wl,-z,relro -Wl,-z,combreloc  -o docsis docsis.o ethermac.o md5.o docsis_encode.o docsis_decode.o docsis_snmp.o docsis_yy.o docsis_lex.o hmac_md5.o  -lm -lresolv 
libtool: link: x86_64-pld-linux-gnux32-gcc -O2 -fwrapv -pipe -Wformat -Werror=format-security -gdwarf-4 -fno-debug-types-section -fvar-tracking-assignments -g2 -Wp,-D_FORTIFY_SOURCE=2 -fstack-protector-strong --param=ssp-buffer-size=4 -Werror=trampolines -fPIC -mtune=generic -march=x86-64 -gdwarf-4 -fno-debug-types-section -fvar-tracking-assignments -g2 -Wl,--as-needed -Wl,--no-copy-dt-needed-entries -Wl,-z -Wl,relro -Wl,-z -Wl,combreloc -o docsis docsis.o ethermac.o md5.o docsis_encode.o docsis_decode.o docsis_snmp.o docsis_yy.o docsis_lex.o hmac_md5.o  -L/usr/libx32 /usr/libx32/libnetsnmp.so /usr/libx32/libkrb5.so /usr/libx32/libhx509.so /usr/libx32/libwind.so /usr/libx32/libsqlite3.so /usr/libx32/libhcrypto.so /usr/libx32/libasn1.so -lcom_err /usr/libx32/libheimbase.so /usr/libx32/libroken.so -lcrypt -ldl -lpthread /usr/libx32/libssh2.so -lz -lssl -lcrypto -lfl -lm -lresolv -pthread
/usr/bin/ld: docsis_encode.o:/tmp/B.75ifF9/BUILD/docsis-0.9.5/src/docsis_globals.h:26: multiple definition of `prog_name'; docsis.o:/tmp/B.75ifF9/BUILD/docsis-0.9.5/src/docsis_globals.h:26: first defined here
/usr/bin/ld: docsis_encode.o:/tmp/B.75ifF9/BUILD/docsis-0.9.5/src/docsis_globals.h:28: multiple definition of `global_symtable'; docsis.o:/tmp/B.75ifF9/BUILD/docsis-0.9.5/src/docsis_globals.h:28: first defined here
/usr/bin/ld: docsis_encode.o:/tmp/B.75ifF9/BUILD/docsis-0.9.5/src/docsis_globals.h:27: multiple definition of `global_tlvtree_head'; docsis.o:/tmp/B.75ifF9/BUILD/docsis-0.9.5/src/docsis_globals.h:27: first defined here
collect2: error: ld returned 1 exit status
make[2]: *** [Makefile:430: docsis] Error 1
make[2]: Leaving directory '/tmp/B.75ifF9/BUILD/docsis-0.9.5/src'
make[1]: *** [Makefile:476: all-recursive] Error 1
make: *** [Makefile:373: all] Error 2
error: Bad exit status from /tmp/B.75ifF9/BUILD/tmp/rpm-tmp.3813 (%build)


RPM build errors:
    Bad exit status from /tmp/B.75ifF9/BUILD/tmp/rpm-tmp.3813 (%build)
ended at: Mon Oct  5 09:19:14 2020, done in 0:00:09.643486
error: No files produced.
+ chmod -R u+rwX /tmp/B.75ifF9/BUILD
+ rm -rf /tmp/B.75ifF9/tmp /tmp/B.75ifF9/BUILD
+ rm -rf /tmp/B.75ifF9
Begin-PLD-Builder-Info
Build-Time: user:10.39s sys:0.98s real:12.75s (faults io:0 non-io:594125)

End-PLD-Builder-Info
[Back to list of logs] [View rpm -qa of builder]