FailedOk

th/SRPMS[OK]
th/x32[OK]
th/i686[OK]
th/x86_64[OK]

ac/SRPMS[OK]
ac/i386[OK]
ac/i586[OK]
ac/i686[OK]
ac/alpha[OK]
ac/amd64[OK]
ac/athlon[OK]
ac/ppc[OK]
ac/sparc[OK]
ac/sparc64[OK]

Advanced Search
main()
Powered by PLD Linux
(c) 2002-2020 PLD Team
$Revision: 1.37 $
Powered by Microsoft Windows 2003.
Your IP: 3.234.241.200

domoticz 69564287-f051-4009-b9ba-24e310e722a4

Status:Failed
Source URL:https://buildlogs.pld-linux.org/pld/th/x32/FAIL/domoticz,69564287-f051-4009-b9ba-24e310e722a4.bz2
text/plain URL:View!
rpm -qa of builder:View!
Date:2020/06/06 12:11:53
Runtime:0:00:03.532201

Toc:

  • prep
  • Executing(%prep): /bin/sh -e /tmp/B.mOiIJG/BUILD/tmp/rpm-tmp.87773
  • build
  • Executing(%build): /bin/sh -e /tmp/B.mOiIJG/BUILD/tmp/rpm-tmp.87773
  • error 1
  • make[2]: *** [CMakeFiles/revisiontag.dir/build.make:80: revisiontag] Error 1
  • error 2
  • make[1]: *** [CMakeFiles/Makefile2:101: CMakeFiles/revisiontag.dir/all] Error 2
  • error 3
  • error: Bad exit status from /tmp/B.mOiIJG/BUILD/tmp/rpm-tmp.87773 (%build)
  • error 4
  • RPM build errors:
  • error 5
  • error: No files produced.

Content:

request from: baggins
checking if we should skip the build
started at: Sat Jun  6 12:11:46 2020
killing old processes on a builder
sending signal 9 to pid -1
Killed
cleaning up /tmp
fetching https://srcbuilder.pld-linux.org/th//srpms/69564287-f051-4009-b9ba-24e310e722a4/domoticz-2020.2-1.src.rpm
fetched 14519848 bytes, 8164.2 K/s
installing srpm: domoticz-2020.2-1.src.rpm
+ install -d /tmp/B.mOiIJG/BUILD /tmp/B.mOiIJG/RPMS
+ LC_ALL=en_US.UTF-8
+ rpm -qp --changelog domoticz-2020.2-1.src.rpm
* Sat Jun 06 2020 PLD Linux Team <feedback@pld-linux.org>
- For complete changelog see: http://git.pld-linux.org/?p=packages/domoticz.git;a=log;h=master
* Mon May 25 2020 Arkadiusz Miśkiewicz <arekm@maven.pl> 72784cf
- up to 2020.2 * Thu Dec 12 2019 Arkadiusz Miśkiewicz <arekm@maven.pl> 10f7a92
- up to 4.11563 * Fri Dec 06 2019 Arkadiusz Miśkiewicz <arekm@maven.pl> 5ac2f18
- stop using not existant macro * Fri Dec 06 2019 Arkadiusz Miśkiewicz <arekm@maven.pl> 35a5a31
- rel 4; fix python 3.8 build * Fri Dec 06 2019 Arkadiusz Miśkiewicz <arekm@maven.pl> 8abd818
- release 3 (by relup.sh) * Mon Oct 07 2019 Jan Rękorajski <baggins@pld-linux.org> fa44be9
- rebuild with boost 1.71 - release 2 (by relup.sh) * Sat Oct 05 2019 Jaroslaw Kruk <kruk.jaroslaw@gmail.com> 86ad246
- Updated to 4.10717 + rpm -Uhv --nodeps --define '_topdir /tmp/B.mOiIJG' --define '_specdir %{_topdir}' --define '_sourcedir %{_specdir}' --define '_rpmdir %{_topdir}/RPMS' --define '_builddir %{_topdir}/BUILD' domoticz-2020.2-1.src.rpm Preparing... ################################################## domoticz ################################################## + rm -f domoticz-2020.2-1.src.rpm + install -m 700 -d /tmp/B.mOiIJG/BUILD/tmp + TMPDIR=/tmp/B.mOiIJG/BUILD/tmp + exec nice -n 0 rpmbuild -bp --short-circuit --nodeps --define '_topdir /tmp/B.mOiIJG' --define '_specdir %{_topdir}' --define '_sourcedir %{_specdir}' --define '_rpmdir %{_topdir}/RPMS' --define '_builddir %{_topdir}/BUILD' --target x32-pld-linux --define 'prep exit 0' /tmp/B.mOiIJG/domoticz.spec Building target platforms: x32-pld-linux checking BuildConflict-ing packages no BuildConflicts found checking BR rpm: Building target platforms: x32-pld-linux no BR needed building RPM using: set -ex; : build-id: 69564287-f051-4009-b9ba-24e310e722a4; TMPDIR=/tmp/B.mOiIJG/BUILD/tmp exec nice -n 0 rpmbuild -bb --define '_smp_mflags -j9' --define '_make_opts -Otarget' --define '_pld_builder 1' --define '_topdir /tmp/B.mOiIJG' --define '_specdir %{_topdir}' --define '_sourcedir %{_specdir}' --define '_rpmdir %{_topdir}/RPMS' --define '_builddir %{_topdir}/BUILD' --target x32-pld-linux /tmp/B.mOiIJG/domoticz.spec + : build-id: 69564287-f051-4009-b9ba-24e310e722a4 + TMPDIR=/tmp/B.mOiIJG/BUILD/tmp + exec nice -n 0 rpmbuild -bb --define '_smp_mflags -j9' --define '_make_opts -Otarget' --define '_pld_builder 1' --define '_topdir /tmp/B.mOiIJG' --define '_specdir %{_topdir}' --define '_sourcedir %{_specdir}' --define '_rpmdir %{_topdir}/RPMS' --define '_builddir %{_topdir}/BUILD' --target x32-pld-linux /tmp/B.mOiIJG/domoticz.spec Building target platforms: x32-pld-linux Executing(%prep): /bin/sh -e /tmp/B.mOiIJG/BUILD/tmp/rpm-tmp.87773 + umask 022 + cd /tmp/B.mOiIJG/BUILD + cd /tmp/B.mOiIJG/BUILD + rm -rf domoticz-2020.2 + /bin/gzip -dc /tmp/B.mOiIJG/2020.2.tar.gz + /bin/tar -xf - + STATUS=0 + '[' 0 -ne 0 ']' + cd domoticz-2020.2 + /bin/id -u + '[' 1000 '=' 0 ']' + /bin/id -u + '[' 1000 '=' 0 ']' + /bin/chmod -Rf a+rX,u+w,g-w,o-w . + APPVERSION=2020.2 + >appversion.h + echo '#define APPVERSION 2' + >>appversion.h + echo '#define APPHASH "%{snap}"' + date '--date=Sat Jun 06 2020' +%s + APPDATE=1591394400 + >>appversion.h + echo '#define APPDATE 1591394400' + echo 'Patch #2 (domoticz-tinyxpath.patch):' Patch #2 (domoticz-tinyxpath.patch): + '[' -f /tmp/B.mOiIJG/domoticz-tinyxpath.patch ']' + /bin/cat /tmp/B.mOiIJG/domoticz-tinyxpath.patch + /usr/bin/patch -s -p1 -b --suffix .tinyxpath + echo 'Patch #3 (domoticz-openzwave.patch):' Patch #3 (domoticz-openzwave.patch): + '[' -f /tmp/B.mOiIJG/domoticz-openzwave.patch ']' + /bin/cat /tmp/B.mOiIJG/domoticz-openzwave.patch + /usr/bin/patch -s -p1 -b --suffix .openzwave + echo 'Patch #5 (domoticz-python.patch):' Patch #5 (domoticz-python.patch): + '[' -f /tmp/B.mOiIJG/domoticz-python.patch ']' + /bin/cat /tmp/B.mOiIJG/domoticz-python.patch + /usr/bin/patch -s -p1 -b --suffix .python + rm -f 'hardware/openzwave/*.h' + rm -rf hardware/openzwave/aes + rm -rf hardware/openzwave/command_classes + rm -rf hardware/openzwave/platform + rm -rf hardware/openzwave/value_classes + rm -rf sqlite/ + rm -rf tinyxpath/ + exit 0 Executing(%build): /bin/sh -e /tmp/B.mOiIJG/BUILD/tmp/rpm-tmp.87773 HOME=/home/users/builder PATH=/home/users/builder/GNUstep/Tools:/bin:/usr/bin:/usr/local/bin TMPDIR=/tmp/B.mOiIJG/BUILD/tmp + umask 022 + cd /tmp/B.mOiIJG/BUILD + cd domoticz-2020.2 + install -d build + cd build + CC=x86_64-pld-linux-gnux32-gcc CXX=x86_64-pld-linux-gnux32-g++ CPPFLAGS='' /usr/bin/cmake -Wno-dev '-DCMAKE_VERBOSE_MAKEFILE=ON' '-DCMAKE_BUILD_TYPE=PLD' '-DCMAKE_INSTALL_BINDIR:PATH=/usr/bin' '-DCMAKE_INSTALL_SBINDIR:PATH=/usr/sbin' '-DCMAKE_INSTALL_LIBEXECDIR:PATH=/usr/libexec' '-DCMAKE_INSTALL_SYSCONFDIR:PATH=/etc' '-DCMAKE_INSTALL_SHAREDSTATEDIRPATH:PATH=/var/lib' '-DCMAKE_INSTALL_LOCALSTATEDIRPATH:PATH=/var' '-DCMAKE_INSTALL_LIBDIR:PATH=/usr/libx32' '-DCMAKE_INSTALL_INCLUDEDIR:PATH=/usr/include' '-DCMAKE_INSTALL_OLDINCLUDEDIR:PATH=/usr/include' '-DCMAKE_INSTALL_DATAROOTDIR:PATH=/usr/share' '-DCMAKE_INSTALL_DATADIR:PATH=/usr/share' '-DCMAKE_INSTALL_INFODIR:PATH=/usr/share/info' '-DCMAKE_INSTALL_LOCALEDIR:PATH=/usr/share/locale' '-DCMAKE_INSTALL_MANDIR:PATH=/usr/share/man' '-DCMAKE_INSTALL_DOCDIR:PATH=/usr/share/doc' '-DCMAKE_INSTALL_PREFIX:PATH=/usr' '-DSYSCONF_INSTALL_DIR:PATH=/etc' '-DCMAKE_CXX_FLAGS_PLD=-O2 -fwrapv -pipe -Wformat -Werror=format-security -gdwarf-4 -fno-debug-types-section -fvar-tracking-assignments -g2 -Wp,-D_FORTIFY_SOURCE=2 -fstack-protector-strong --param=ssp-buffer-size=4 -Werror=trampolines -fPIC -mtune=generic -march=x86-64 -gdwarf-4 -fno-debug-types-section -fvar-tracking-assignments -g2 -DNDEBUG -DQT_NO_DEBUG' '-DCMAKE_C_FLAGS_PLD=-O2 -fwrapv -pipe -Wformat -Werror=format-security -gdwarf-4 -fno-debug-types-section -fvar-tracking-assignments -g2 -Wp,-D_FORTIFY_SOURCE=2 -fstack-protector-strong --param=ssp-buffer-size=4 -Werror=trampolines -fPIC -mtune=generic -march=x86-64 -gdwarf-4 -fno-debug-types-section -fvar-tracking-assignments -g2 -DNDEBUG -DQT_NO_DEBUG' '-DCMAKE_Fortran_FLAGS_PLD=-O2 -fwrapv -pipe -Wformat -Werror=format-security -gdwarf-4 -fno-debug-types-section -fvar-tracking-assignments -g2 -Wp,-D_FORTIFY_SOURCE=2 -fstack-protector-strong --param=ssp-buffer-size=4 -Werror=trampolines -fPIC -mtune=generic -march=x86-64 -gdwarf-4 -fno-debug-types-section -fvar-tracking-assignments -g2 -DNDEBUG -DQT_NO_DEBUG' '-DCMAKE_EXE_LINKER_FLAGS_PLD=-Wl,--as-needed -Wl,--no-copy-dt-needed-entries -Wl,-z,relro -Wl,-z,combreloc ' '-DCMAKE_SHARED_LINKER_FLAGS_PLD=-Wl,--as-needed -Wl,--no-copy-dt-needed-entries -Wl,-z,relro -Wl,-z,combreloc ' '-DCMAKE_MODULE_LINKER_FLAGS_PLD=-Wl,--as-needed -Wl,--no-copy-dt-needed-entries -Wl,-z,relro -Wl,-z,combreloc ' '-DLIB_SUFFIX=x32' '-DBUILD_SHARED_LIBS:BOOL=ON' '-DUSE_OPENSSL_STATIC=NO' '-DUSE_STATIC_LIBSTDCXX=NO' '-DUSE_STATIC_OPENZWAVE=NO' '-DUSE_OPENSSL_STATIC=NO' '-DUSE_BUILTIN_JSONCPP=NO' '-DUSE_BUILTIN_LUA=NO' '-DUSE_BUILTIN_MINIZIP=NO' '-DUSE_BUILTIN_MQTT=NO' '-DUSE_BUILTIN_SQLITE=NO' '-DUSE_BUILTIN_TINYXPATH=NO' '-DUSE_STATIC_BOOST=NO' '-DCMAKE_INSTALL_PREFIX=/usr/share/domoticz' .. -- The C compiler identification is GNU 10.1.0 -- The CXX compiler identification is GNU 10.1.0 -- Check for working C compiler: /usr/bin/x86_64-pld-linux-gnux32-gcc -- Check for working C compiler: /usr/bin/x86_64-pld-linux-gnux32-gcc - works -- Detecting C compiler ABI info -- Detecting C compiler ABI info - done -- Detecting C compile features -- Detecting C compile features - done -- Check for working CXX compiler: /usr/bin/x86_64-pld-linux-gnux32-g++ -- Check for working CXX compiler: /usr/bin/x86_64-pld-linux-gnux32-g++ - works -- Detecting CXX compiler ABI info -- Detecting CXX compiler ABI info - done -- Detecting CXX compile features -- Detecting CXX compile features - done -- Failed to get ProjectRevision from git -- Read ProjectRevision from History.txt -- Found Lua: /usr/libx32/liblua5.3.so;/usr/libx32/libm.so (found suitable version "5.3.5", minimum required is "5.3") -- LUA library found at : /usr/libx32/liblua5.3.so;/usr/libx32/libm.so -- LUA includes found at : /usr/include/lua5.3 -- Found PythonInterp: /usr/bin/python3 (found suitable version "3.8.3", minimum required is "3.4") -- Found PythonLibs: /usr/libx32/libpython3.8.so (found suitable version "3.8.3", minimum required is "3.4") -- Python3 includes found at: /usr/include/python3.8 -- Looking for execinfo.h -- Looking for execinfo.h - found -- Looking for 3 include files sys/types.h, ..., linux/i2c.h -- Looking for 3 include files sys/types.h, ..., linux/i2c.h - found -- Building with I2C support -- Looking for include files sys/types.h, linux/spi/spidev.h -- Looking for include files sys/types.h, linux/spi/spidev.h - found -- Building with SPI support -- ########################### -- Compiling Revision #2 -- ########################### -- Check if the system is big endian -- Searching 16 bit integer -- Looking for sys/types.h -- Looking for sys/types.h - found -- Looking for stdint.h -- Looking for stdint.h - found -- Looking for stddef.h -- Looking for stddef.h - found -- Check size of unsigned short -- Check size of unsigned short - done -- Searching 16 bit integer - Using unsigned short -- Check if the system is big endian - little endian -- Found PkgConfig: /usr/bin/pkg-config (found version "0.29.2") -- Checking for module 'jsoncpp' -- Found jsoncpp, version 1.8.4 -- JSONCPP includes found at: /usr/include/jsoncpp -- MQTT includes found at: /usr/include -- Found SQLite3: /usr/include (found version "3.32.2") -- SQLite library found at: /usr/libx32/libsqlite3.so -- SQLite includes found at: /usr/include -- Checking for module 'minizip' -- Found minizip, version 1.2.11 -- MINIZIP includes found at: /usr/include/minizip -- Found OpenSSL: /usr/libx32/libcrypto.so (found version "1.1.1g") -- OPENSSL library found at: /usr/libx32/libssl.so;/usr/libx32/libcrypto.so -- Linking against boost dynamic libraries -- Looking for pthread.h -- Looking for pthread.h - found -- Performing Test CMAKE_HAVE_LIBC_PTHREAD -- Performing Test CMAKE_HAVE_LIBC_PTHREAD - Failed -- Looking for pthread_create in pthreads -- Looking for pthread_create in pthreads - not found -- Looking for pthread_create in pthread -- Looking for pthread_create in pthread - found -- Found Threads: TRUE -- Found Boost: /usr/include (found version "1.71.0") found components: thread system chrono date_time atomic -- BOOST includes found at: /usr/include -- Found ZLIB: /usr/libx32/libz.so (found version "1.2.11") -- ZLIB library found at: /usr/libx32/libz.so -- ZLIB includes found at: /usr/include -- Found CURL: /usr/libx32/libcurl.so (found version "7.69.1") -- Curl library found at: /usr/libx32/libcurl.so -- Curl includes found at: /usr/include -- CEREAL includes found at: /usr/include -- Found LIBUSB: /usr/libx32/libusb.so -- LIBUSB library found at: /usr/libx32/libusb.so -- TinyXML found at: tinyxml -- TinyXPath found -- Checking for module 'libopenzwave' -- Found libopenzwave, version 1.6 -- ==== OpenZWave package found! -- OpenZWavelibraryfoundat:/usr/libx32/libopenzwave.so -- OpenZWave library found at: /usr/libx32/libopenzwave.so -- OpenZWave includes found at: /usr/include/openzwave// -- GPIO is not available -- Not found telldus-core (telldus-core.h), not adding tellstick support -- Using precompiled headers -- Using dynamic libgcc_s/libstdc++ -- Configuring done -- Generating done CMake Warning: Manually-specified variables were not used by the project: CMAKE_Fortran_FLAGS_PLD CMAKE_INSTALL_BINDIR CMAKE_INSTALL_DATADIR CMAKE_INSTALL_DATAROOTDIR CMAKE_INSTALL_DOCDIR CMAKE_INSTALL_INCLUDEDIR CMAKE_INSTALL_INFODIR CMAKE_INSTALL_LIBDIR CMAKE_INSTALL_LIBEXECDIR CMAKE_INSTALL_LOCALEDIR CMAKE_INSTALL_LOCALSTATEDIRPATH CMAKE_INSTALL_MANDIR CMAKE_INSTALL_OLDINCLUDEDIR CMAKE_INSTALL_SBINDIR CMAKE_INSTALL_SHAREDSTATEDIRPATH CMAKE_INSTALL_SYSCONFDIR LIB_SUFFIX SYSCONF_INSTALL_DIR USE_BUILTIN_LUA -- Build files have been written to: /tmp/B.mOiIJG/BUILD/domoticz-2020.2/build + /usr/bin/make -Otarget -j9 /usr/bin/cmake -S/tmp/B.mOiIJG/BUILD/domoticz-2020.2 -B/tmp/B.mOiIJG/BUILD/domoticz-2020.2/build --check-build-system CMakeFiles/Makefile.cmake 0 /usr/bin/cmake -E cmake_progress_start /tmp/B.mOiIJG/BUILD/domoticz-2020.2/build/CMakeFiles /tmp/B.mOiIJG/BUILD/domoticz-2020.2/build/CMakeFiles/progress.marks /usr/bin/make -f CMakeFiles/Makefile2 all /usr/bin/make -f CMakeFiles/revisiontag.dir/build.make CMakeFiles/revisiontag.dir/depend make[2]: Entering directory '/tmp/B.mOiIJG/BUILD/domoticz-2020.2/build' cd /tmp/B.mOiIJG/BUILD/domoticz-2020.2/build && /usr/bin/cmake -E cmake_depends "Unix Makefiles" /tmp/B.mOiIJG/BUILD/domoticz-2020.2 /tmp/B.mOiIJG/BUILD/domoticz-2020.2 /tmp/B.mOiIJG/BUILD/domoticz-2020.2/build /tmp/B.mOiIJG/BUILD/domoticz-2020.2/build /tmp/B.mOiIJG/BUILD/domoticz-2020.2/build/CMakeFiles/revisiontag.dir/DependInfo.cmake --color= Scanning dependencies of target revisiontag make[2]: Leaving directory '/tmp/B.mOiIJG/BUILD/domoticz-2020.2/build' /usr/bin/make -f CMakeFiles/revisiontag.dir/build.make CMakeFiles/revisiontag.dir/build make[2]: Entering directory '/tmp/B.mOiIJG/BUILD/domoticz-2020.2/build' /usr/bin/cmake -DSOURCE_DIR=/tmp/B.mOiIJG/BUILD/domoticz-2020.2 -P /tmp/B.mOiIJG/BUILD/domoticz-2020.2/getgit.cmake -- Could NOT find Git (missing: GIT_EXECUTABLE) CMake Error at /tmp/B.mOiIJG/BUILD/domoticz-2020.2/getgit.cmake:7 (MESSAGE): Git not found!. make[2]: *** [CMakeFiles/revisiontag.dir/build.make:80: revisiontag] Error 1 make[2]: Leaving directory '/tmp/B.mOiIJG/BUILD/domoticz-2020.2/build' make[1]: *** [CMakeFiles/Makefile2:101: CMakeFiles/revisiontag.dir/all] Error 2 make: *** [Makefile:175: all] Error 2 error: Bad exit status from /tmp/B.mOiIJG/BUILD/tmp/rpm-tmp.87773 (%build) RPM build errors: Bad exit status from /tmp/B.mOiIJG/BUILD/tmp/rpm-tmp.87773 (%build) ended at: Sat Jun 6 12:11:53 2020, done in 0:00:03.532201 error: No files produced. + chmod -R u+rwX /tmp/B.mOiIJG/BUILD + rm -rf /tmp/B.mOiIJG/tmp /tmp/B.mOiIJG/BUILD + rm -rf /tmp/B.mOiIJG Begin-PLD-Builder-Info Build-Time: user:3.13s sys:1.10s real:7.28s (faults io:0 non-io:256037) End-PLD-Builder-Info
[Back to list of logs] [View rpm -qa of builder]