FailedOk

th/SRPMS[OK]
th/x32[OK]
th/i686[OK]
th/x86_64[OK]

ac/SRPMS[OK]
ac/i386[OK]
ac/i586[OK]
ac/i686[OK]
ac/alpha[OK]
ac/amd64[OK]
ac/athlon[OK]
ac/ppc[OK]
ac/sparc[OK]
ac/sparc64[OK]

Advanced Search
main()
Powered by PLD Linux
(c) 2002-2020 PLD Team
$Revision: 1.37 $
Powered by achelon.
Your IP: 3.235.239.156

domoticz b646d4b7-cde7-430d-8b92-df43afacae35

Status:Failed
Source URL:https://buildlogs.pld-linux.org/pld/th/x32/FAIL/domoticz,b646d4b7-cde7-430d-8b92-df43afacae35.bz2
text/plain URL:View!
full text:View!
rpm -qa of builder:View!
Date:2020/06/06 12:21:35
Runtime:0:00:03.483052

Toc:

  • error 1
  • make[2]: *** [CMakeFiles/revisiontag.dir/build.make:80: revisiontag] Error 1
  • error 2
  • make[1]: *** [CMakeFiles/Makefile2:101: CMakeFiles/revisiontag.dir/all] Error 2
  • error 3
  • error: Bad exit status from /tmp/B.FU3GvQ/BUILD/tmp/rpm-tmp.60159 (%build)
  • error 4
  • RPM build errors:
  • error 5
  • error: No files produced.

Content:

-- Looking for sys/types.h - found
-- Looking for stdint.h
-- Looking for stdint.h - found
-- Looking for stddef.h
-- Looking for stddef.h - found
-- Check size of unsigned short
-- Check size of unsigned short - done
-- Searching 16 bit integer - Using unsigned short
-- Check if the system is big endian - little endian
-- Found PkgConfig: /usr/bin/pkg-config (found version "0.29.2") 
-- Checking for module 'jsoncpp'
--   Found jsoncpp, version 1.8.4
-- JSONCPP includes found at: /usr/include/jsoncpp
-- MQTT includes found at: /usr/include
-- Found SQLite3: /usr/include (found version "3.32.2") 
-- SQLite library found at: /usr/libx32/libsqlite3.so
-- SQLite includes found at: /usr/include
-- Checking for module 'minizip'
--   Found minizip, version 1.2.11
-- MINIZIP includes found at: /usr/include/minizip
-- Found OpenSSL: /usr/libx32/libcrypto.so (found version "1.1.1g")  
-- OPENSSL library found at: /usr/libx32/libssl.so;/usr/libx32/libcrypto.so
-- Linking against boost dynamic libraries
-- Looking for pthread.h
-- Looking for pthread.h - found
-- Performing Test CMAKE_HAVE_LIBC_PTHREAD
-- Performing Test CMAKE_HAVE_LIBC_PTHREAD - Failed
-- Looking for pthread_create in pthreads
-- Looking for pthread_create in pthreads - not found
-- Looking for pthread_create in pthread
-- Looking for pthread_create in pthread - found
-- Found Threads: TRUE  
-- Found Boost: /usr/include (found version "1.71.0") found components: thread system chrono date_time atomic 
-- BOOST includes found at: /usr/include
-- Found ZLIB: /usr/libx32/libz.so (found version "1.2.11") 
-- ZLIB library found at: /usr/libx32/libz.so
-- ZLIB includes found at: /usr/include
-- Found CURL: /usr/libx32/libcurl.so (found version "7.69.1")  
-- Curl library found at: /usr/libx32/libcurl.so
-- Curl includes found at: /usr/include
-- CEREAL includes found at: /usr/include
-- Found LIBUSB: /usr/libx32/libusb.so  
-- LIBUSB library found at: /usr/libx32/libusb.so
-- TinyXML found at: tinyxml
-- TinyXPath found
-- Checking for module 'libopenzwave'
--   Found libopenzwave, version 1.6
-- ==== OpenZWave package found!
-- OpenZWavelibraryfoundat:/usr/libx32/libopenzwave.so
-- OpenZWave library found at: /usr/libx32/libopenzwave.so
-- OpenZWave includes found at: /usr/include/openzwave//
-- GPIO is not available
-- Not found telldus-core (telldus-core.h), not adding tellstick support
-- Using precompiled headers
-- Using dynamic libgcc_s/libstdc++
-- Configuring done
-- Generating done
CMake Warning:
  Manually-specified variables were not used by the project:

    CMAKE_Fortran_FLAGS_PLD
    CMAKE_INSTALL_BINDIR
    CMAKE_INSTALL_DATADIR
    CMAKE_INSTALL_DATAROOTDIR
    CMAKE_INSTALL_DOCDIR
    CMAKE_INSTALL_INCLUDEDIR
    CMAKE_INSTALL_INFODIR
    CMAKE_INSTALL_LIBDIR
    CMAKE_INSTALL_LIBEXECDIR
    CMAKE_INSTALL_LOCALEDIR
    CMAKE_INSTALL_LOCALSTATEDIRPATH
    CMAKE_INSTALL_MANDIR
    CMAKE_INSTALL_OLDINCLUDEDIR
    CMAKE_INSTALL_SBINDIR
    CMAKE_INSTALL_SHAREDSTATEDIRPATH
    CMAKE_INSTALL_SYSCONFDIR
    LIB_SUFFIX
    SYSCONF_INSTALL_DIR
    USE_BUILTIN_LUA


-- Build files have been written to: /tmp/B.FU3GvQ/BUILD/domoticz-2020.2/build
+ /usr/bin/make -Otarget -j9
/usr/bin/cmake -S/tmp/B.FU3GvQ/BUILD/domoticz-2020.2 -B/tmp/B.FU3GvQ/BUILD/domoticz-2020.2/build --check-build-system CMakeFiles/Makefile.cmake 0
/usr/bin/cmake -E cmake_progress_start /tmp/B.FU3GvQ/BUILD/domoticz-2020.2/build/CMakeFiles /tmp/B.FU3GvQ/BUILD/domoticz-2020.2/build/CMakeFiles/progress.marks
/usr/bin/make  -f CMakeFiles/Makefile2 all
/usr/bin/make  -f CMakeFiles/revisiontag.dir/build.make CMakeFiles/revisiontag.dir/depend
make[2]: Entering directory '/tmp/B.FU3GvQ/BUILD/domoticz-2020.2/build'
cd /tmp/B.FU3GvQ/BUILD/domoticz-2020.2/build && /usr/bin/cmake -E cmake_depends "Unix Makefiles" /tmp/B.FU3GvQ/BUILD/domoticz-2020.2 /tmp/B.FU3GvQ/BUILD/domoticz-2020.2 /tmp/B.FU3GvQ/BUILD/domoticz-2020.2/build /tmp/B.FU3GvQ/BUILD/domoticz-2020.2/build /tmp/B.FU3GvQ/BUILD/domoticz-2020.2/build/CMakeFiles/revisiontag.dir/DependInfo.cmake --color=
Scanning dependencies of target revisiontag
make[2]: Leaving directory '/tmp/B.FU3GvQ/BUILD/domoticz-2020.2/build'
/usr/bin/make  -f CMakeFiles/revisiontag.dir/build.make CMakeFiles/revisiontag.dir/build
make[2]: Entering directory '/tmp/B.FU3GvQ/BUILD/domoticz-2020.2/build'
/usr/bin/cmake -DSOURCE_DIR=/tmp/B.FU3GvQ/BUILD/domoticz-2020.2 -P /tmp/B.FU3GvQ/BUILD/domoticz-2020.2/getgit.cmake
-- Could NOT find Git (missing: GIT_EXECUTABLE) 
CMake Error at /tmp/B.FU3GvQ/BUILD/domoticz-2020.2/getgit.cmake:7 (MESSAGE):
  Git not found!.


make[2]: *** [CMakeFiles/revisiontag.dir/build.make:80: revisiontag] Error 1
make[2]: Leaving directory '/tmp/B.FU3GvQ/BUILD/domoticz-2020.2/build'
make[1]: *** [CMakeFiles/Makefile2:101: CMakeFiles/revisiontag.dir/all] Error 2
make: *** [Makefile:175: all] Error 2
error: Bad exit status from /tmp/B.FU3GvQ/BUILD/tmp/rpm-tmp.60159 (%build)


RPM build errors:
    Bad exit status from /tmp/B.FU3GvQ/BUILD/tmp/rpm-tmp.60159 (%build)
ended at: Sat Jun  6 12:21:35 2020, done in 0:00:03.483052
error: No files produced.
+ chmod -R u+rwX /tmp/B.FU3GvQ/BUILD
+ rm -rf /tmp/B.FU3GvQ/tmp /tmp/B.FU3GvQ/BUILD
+ rm -rf /tmp/B.FU3GvQ
Begin-PLD-Builder-Info
Build-Time: user:3.76s sys:0.97s real:8.33s (faults io:0 non-io:255190)

End-PLD-Builder-Info
[Back to list of logs] [View rpm -qa of builder]