FailedOk

th/SRPMS[OK]
th/x32[OK]
th/i686[OK]
th/x86_64[OK]

ac/SRPMS[OK]
ac/i386[OK]
ac/i586[OK]
ac/i686[OK]
ac/alpha[OK]
ac/amd64[OK]
ac/athlon[OK]
ac/ppc[OK]
ac/sparc[OK]
ac/sparc64[OK]

Advanced Search
main()
Powered by PLD Linux
(c) 2002-2020 PLD Team
$Revision: 1.37 $
Powered by VAX.
Your IP: 34.200.218.187

domoticz f121da83-bf0d-493b-9ef6-f9c58a18934f

Status:Failed
Source URL:https://buildlogs.pld-linux.org/pld/th/x32/FAIL/domoticz,f121da83-bf0d-493b-9ef6-f9c58a18934f.bz2
text/plain URL:View!
full text:View!
rpm -qa of builder:View!
Date:2020/08/01 10:36:31
Runtime:0:02:08.893496

Toc:

  • error 1
  • /tmp/B.gZVIjh/BUILD/domoticz-2020.2/push/FibaroPush.cpp:26:107: error: '_1' was not declared in this scope
  • error 2
  • /tmp/B.gZVIjh/BUILD/domoticz-2020.2/push/FibaroPush.cpp:26:111: error: '_2' was not declared in this scope
  • error 3
  • /tmp/B.gZVIjh/BUILD/domoticz-2020.2/push/FibaroPush.cpp:26:115: error: '_3' was not declared in this scope
  • error 4
  • /tmp/B.gZVIjh/BUILD/domoticz-2020.2/push/FibaroPush.cpp:26:119: error: '_4' was not declared in this scope
  • error 5
  • make[2]: *** [CMakeFiles/domoticz.dir/build.make:582: CMakeFiles/domoticz.dir/push/FibaroPush.cpp.o] Error 1
  • error 6
  • /tmp/B.gZVIjh/BUILD/domoticz-2020.2/push/GooglePubSubPush.cpp:42:113: error: '_1' was not declared in this scope
  • error 7
  • /tmp/B.gZVIjh/BUILD/domoticz-2020.2/push/GooglePubSubPush.cpp:42:117: error: '_2' was not declared in this scope
  • error 8
  • /tmp/B.gZVIjh/BUILD/domoticz-2020.2/push/GooglePubSubPush.cpp:42:121: error: '_3' was not declared in this scope
  • error 9
  • /tmp/B.gZVIjh/BUILD/domoticz-2020.2/push/GooglePubSubPush.cpp:42:125: error: '_4' was not declared in this scope
  • error 10
  • make[2]: *** [CMakeFiles/domoticz.dir/build.make:597: CMakeFiles/domoticz.dir/push/GooglePubSubPush.cpp.o] Error 1
  • error 11
  • make[1]: *** [CMakeFiles/Makefile2:128: CMakeFiles/domoticz.dir/all] Error 2
  • error 12
  • error: Bad exit status from /tmp/B.gZVIjh/BUILD/tmp/rpm-tmp.90643 (%build)
  • error 13
  • RPM build errors:
  • error 14
  • error: No files produced.

Content:

[  1%] Building CXX object CMakeFiles/domoticz.dir/main/BaroForecastCalculator.cpp.o
/usr/bin/x86_64-pld-linux-gnux32-g++  -DENABLE_PYTHON -DHAVE_EXECINFO_H -DHAVE_LINUX_I2C -DHAVE_LINUX_SPI -DWITH_EXTERNAL_TINYXPATH -DWITH_LIBUSB -DWITH_OPENZWAVE -DWITH_TLS -DWWW_ENABLE_SSL -I/usr/include/lua5.3 -I/usr/include/python3.8 -I/tmp/B.gZVIjh/BUILD/domoticz-2020.2/main -I/usr/include/jsoncpp -I/usr/include/minizip -I/usr/include/tinyxpath -I/usr/include/openzwave  -std=c++11 -Wno-psabi -rdynamic -O2 -fwrapv -pipe -Wformat -Werror=format-security -gdwarf-4 -fno-debug-types-section -fvar-tracking-assignments -g2 -Wp,-D_FORTIFY_SOURCE=2 -fstack-protector-strong --param=ssp-buffer-size=4 -Werror=trampolines -fPIC -mtune=generic -march=x86-64 -gdwarf-4 -fno-debug-types-section -fvar-tracking-assignments -g2  -DNDEBUG -DQT_NO_DEBUG   -Winvalid-pch -include /tmp/B.gZVIjh/BUILD/domoticz-2020.2/build/CMakeFiles/domoticz.dir/cmake_pch.hxx -o CMakeFiles/domoticz.dir/main/BaroForecastCalculator.cpp.o -c /tmp/B.gZVIjh/BUILD/domoticz-2020.2/main/BaroForecastCalculator.cpp
make[2]: Leaving directory '/tmp/B.gZVIjh/BUILD/domoticz-2020.2/build'
make[2]: Entering directory '/tmp/B.gZVIjh/BUILD/domoticz-2020.2/build'
[  1%] Building CXX object CMakeFiles/domoticz.dir/main/CmdLine.cpp.o
/usr/bin/x86_64-pld-linux-gnux32-g++  -DENABLE_PYTHON -DHAVE_EXECINFO_H -DHAVE_LINUX_I2C -DHAVE_LINUX_SPI -DWITH_EXTERNAL_TINYXPATH -DWITH_LIBUSB -DWITH_OPENZWAVE -DWITH_TLS -DWWW_ENABLE_SSL -I/usr/include/lua5.3 -I/usr/include/python3.8 -I/tmp/B.gZVIjh/BUILD/domoticz-2020.2/main -I/usr/include/jsoncpp -I/usr/include/minizip -I/usr/include/tinyxpath -I/usr/include/openzwave  -std=c++11 -Wno-psabi -rdynamic -O2 -fwrapv -pipe -Wformat -Werror=format-security -gdwarf-4 -fno-debug-types-section -fvar-tracking-assignments -g2 -Wp,-D_FORTIFY_SOURCE=2 -fstack-protector-strong --param=ssp-buffer-size=4 -Werror=trampolines -fPIC -mtune=generic -march=x86-64 -gdwarf-4 -fno-debug-types-section -fvar-tracking-assignments -g2  -DNDEBUG -DQT_NO_DEBUG   -Winvalid-pch -include /tmp/B.gZVIjh/BUILD/domoticz-2020.2/build/CMakeFiles/domoticz.dir/cmake_pch.hxx -o CMakeFiles/domoticz.dir/main/CmdLine.cpp.o -c /tmp/B.gZVIjh/BUILD/domoticz-2020.2/main/CmdLine.cpp
make[2]: Leaving directory '/tmp/B.gZVIjh/BUILD/domoticz-2020.2/build'
make[2]: Entering directory '/tmp/B.gZVIjh/BUILD/domoticz-2020.2/build'
[  5%] Building CXX object CMakeFiles/domoticz.dir/main/HTMLSanitizer.cpp.o
/usr/bin/x86_64-pld-linux-gnux32-g++  -DENABLE_PYTHON -DHAVE_EXECINFO_H -DHAVE_LINUX_I2C -DHAVE_LINUX_SPI -DWITH_EXTERNAL_TINYXPATH -DWITH_LIBUSB -DWITH_OPENZWAVE -DWITH_TLS -DWWW_ENABLE_SSL -I/usr/include/lua5.3 -I/usr/include/python3.8 -I/tmp/B.gZVIjh/BUILD/domoticz-2020.2/main -I/usr/include/jsoncpp -I/usr/include/minizip -I/usr/include/tinyxpath -I/usr/include/openzwave  -std=c++11 -Wno-psabi -rdynamic -O2 -fwrapv -pipe -Wformat -Werror=format-security -gdwarf-4 -fno-debug-types-section -fvar-tracking-assignments -g2 -Wp,-D_FORTIFY_SOURCE=2 -fstack-protector-strong --param=ssp-buffer-size=4 -Werror=trampolines -fPIC -mtune=generic -march=x86-64 -gdwarf-4 -fno-debug-types-section -fvar-tracking-assignments -g2  -DNDEBUG -DQT_NO_DEBUG   -Winvalid-pch -include /tmp/B.gZVIjh/BUILD/domoticz-2020.2/build/CMakeFiles/domoticz.dir/cmake_pch.hxx -o CMakeFiles/domoticz.dir/main/HTMLSanitizer.cpp.o -c /tmp/B.gZVIjh/BUILD/domoticz-2020.2/main/HTMLSanitizer.cpp
make[2]: Leaving directory '/tmp/B.gZVIjh/BUILD/domoticz-2020.2/build'
make[2]: Entering directory '/tmp/B.gZVIjh/BUILD/domoticz-2020.2/build'
[  4%] Building CXX object CMakeFiles/domoticz.dir/main/EventsPythonDevice.cpp.o
/usr/bin/x86_64-pld-linux-gnux32-g++  -DENABLE_PYTHON -DHAVE_EXECINFO_H -DHAVE_LINUX_I2C -DHAVE_LINUX_SPI -DWITH_EXTERNAL_TINYXPATH -DWITH_LIBUSB -DWITH_OPENZWAVE -DWITH_TLS -DWWW_ENABLE_SSL -I/usr/include/lua5.3 -I/usr/include/python3.8 -I/tmp/B.gZVIjh/BUILD/domoticz-2020.2/main -I/usr/include/jsoncpp -I/usr/include/minizip -I/usr/include/tinyxpath -I/usr/include/openzwave  -std=c++11 -Wno-psabi -rdynamic -O2 -fwrapv -pipe -Wformat -Werror=format-security -gdwarf-4 -fno-debug-types-section -fvar-tracking-assignments -g2 -Wp,-D_FORTIFY_SOURCE=2 -fstack-protector-strong --param=ssp-buffer-size=4 -Werror=trampolines -fPIC -mtune=generic -march=x86-64 -gdwarf-4 -fno-debug-types-section -fvar-tracking-assignments -g2  -DNDEBUG -DQT_NO_DEBUG   -Winvalid-pch -include /tmp/B.gZVIjh/BUILD/domoticz-2020.2/build/CMakeFiles/domoticz.dir/cmake_pch.hxx -o CMakeFiles/domoticz.dir/main/EventsPythonDevice.cpp.o -c /tmp/B.gZVIjh/BUILD/domoticz-2020.2/main/EventsPythonDevice.cpp
make[2]: Leaving directory '/tmp/B.gZVIjh/BUILD/domoticz-2020.2/build'
make[2]: Entering directory '/tmp/B.gZVIjh/BUILD/domoticz-2020.2/build'
[  6%] Building CXX object CMakeFiles/domoticz.dir/main/json_helper.cpp.o
/usr/bin/x86_64-pld-linux-gnux32-g++  -DENABLE_PYTHON -DHAVE_EXECINFO_H -DHAVE_LINUX_I2C -DHAVE_LINUX_SPI -DWITH_EXTERNAL_TINYXPATH -DWITH_LIBUSB -DWITH_OPENZWAVE -DWITH_TLS -DWWW_ENABLE_SSL -I/usr/include/lua5.3 -I/usr/include/python3.8 -I/tmp/B.gZVIjh/BUILD/domoticz-2020.2/main -I/usr/include/jsoncpp -I/usr/include/minizip -I/usr/include/tinyxpath -I/usr/include/openzwave  -std=c++11 -Wno-psabi -rdynamic -O2 -fwrapv -pipe -Wformat -Werror=format-security -gdwarf-4 -fno-debug-types-section -fvar-tracking-assignments -g2 -Wp,-D_FORTIFY_SOURCE=2 -fstack-protector-strong --param=ssp-buffer-size=4 -Werror=trampolines -fPIC -mtune=generic -march=x86-64 -gdwarf-4 -fno-debug-types-section -fvar-tracking-assignments -g2  -DNDEBUG -DQT_NO_DEBUG   -Winvalid-pch -include /tmp/B.gZVIjh/BUILD/domoticz-2020.2/build/CMakeFiles/domoticz.dir/cmake_pch.hxx -o CMakeFiles/domoticz.dir/main/json_helper.cpp.o -c /tmp/B.gZVIjh/BUILD/domoticz-2020.2/main/json_helper.cpp
make[2]: Leaving directory '/tmp/B.gZVIjh/BUILD/domoticz-2020.2/build'
make[2]: Entering directory '/tmp/B.gZVIjh/BUILD/domoticz-2020.2/build'
[  5%] Building CXX object CMakeFiles/domoticz.dir/main/IFTTT.cpp.o
/usr/bin/x86_64-pld-linux-gnux32-g++  -DENABLE_PYTHON -DHAVE_EXECINFO_H -DHAVE_LINUX_I2C -DHAVE_LINUX_SPI -DWITH_EXTERNAL_TINYXPATH -DWITH_LIBUSB -DWITH_OPENZWAVE -DWITH_TLS -DWWW_ENABLE_SSL -I/usr/include/lua5.3 -I/usr/include/python3.8 -I/tmp/B.gZVIjh/BUILD/domoticz-2020.2/main -I/usr/include/jsoncpp -I/usr/include/minizip -I/usr/include/tinyxpath -I/usr/include/openzwave  -std=c++11 -Wno-psabi -rdynamic -O2 -fwrapv -pipe -Wformat -Werror=format-security -gdwarf-4 -fno-debug-types-section -fvar-tracking-assignments -g2 -Wp,-D_FORTIFY_SOURCE=2 -fstack-protector-strong --param=ssp-buffer-size=4 -Werror=trampolines -fPIC -mtune=generic -march=x86-64 -gdwarf-4 -fno-debug-types-section -fvar-tracking-assignments -g2  -DNDEBUG -DQT_NO_DEBUG   -Winvalid-pch -include /tmp/B.gZVIjh/BUILD/domoticz-2020.2/build/CMakeFiles/domoticz.dir/cmake_pch.hxx -o CMakeFiles/domoticz.dir/main/IFTTT.cpp.o -c /tmp/B.gZVIjh/BUILD/domoticz-2020.2/main/IFTTT.cpp
make[2]: Leaving directory '/tmp/B.gZVIjh/BUILD/domoticz-2020.2/build'
make[2]: Entering directory '/tmp/B.gZVIjh/BUILD/domoticz-2020.2/build'
[  6%] Building CXX object CMakeFiles/domoticz.dir/main/localtime_r.cpp.o
/usr/bin/x86_64-pld-linux-gnux32-g++  -DENABLE_PYTHON -DHAVE_EXECINFO_H -DHAVE_LINUX_I2C -DHAVE_LINUX_SPI -DWITH_EXTERNAL_TINYXPATH -DWITH_LIBUSB -DWITH_OPENZWAVE -DWITH_TLS -DWWW_ENABLE_SSL -I/usr/include/lua5.3 -I/usr/include/python3.8 -I/tmp/B.gZVIjh/BUILD/domoticz-2020.2/main -I/usr/include/jsoncpp -I/usr/include/minizip -I/usr/include/tinyxpath -I/usr/include/openzwave  -std=c++11 -Wno-psabi -rdynamic -O2 -fwrapv -pipe -Wformat -Werror=format-security -gdwarf-4 -fno-debug-types-section -fvar-tracking-assignments -g2 -Wp,-D_FORTIFY_SOURCE=2 -fstack-protector-strong --param=ssp-buffer-size=4 -Werror=trampolines -fPIC -mtune=generic -march=x86-64 -gdwarf-4 -fno-debug-types-section -fvar-tracking-assignments -g2  -DNDEBUG -DQT_NO_DEBUG   -Winvalid-pch -include /tmp/B.gZVIjh/BUILD/domoticz-2020.2/build/CMakeFiles/domoticz.dir/cmake_pch.hxx -o CMakeFiles/domoticz.dir/main/localtime_r.cpp.o -c /tmp/B.gZVIjh/BUILD/domoticz-2020.2/main/localtime_r.cpp
make[2]: Leaving directory '/tmp/B.gZVIjh/BUILD/domoticz-2020.2/build'
make[2]: Entering directory '/tmp/B.gZVIjh/BUILD/domoticz-2020.2/build'
[  4%] Building CXX object CMakeFiles/domoticz.dir/main/Helper.cpp.o
/usr/bin/x86_64-pld-linux-gnux32-g++  -DENABLE_PYTHON -DHAVE_EXECINFO_H -DHAVE_LINUX_I2C -DHAVE_LINUX_SPI -DWITH_EXTERNAL_TINYXPATH -DWITH_LIBUSB -DWITH_OPENZWAVE -DWITH_TLS -DWWW_ENABLE_SSL -I/usr/include/lua5.3 -I/usr/include/python3.8 -I/tmp/B.gZVIjh/BUILD/domoticz-2020.2/main -I/usr/include/jsoncpp -I/usr/include/minizip -I/usr/include/tinyxpath -I/usr/include/openzwave  -std=c++11 -Wno-psabi -rdynamic -O2 -fwrapv -pipe -Wformat -Werror=format-security -gdwarf-4 -fno-debug-types-section -fvar-tracking-assignments -g2 -Wp,-D_FORTIFY_SOURCE=2 -fstack-protector-strong --param=ssp-buffer-size=4 -Werror=trampolines -fPIC -mtune=generic -march=x86-64 -gdwarf-4 -fno-debug-types-section -fvar-tracking-assignments -g2  -DNDEBUG -DQT_NO_DEBUG   -Winvalid-pch -include /tmp/B.gZVIjh/BUILD/domoticz-2020.2/build/CMakeFiles/domoticz.dir/cmake_pch.hxx -o CMakeFiles/domoticz.dir/main/Helper.cpp.o -c /tmp/B.gZVIjh/BUILD/domoticz-2020.2/main/Helper.cpp
make[2]: Leaving directory '/tmp/B.gZVIjh/BUILD/domoticz-2020.2/build'
make[2]: Entering directory '/tmp/B.gZVIjh/BUILD/domoticz-2020.2/build'
[  8%] Building CXX object CMakeFiles/domoticz.dir/main/LuaTable.cpp.o
/usr/bin/x86_64-pld-linux-gnux32-g++  -DENABLE_PYTHON -DHAVE_EXECINFO_H -DHAVE_LINUX_I2C -DHAVE_LINUX_SPI -DWITH_EXTERNAL_TINYXPATH -DWITH_LIBUSB -DWITH_OPENZWAVE -DWITH_TLS -DWWW_ENABLE_SSL -I/usr/include/lua5.3 -I/usr/include/python3.8 -I/tmp/B.gZVIjh/BUILD/domoticz-2020.2/main -I/usr/include/jsoncpp -I/usr/include/minizip -I/usr/include/tinyxpath -I/usr/include/openzwave  -std=c++11 -Wno-psabi -rdynamic -O2 -fwrapv -pipe -Wformat -Werror=format-security -gdwarf-4 -fno-debug-types-section -fvar-tracking-assignments -g2 -Wp,-D_FORTIFY_SOURCE=2 -fstack-protector-strong --param=ssp-buffer-size=4 -Werror=trampolines -fPIC -mtune=generic -march=x86-64 -gdwarf-4 -fno-debug-types-section -fvar-tracking-assignments -g2  -DNDEBUG -DQT_NO_DEBUG   -Winvalid-pch -include /tmp/B.gZVIjh/BUILD/domoticz-2020.2/build/CMakeFiles/domoticz.dir/cmake_pch.hxx -o CMakeFiles/domoticz.dir/main/LuaTable.cpp.o -c /tmp/B.gZVIjh/BUILD/domoticz-2020.2/main/LuaTable.cpp
make[2]: Leaving directory '/tmp/B.gZVIjh/BUILD/domoticz-2020.2/build'
make[2]: Entering directory '/tmp/B.gZVIjh/BUILD/domoticz-2020.2/build'
[  3%] Building CXX object CMakeFiles/domoticz.dir/main/EventsPythonModule.cpp.o
/usr/bin/x86_64-pld-linux-gnux32-g++  -DENABLE_PYTHON -DHAVE_EXECINFO_H -DHAVE_LINUX_I2C -DHAVE_LINUX_SPI -DWITH_EXTERNAL_TINYXPATH -DWITH_LIBUSB -DWITH_OPENZWAVE -DWITH_TLS -DWWW_ENABLE_SSL -I/usr/include/lua5.3 -I/usr/include/python3.8 -I/tmp/B.gZVIjh/BUILD/domoticz-2020.2/main -I/usr/include/jsoncpp -I/usr/include/minizip -I/usr/include/tinyxpath -I/usr/include/openzwave  -std=c++11 -Wno-psabi -rdynamic -O2 -fwrapv -pipe -Wformat -Werror=format-security -gdwarf-4 -fno-debug-types-section -fvar-tracking-assignments -g2 -Wp,-D_FORTIFY_SOURCE=2 -fstack-protector-strong --param=ssp-buffer-size=4 -Werror=trampolines -fPIC -mtune=generic -march=x86-64 -gdwarf-4 -fno-debug-types-section -fvar-tracking-assignments -g2  -DNDEBUG -DQT_NO_DEBUG   -Winvalid-pch -include /tmp/B.gZVIjh/BUILD/domoticz-2020.2/build/CMakeFiles/domoticz.dir/cmake_pch.hxx -o CMakeFiles/domoticz.dir/main/EventsPythonModule.cpp.o -c /tmp/B.gZVIjh/BUILD/domoticz-2020.2/main/EventsPythonModule.cpp
make[2]: Leaving directory '/tmp/B.gZVIjh/BUILD/domoticz-2020.2/build'
make[2]: Entering directory '/tmp/B.gZVIjh/BUILD/domoticz-2020.2/build'
[  9%] Building CXX object CMakeFiles/domoticz.dir/main/mosquitto_helper.cpp.o
/usr/bin/x86_64-pld-linux-gnux32-g++  -DENABLE_PYTHON -DHAVE_EXECINFO_H -DHAVE_LINUX_I2C -DHAVE_LINUX_SPI -DWITH_EXTERNAL_TINYXPATH -DWITH_LIBUSB -DWITH_OPENZWAVE -DWITH_TLS -DWWW_ENABLE_SSL -I/usr/include/lua5.3 -I/usr/include/python3.8 -I/tmp/B.gZVIjh/BUILD/domoticz-2020.2/main -I/usr/include/jsoncpp -I/usr/include/minizip -I/usr/include/tinyxpath -I/usr/include/openzwave  -std=c++11 -Wno-psabi -rdynamic -O2 -fwrapv -pipe -Wformat -Werror=format-security -gdwarf-4 -fno-debug-types-section -fvar-tracking-assignments -g2 -Wp,-D_FORTIFY_SOURCE=2 -fstack-protector-strong --param=ssp-buffer-size=4 -Werror=trampolines -fPIC -mtune=generic -march=x86-64 -gdwarf-4 -fno-debug-types-section -fvar-tracking-assignments -g2  -DNDEBUG -DQT_NO_DEBUG   -Winvalid-pch -include /tmp/B.gZVIjh/BUILD/domoticz-2020.2/build/CMakeFiles/domoticz.dir/cmake_pch.hxx -o CMakeFiles/domoticz.dir/main/mosquitto_helper.cpp.o -c /tmp/B.gZVIjh/BUILD/domoticz-2020.2/main/mosquitto_helper.cpp
make[2]: Leaving directory '/tmp/B.gZVIjh/BUILD/domoticz-2020.2/build'
make[2]: Entering directory '/tmp/B.gZVIjh/BUILD/domoticz-2020.2/build'
[  9%] Building CXX object CMakeFiles/domoticz.dir/main/NotificationObserver.cpp.o
/usr/bin/x86_64-pld-linux-gnux32-g++  -DENABLE_PYTHON -DHAVE_EXECINFO_H -DHAVE_LINUX_I2C -DHAVE_LINUX_SPI -DWITH_EXTERNAL_TINYXPATH -DWITH_LIBUSB -DWITH_OPENZWAVE -DWITH_TLS -DWWW_ENABLE_SSL -I/usr/include/lua5.3 -I/usr/include/python3.8 -I/tmp/B.gZVIjh/BUILD/domoticz-2020.2/main -I/usr/include/jsoncpp -I/usr/include/minizip -I/usr/include/tinyxpath -I/usr/include/openzwave  -std=c++11 -Wno-psabi -rdynamic -O2 -fwrapv -pipe -Wformat -Werror=format-security -gdwarf-4 -fno-debug-types-section -fvar-tracking-assignments -g2 -Wp,-D_FORTIFY_SOURCE=2 -fstack-protector-strong --param=ssp-buffer-size=4 -Werror=trampolines -fPIC -mtune=generic -march=x86-64 -gdwarf-4 -fno-debug-types-section -fvar-tracking-assignments -g2  -DNDEBUG -DQT_NO_DEBUG   -Winvalid-pch -include /tmp/B.gZVIjh/BUILD/domoticz-2020.2/build/CMakeFiles/domoticz.dir/cmake_pch.hxx -o CMakeFiles/domoticz.dir/main/NotificationObserver.cpp.o -c /tmp/B.gZVIjh/BUILD/domoticz-2020.2/main/NotificationObserver.cpp
make[2]: Leaving directory '/tmp/B.gZVIjh/BUILD/domoticz-2020.2/build'
make[2]: Entering directory '/tmp/B.gZVIjh/BUILD/domoticz-2020.2/build'
[  7%] Building CXX object CMakeFiles/domoticz.dir/main/LuaCommon.cpp.o
/usr/bin/x86_64-pld-linux-gnux32-g++  -DENABLE_PYTHON -DHAVE_EXECINFO_H -DHAVE_LINUX_I2C -DHAVE_LINUX_SPI -DWITH_EXTERNAL_TINYXPATH -DWITH_LIBUSB -DWITH_OPENZWAVE -DWITH_TLS -DWWW_ENABLE_SSL -I/usr/include/lua5.3 -I/usr/include/python3.8 -I/tmp/B.gZVIjh/BUILD/domoticz-2020.2/main -I/usr/include/jsoncpp -I/usr/include/minizip -I/usr/include/tinyxpath -I/usr/include/openzwave  -std=c++11 -Wno-psabi -rdynamic -O2 -fwrapv -pipe -Wformat -Werror=format-security -gdwarf-4 -fno-debug-types-section -fvar-tracking-assignments -g2 -Wp,-D_FORTIFY_SOURCE=2 -fstack-protector-strong --param=ssp-buffer-size=4 -Werror=trampolines -fPIC -mtune=generic -march=x86-64 -gdwarf-4 -fno-debug-types-section -fvar-tracking-assignments -g2  -DNDEBUG -DQT_NO_DEBUG   -Winvalid-pch -include /tmp/B.gZVIjh/BUILD/domoticz-2020.2/build/CMakeFiles/domoticz.dir/cmake_pch.hxx -o CMakeFiles/domoticz.dir/main/LuaCommon.cpp.o -c /tmp/B.gZVIjh/BUILD/domoticz-2020.2/main/LuaCommon.cpp
make[2]: Leaving directory '/tmp/B.gZVIjh/BUILD/domoticz-2020.2/build'
make[2]: Entering directory '/tmp/B.gZVIjh/BUILD/domoticz-2020.2/build'
[  6%] Building CXX object CMakeFiles/domoticz.dir/main/Logger.cpp.o
/usr/bin/x86_64-pld-linux-gnux32-g++  -DENABLE_PYTHON -DHAVE_EXECINFO_H -DHAVE_LINUX_I2C -DHAVE_LINUX_SPI -DWITH_EXTERNAL_TINYXPATH -DWITH_LIBUSB -DWITH_OPENZWAVE -DWITH_TLS -DWWW_ENABLE_SSL -I/usr/include/lua5.3 -I/usr/include/python3.8 -I/tmp/B.gZVIjh/BUILD/domoticz-2020.2/main -I/usr/include/jsoncpp -I/usr/include/minizip -I/usr/include/tinyxpath -I/usr/include/openzwave  -std=c++11 -Wno-psabi -rdynamic -O2 -fwrapv -pipe -Wformat -Werror=format-security -gdwarf-4 -fno-debug-types-section -fvar-tracking-assignments -g2 -Wp,-D_FORTIFY_SOURCE=2 -fstack-protector-strong --param=ssp-buffer-size=4 -Werror=trampolines -fPIC -mtune=generic -march=x86-64 -gdwarf-4 -fno-debug-types-section -fvar-tracking-assignments -g2  -DNDEBUG -DQT_NO_DEBUG   -Winvalid-pch -include /tmp/B.gZVIjh/BUILD/domoticz-2020.2/build/CMakeFiles/domoticz.dir/cmake_pch.hxx -o CMakeFiles/domoticz.dir/main/Logger.cpp.o -c /tmp/B.gZVIjh/BUILD/domoticz-2020.2/main/Logger.cpp
make[2]: Leaving directory '/tmp/B.gZVIjh/BUILD/domoticz-2020.2/build'
make[2]: Entering directory '/tmp/B.gZVIjh/BUILD/domoticz-2020.2/build'
[  2%] Building CXX object CMakeFiles/domoticz.dir/main/Camera.cpp.o
/usr/bin/x86_64-pld-linux-gnux32-g++  -DENABLE_PYTHON -DHAVE_EXECINFO_H -DHAVE_LINUX_I2C -DHAVE_LINUX_SPI -DWITH_EXTERNAL_TINYXPATH -DWITH_LIBUSB -DWITH_OPENZWAVE -DWITH_TLS -DWWW_ENABLE_SSL -I/usr/include/lua5.3 -I/usr/include/python3.8 -I/tmp/B.gZVIjh/BUILD/domoticz-2020.2/main -I/usr/include/jsoncpp -I/usr/include/minizip -I/usr/include/tinyxpath -I/usr/include/openzwave  -std=c++11 -Wno-psabi -rdynamic -O2 -fwrapv -pipe -Wformat -Werror=format-security -gdwarf-4 -fno-debug-types-section -fvar-tracking-assignments -g2 -Wp,-D_FORTIFY_SOURCE=2 -fstack-protector-strong --param=ssp-buffer-size=4 -Werror=trampolines -fPIC -mtune=generic -march=x86-64 -gdwarf-4 -fno-debug-types-section -fvar-tracking-assignments -g2  -DNDEBUG -DQT_NO_DEBUG   -Winvalid-pch -include /tmp/B.gZVIjh/BUILD/domoticz-2020.2/build/CMakeFiles/domoticz.dir/cmake_pch.hxx -o CMakeFiles/domoticz.dir/main/Camera.cpp.o -c /tmp/B.gZVIjh/BUILD/domoticz-2020.2/main/Camera.cpp
make[2]: Leaving directory '/tmp/B.gZVIjh/BUILD/domoticz-2020.2/build'
make[2]: Entering directory '/tmp/B.gZVIjh/BUILD/domoticz-2020.2/build'
[  7%] Building CXX object CMakeFiles/domoticz.dir/main/LuaHandler.cpp.o
/usr/bin/x86_64-pld-linux-gnux32-g++  -DENABLE_PYTHON -DHAVE_EXECINFO_H -DHAVE_LINUX_I2C -DHAVE_LINUX_SPI -DWITH_EXTERNAL_TINYXPATH -DWITH_LIBUSB -DWITH_OPENZWAVE -DWITH_TLS -DWWW_ENABLE_SSL -I/usr/include/lua5.3 -I/usr/include/python3.8 -I/tmp/B.gZVIjh/BUILD/domoticz-2020.2/main -I/usr/include/jsoncpp -I/usr/include/minizip -I/usr/include/tinyxpath -I/usr/include/openzwave  -std=c++11 -Wno-psabi -rdynamic -O2 -fwrapv -pipe -Wformat -Werror=format-security -gdwarf-4 -fno-debug-types-section -fvar-tracking-assignments -g2 -Wp,-D_FORTIFY_SOURCE=2 -fstack-protector-strong --param=ssp-buffer-size=4 -Werror=trampolines -fPIC -mtune=generic -march=x86-64 -gdwarf-4 -fno-debug-types-section -fvar-tracking-assignments -g2  -DNDEBUG -DQT_NO_DEBUG   -Winvalid-pch -include /tmp/B.gZVIjh/BUILD/domoticz-2020.2/build/CMakeFiles/domoticz.dir/cmake_pch.hxx -o CMakeFiles/domoticz.dir/main/LuaHandler.cpp.o -c /tmp/B.gZVIjh/BUILD/domoticz-2020.2/main/LuaHandler.cpp
make[2]: Leaving directory '/tmp/B.gZVIjh/BUILD/domoticz-2020.2/build'
make[2]: Entering directory '/tmp/B.gZVIjh/BUILD/domoticz-2020.2/build'
[ 10%] Building CXX object CMakeFiles/domoticz.dir/main/RFXNames.cpp.o
/usr/bin/x86_64-pld-linux-gnux32-g++  -DENABLE_PYTHON -DHAVE_EXECINFO_H -DHAVE_LINUX_I2C -DHAVE_LINUX_SPI -DWITH_EXTERNAL_TINYXPATH -DWITH_LIBUSB -DWITH_OPENZWAVE -DWITH_TLS -DWWW_ENABLE_SSL -I/usr/include/lua5.3 -I/usr/include/python3.8 -I/tmp/B.gZVIjh/BUILD/domoticz-2020.2/main -I/usr/include/jsoncpp -I/usr/include/minizip -I/usr/include/tinyxpath -I/usr/include/openzwave  -std=c++11 -Wno-psabi -rdynamic -O2 -fwrapv -pipe -Wformat -Werror=format-security -gdwarf-4 -fno-debug-types-section -fvar-tracking-assignments -g2 -Wp,-D_FORTIFY_SOURCE=2 -fstack-protector-strong --param=ssp-buffer-size=4 -Werror=trampolines -fPIC -mtune=generic -march=x86-64 -gdwarf-4 -fno-debug-types-section -fvar-tracking-assignments -g2  -DNDEBUG -DQT_NO_DEBUG   -Winvalid-pch -include /tmp/B.gZVIjh/BUILD/domoticz-2020.2/build/CMakeFiles/domoticz.dir/cmake_pch.hxx -o CMakeFiles/domoticz.dir/main/RFXNames.cpp.o -c /tmp/B.gZVIjh/BUILD/domoticz-2020.2/main/RFXNames.cpp
make[2]: Leaving directory '/tmp/B.gZVIjh/BUILD/domoticz-2020.2/build'
make[2]: Entering directory '/tmp/B.gZVIjh/BUILD/domoticz-2020.2/build'
[ 12%] Building CXX object CMakeFiles/domoticz.dir/main/SunRiseSet.cpp.o
/usr/bin/x86_64-pld-linux-gnux32-g++  -DENABLE_PYTHON -DHAVE_EXECINFO_H -DHAVE_LINUX_I2C -DHAVE_LINUX_SPI -DWITH_EXTERNAL_TINYXPATH -DWITH_LIBUSB -DWITH_OPENZWAVE -DWITH_TLS -DWWW_ENABLE_SSL -I/usr/include/lua5.3 -I/usr/include/python3.8 -I/tmp/B.gZVIjh/BUILD/domoticz-2020.2/main -I/usr/include/jsoncpp -I/usr/include/minizip -I/usr/include/tinyxpath -I/usr/include/openzwave  -std=c++11 -Wno-psabi -rdynamic -O2 -fwrapv -pipe -Wformat -Werror=format-security -gdwarf-4 -fno-debug-types-section -fvar-tracking-assignments -g2 -Wp,-D_FORTIFY_SOURCE=2 -fstack-protector-strong --param=ssp-buffer-size=4 -Werror=trampolines -fPIC -mtune=generic -march=x86-64 -gdwarf-4 -fno-debug-types-section -fvar-tracking-assignments -g2  -DNDEBUG -DQT_NO_DEBUG   -Winvalid-pch -include /tmp/B.gZVIjh/BUILD/domoticz-2020.2/build/CMakeFiles/domoticz.dir/cmake_pch.hxx -o CMakeFiles/domoticz.dir/main/SunRiseSet.cpp.o -c /tmp/B.gZVIjh/BUILD/domoticz-2020.2/main/SunRiseSet.cpp
make[2]: Leaving directory '/tmp/B.gZVIjh/BUILD/domoticz-2020.2/build'
make[2]: Entering directory '/tmp/B.gZVIjh/BUILD/domoticz-2020.2/build'
[ 10%] Building CXX object CMakeFiles/domoticz.dir/main/NotificationSystem.cpp.o
/usr/bin/x86_64-pld-linux-gnux32-g++  -DENABLE_PYTHON -DHAVE_EXECINFO_H -DHAVE_LINUX_I2C -DHAVE_LINUX_SPI -DWITH_EXTERNAL_TINYXPATH -DWITH_LIBUSB -DWITH_OPENZWAVE -DWITH_TLS -DWWW_ENABLE_SSL -I/usr/include/lua5.3 -I/usr/include/python3.8 -I/tmp/B.gZVIjh/BUILD/domoticz-2020.2/main -I/usr/include/jsoncpp -I/usr/include/minizip -I/usr/include/tinyxpath -I/usr/include/openzwave  -std=c++11 -Wno-psabi -rdynamic -O2 -fwrapv -pipe -Wformat -Werror=format-security -gdwarf-4 -fno-debug-types-section -fvar-tracking-assignments -g2 -Wp,-D_FORTIFY_SOURCE=2 -fstack-protector-strong --param=ssp-buffer-size=4 -Werror=trampolines -fPIC -mtune=generic -march=x86-64 -gdwarf-4 -fno-debug-types-section -fvar-tracking-assignments -g2  -DNDEBUG -DQT_NO_DEBUG   -Winvalid-pch -include /tmp/B.gZVIjh/BUILD/domoticz-2020.2/build/CMakeFiles/domoticz.dir/cmake_pch.hxx -o CMakeFiles/domoticz.dir/main/NotificationSystem.cpp.o -c /tmp/B.gZVIjh/BUILD/domoticz-2020.2/main/NotificationSystem.cpp
make[2]: Leaving directory '/tmp/B.gZVIjh/BUILD/domoticz-2020.2/build'
make[2]: Entering directory '/tmp/B.gZVIjh/BUILD/domoticz-2020.2/build'
[ 12%] Building CXX object CMakeFiles/domoticz.dir/main/TrendCalculator.cpp.o
/usr/bin/x86_64-pld-linux-gnux32-g++  -DENABLE_PYTHON -DHAVE_EXECINFO_H -DHAVE_LINUX_I2C -DHAVE_LINUX_SPI -DWITH_EXTERNAL_TINYXPATH -DWITH_LIBUSB -DWITH_OPENZWAVE -DWITH_TLS -DWWW_ENABLE_SSL -I/usr/include/lua5.3 -I/usr/include/python3.8 -I/tmp/B.gZVIjh/BUILD/domoticz-2020.2/main -I/usr/include/jsoncpp -I/usr/include/minizip -I/usr/include/tinyxpath -I/usr/include/openzwave  -std=c++11 -Wno-psabi -rdynamic -O2 -fwrapv -pipe -Wformat -Werror=format-security -gdwarf-4 -fno-debug-types-section -fvar-tracking-assignments -g2 -Wp,-D_FORTIFY_SOURCE=2 -fstack-protector-strong --param=ssp-buffer-size=4 -Werror=trampolines -fPIC -mtune=generic -march=x86-64 -gdwarf-4 -fno-debug-types-section -fvar-tracking-assignments -g2  -DNDEBUG -DQT_NO_DEBUG   -Winvalid-pch -include /tmp/B.gZVIjh/BUILD/domoticz-2020.2/build/CMakeFiles/domoticz.dir/cmake_pch.hxx -o CMakeFiles/domoticz.dir/main/TrendCalculator.cpp.o -c /tmp/B.gZVIjh/BUILD/domoticz-2020.2/main/TrendCalculator.cpp
make[2]: Leaving directory '/tmp/B.gZVIjh/BUILD/domoticz-2020.2/build'
make[2]: Entering directory '/tmp/B.gZVIjh/BUILD/domoticz-2020.2/build'
[  2%] Building CXX object CMakeFiles/domoticz.dir/main/domoticz.cpp.o
/usr/bin/x86_64-pld-linux-gnux32-g++  -DENABLE_PYTHON -DHAVE_EXECINFO_H -DHAVE_LINUX_I2C -DHAVE_LINUX_SPI -DWITH_EXTERNAL_TINYXPATH -DWITH_LIBUSB -DWITH_OPENZWAVE -DWITH_TLS -DWWW_ENABLE_SSL -I/usr/include/lua5.3 -I/usr/include/python3.8 -I/tmp/B.gZVIjh/BUILD/domoticz-2020.2/main -I/usr/include/jsoncpp -I/usr/include/minizip -I/usr/include/tinyxpath -I/usr/include/openzwave  -std=c++11 -Wno-psabi -rdynamic -O2 -fwrapv -pipe -Wformat -Werror=format-security -gdwarf-4 -fno-debug-types-section -fvar-tracking-assignments -g2 -Wp,-D_FORTIFY_SOURCE=2 -fstack-protector-strong --param=ssp-buffer-size=4 -Werror=trampolines -fPIC -mtune=generic -march=x86-64 -gdwarf-4 -fno-debug-types-section -fvar-tracking-assignments -g2  -DNDEBUG -DQT_NO_DEBUG   -Winvalid-pch -include /tmp/B.gZVIjh/BUILD/domoticz-2020.2/build/CMakeFiles/domoticz.dir/cmake_pch.hxx -o CMakeFiles/domoticz.dir/main/domoticz.cpp.o -c /tmp/B.gZVIjh/BUILD/domoticz-2020.2/main/domoticz.cpp
make[2]: Leaving directory '/tmp/B.gZVIjh/BUILD/domoticz-2020.2/build'
make[2]: Entering directory '/tmp/B.gZVIjh/BUILD/domoticz-2020.2/build'
[ 13%] Building CXX object CMakeFiles/domoticz.dir/main/WindCalculation.cpp.o
/usr/bin/x86_64-pld-linux-gnux32-g++  -DENABLE_PYTHON -DHAVE_EXECINFO_H -DHAVE_LINUX_I2C -DHAVE_LINUX_SPI -DWITH_EXTERNAL_TINYXPATH -DWITH_LIBUSB -DWITH_OPENZWAVE -DWITH_TLS -DWWW_ENABLE_SSL -I/usr/include/lua5.3 -I/usr/include/python3.8 -I/tmp/B.gZVIjh/BUILD/domoticz-2020.2/main -I/usr/include/jsoncpp -I/usr/include/minizip -I/usr/include/tinyxpath -I/usr/include/openzwave  -std=c++11 -Wno-psabi -rdynamic -O2 -fwrapv -pipe -Wformat -Werror=format-security -gdwarf-4 -fno-debug-types-section -fvar-tracking-assignments -g2 -Wp,-D_FORTIFY_SOURCE=2 -fstack-protector-strong --param=ssp-buffer-size=4 -Werror=trampolines -fPIC -mtune=generic -march=x86-64 -gdwarf-4 -fno-debug-types-section -fvar-tracking-assignments -g2  -DNDEBUG -DQT_NO_DEBUG   -Winvalid-pch -include /tmp/B.gZVIjh/BUILD/domoticz-2020.2/build/CMakeFiles/domoticz.dir/cmake_pch.hxx -o CMakeFiles/domoticz.dir/main/WindCalculation.cpp.o -c /tmp/B.gZVIjh/BUILD/domoticz-2020.2/main/WindCalculation.cpp
make[2]: Leaving directory '/tmp/B.gZVIjh/BUILD/domoticz-2020.2/build'
make[2]: Entering directory '/tmp/B.gZVIjh/BUILD/domoticz-2020.2/build'
[ 11%] Building CXX object CMakeFiles/domoticz.dir/main/SignalHandler.cpp.o
/usr/bin/x86_64-pld-linux-gnux32-g++  -DENABLE_PYTHON -DHAVE_EXECINFO_H -DHAVE_LINUX_I2C -DHAVE_LINUX_SPI -DWITH_EXTERNAL_TINYXPATH -DWITH_LIBUSB -DWITH_OPENZWAVE -DWITH_TLS -DWWW_ENABLE_SSL -I/usr/include/lua5.3 -I/usr/include/python3.8 -I/tmp/B.gZVIjh/BUILD/domoticz-2020.2/main -I/usr/include/jsoncpp -I/usr/include/minizip -I/usr/include/tinyxpath -I/usr/include/openzwave  -std=c++11 -Wno-psabi -rdynamic -O2 -fwrapv -pipe -Wformat -Werror=format-security -gdwarf-4 -fno-debug-types-section -fvar-tracking-assignments -g2 -Wp,-D_FORTIFY_SOURCE=2 -fstack-protector-strong --param=ssp-buffer-size=4 -Werror=trampolines -fPIC -mtune=generic -march=x86-64 -gdwarf-4 -fno-debug-types-section -fvar-tracking-assignments -g2  -DNDEBUG -DQT_NO_DEBUG   -Winvalid-pch -include /tmp/B.gZVIjh/BUILD/domoticz-2020.2/build/CMakeFiles/domoticz.dir/cmake_pch.hxx -o CMakeFiles/domoticz.dir/main/SignalHandler.cpp.o -c /tmp/B.gZVIjh/BUILD/domoticz-2020.2/main/SignalHandler.cpp
make[2]: Leaving directory '/tmp/B.gZVIjh/BUILD/domoticz-2020.2/build'
make[2]: Entering directory '/tmp/B.gZVIjh/BUILD/domoticz-2020.2/build'
[  3%] Building CXX object CMakeFiles/domoticz.dir/main/dzVents.cpp.o
/usr/bin/x86_64-pld-linux-gnux32-g++  -DENABLE_PYTHON -DHAVE_EXECINFO_H -DHAVE_LINUX_I2C -DHAVE_LINUX_SPI -DWITH_EXTERNAL_TINYXPATH -DWITH_LIBUSB -DWITH_OPENZWAVE -DWITH_TLS -DWWW_ENABLE_SSL -I/usr/include/lua5.3 -I/usr/include/python3.8 -I/tmp/B.gZVIjh/BUILD/domoticz-2020.2/main -I/usr/include/jsoncpp -I/usr/include/minizip -I/usr/include/tinyxpath -I/usr/include/openzwave  -std=c++11 -Wno-psabi -rdynamic -O2 -fwrapv -pipe -Wformat -Werror=format-security -gdwarf-4 -fno-debug-types-section -fvar-tracking-assignments -g2 -Wp,-D_FORTIFY_SOURCE=2 -fstack-protector-strong --param=ssp-buffer-size=4 -Werror=trampolines -fPIC -mtune=generic -march=x86-64 -gdwarf-4 -fno-debug-types-section -fvar-tracking-assignments -g2  -DNDEBUG -DQT_NO_DEBUG   -Winvalid-pch -include /tmp/B.gZVIjh/BUILD/domoticz-2020.2/build/CMakeFiles/domoticz.dir/cmake_pch.hxx -o CMakeFiles/domoticz.dir/main/dzVents.cpp.o -c /tmp/B.gZVIjh/BUILD/domoticz-2020.2/main/dzVents.cpp
make[2]: Leaving directory '/tmp/B.gZVIjh/BUILD/domoticz-2020.2/build'
make[2]: Entering directory '/tmp/B.gZVIjh/BUILD/domoticz-2020.2/build'
[ 14%] Building CXX object CMakeFiles/domoticz.dir/push/FibaroPush.cpp.o
/usr/bin/x86_64-pld-linux-gnux32-g++  -DENABLE_PYTHON -DHAVE_EXECINFO_H -DHAVE_LINUX_I2C -DHAVE_LINUX_SPI -DWITH_EXTERNAL_TINYXPATH -DWITH_LIBUSB -DWITH_OPENZWAVE -DWITH_TLS -DWWW_ENABLE_SSL -I/usr/include/lua5.3 -I/usr/include/python3.8 -I/tmp/B.gZVIjh/BUILD/domoticz-2020.2/main -I/usr/include/jsoncpp -I/usr/include/minizip -I/usr/include/tinyxpath -I/usr/include/openzwave  -std=c++11 -Wno-psabi -rdynamic -O2 -fwrapv -pipe -Wformat -Werror=format-security -gdwarf-4 -fno-debug-types-section -fvar-tracking-assignments -g2 -Wp,-D_FORTIFY_SOURCE=2 -fstack-protector-strong --param=ssp-buffer-size=4 -Werror=trampolines -fPIC -mtune=generic -march=x86-64 -gdwarf-4 -fno-debug-types-section -fvar-tracking-assignments -g2  -DNDEBUG -DQT_NO_DEBUG   -Winvalid-pch -include /tmp/B.gZVIjh/BUILD/domoticz-2020.2/build/CMakeFiles/domoticz.dir/cmake_pch.hxx -o CMakeFiles/domoticz.dir/push/FibaroPush.cpp.o -c /tmp/B.gZVIjh/BUILD/domoticz-2020.2/push/FibaroPush.cpp
/tmp/B.gZVIjh/BUILD/domoticz-2020.2/push/FibaroPush.cpp: In member function 'void CFibaroPush::Start()':
/tmp/B.gZVIjh/BUILD/domoticz-2020.2/push/FibaroPush.cpp:26:107: error: '_1' was not declared in this scope
   26 |  m_sConnection = m_mainworker.sOnDeviceReceived.connect(boost::bind(&CFibaroPush::OnDeviceReceived, this, _1, _2, _3, _4));
      |                                                                                                           ^~
/tmp/B.gZVIjh/BUILD/domoticz-2020.2/push/FibaroPush.cpp:26:107: note: suggested alternatives:
In file included from /usr/include/boost/mpl/aux_/include_preprocessed.hpp:37,
                 from /usr/include/boost/mpl/placeholders.hpp:43,
                 from /usr/include/boost/iterator/iterator_categories.hpp:16,
                 from /usr/include/boost/iterator/iterator_adaptor.hpp:14,
                 from /usr/include/boost/iterator/reverse_iterator.hpp:10,
                 from /usr/include/boost/signals2/detail/auto_buffer.hpp:22,
                 from /usr/include/boost/signals2/connection.hpp:21,
                 from /usr/include/boost/signals2/signal.hpp:22,
                 from /usr/include/boost/signals2.hpp:19,
                 from /tmp/B.gZVIjh/BUILD/domoticz-2020.2/push/BasePush.h:3,
                 from /tmp/B.gZVIjh/BUILD/domoticz-2020.2/push/FibaroPush.h:3,
                 from /tmp/B.gZVIjh/BUILD/domoticz-2020.2/push/FibaroPush.cpp:2:
/usr/include/boost/mpl/aux_/preprocessed/gcc/placeholders.hpp:29:16: note:   'mpl_::_1'
   29 | typedef arg<1> _1;
      |                ^~
In file included from /usr/include/boost/smart_ptr/detail/shared_count.hpp:39,
                 from /usr/include/boost/smart_ptr/shared_ptr.hpp:28,
                 from /usr/include/boost/shared_ptr.hpp:17,
                 from /usr/include/boost/signals2/deconstruct.hpp:28,
                 from /usr/include/boost/signals2.hpp:15,
                 from /tmp/B.gZVIjh/BUILD/domoticz-2020.2/push/BasePush.h:3,
                 from /tmp/B.gZVIjh/BUILD/domoticz-2020.2/push/FibaroPush.h:3,
                 from /tmp/B.gZVIjh/BUILD/domoticz-2020.2/push/FibaroPush.cpp:2:
/usr/include/c++/10.2.0/functional:221:34: note:   'std::placeholders::_1'
  221 |     extern const _Placeholder<1> _1;
      |                                  ^~
In file included from /usr/include/boost/mpl/aux_/include_preprocessed.hpp:37,
                 from /usr/include/boost/mpl/placeholders.hpp:43,
                 from /usr/include/boost/iterator/iterator_categories.hpp:16,
                 from /usr/include/boost/iterator/iterator_adaptor.hpp:14,
                 from /usr/include/boost/iterator/reverse_iterator.hpp:10,
                 from /usr/include/boost/signals2/detail/auto_buffer.hpp:22,
                 from /usr/include/boost/signals2/connection.hpp:21,
                 from /usr/include/boost/signals2/signal.hpp:22,
                 from /usr/include/boost/signals2.hpp:19,
                 from /tmp/B.gZVIjh/BUILD/domoticz-2020.2/push/BasePush.h:3,
                 from /tmp/B.gZVIjh/BUILD/domoticz-2020.2/push/FibaroPush.h:3,
                 from /tmp/B.gZVIjh/BUILD/domoticz-2020.2/push/FibaroPush.cpp:2:
/usr/include/boost/mpl/aux_/preprocessed/gcc/placeholders.hpp:29:16: note:   'mpl_::_1'
   29 | typedef arg<1> _1;
      |                ^~
In file included from /usr/include/boost/bind/bind.hpp:2356,
                 from /usr/include/boost/signals2/slot.hpp:15,
                 from /usr/include/boost/signals2/connection.hpp:24,
                 from /usr/include/boost/signals2/signal.hpp:22,
                 from /usr/include/boost/signals2.hpp:19,
                 from /tmp/B.gZVIjh/BUILD/domoticz-2020.2/push/BasePush.h:3,
                 from /tmp/B.gZVIjh/BUILD/domoticz-2020.2/push/FibaroPush.h:3,
                 from /tmp/B.gZVIjh/BUILD/domoticz-2020.2/push/FibaroPush.cpp:2:
/usr/include/boost/bind/placeholders.hpp:46:38: note:   'boost::placeholders::_1'
   46 | BOOST_STATIC_CONSTEXPR boost::arg<1> _1;
      |                                      ^~
In file included from /usr/include/boost/parameter/aux_/is_placeholder.hpp:46,
                 from /usr/include/boost/parameter/value_type.hpp:101,
                 from /usr/include/boost/parameter/aux_/arg_list.hpp:1207,
                 from /usr/include/boost/parameter/parameters.hpp:22,
                 from /usr/include/boost/signals2/signal_type.hpp:27,
                 from /usr/include/boost/signals2.hpp:20,
                 from /tmp/B.gZVIjh/BUILD/domoticz-2020.2/push/BasePush.h:3,
                 from /tmp/B.gZVIjh/BUILD/domoticz-2020.2/push/FibaroPush.h:3,
                 from /tmp/B.gZVIjh/BUILD/domoticz-2020.2/push/FibaroPush.cpp:2:
/usr/include/boost/mp11/bind.hpp:45:7: note:   'boost::mp11::_1'
   45 | using _1 = mp_arg<0>;
      |       ^~
In file included from /usr/include/boost/mpl/aux_/include_preprocessed.hpp:37,
                 from /usr/include/boost/mpl/placeholders.hpp:43,
                 from /usr/include/boost/iterator/iterator_categories.hpp:16,
                 from /usr/include/boost/iterator/iterator_adaptor.hpp:14,
                 from /usr/include/boost/iterator/reverse_iterator.hpp:10,
                 from /usr/include/boost/signals2/detail/auto_buffer.hpp:22,
                 from /usr/include/boost/signals2/connection.hpp:21,
                 from /usr/include/boost/signals2/signal.hpp:22,
                 from /usr/include/boost/signals2.hpp:19,
                 from /tmp/B.gZVIjh/BUILD/domoticz-2020.2/push/BasePush.h:3,
                 from /tmp/B.gZVIjh/BUILD/domoticz-2020.2/push/FibaroPush.h:3,
                 from /tmp/B.gZVIjh/BUILD/domoticz-2020.2/push/FibaroPush.cpp:2:
/usr/include/boost/mpl/aux_/preprocessed/gcc/placeholders.hpp:29:16: note:   'mpl_::_1'
   29 | typedef arg<1> _1;
      |                ^~
/tmp/B.gZVIjh/BUILD/domoticz-2020.2/push/FibaroPush.cpp:26:111: error: '_2' was not declared in this scope
   26 |  m_sConnection = m_mainworker.sOnDeviceReceived.connect(boost::bind(&CFibaroPush::OnDeviceReceived, this, _1, _2, _3, _4));
      |                                                                                                               ^~
/tmp/B.gZVIjh/BUILD/domoticz-2020.2/push/FibaroPush.cpp:26:111: note: suggested alternatives:
In file included from /usr/include/boost/mpl/aux_/include_preprocessed.hpp:37,
                 from /usr/include/boost/mpl/placeholders.hpp:43,
                 from /usr/include/boost/iterator/iterator_categories.hpp:16,
                 from /usr/include/boost/iterator/iterator_adaptor.hpp:14,
                 from /usr/include/boost/iterator/reverse_iterator.hpp:10,
                 from /usr/include/boost/signals2/detail/auto_buffer.hpp:22,
                 from /usr/include/boost/signals2/connection.hpp:21,
                 from /usr/include/boost/signals2/signal.hpp:22,
                 from /usr/include/boost/signals2.hpp:19,
                 from /tmp/B.gZVIjh/BUILD/domoticz-2020.2/push/BasePush.h:3,
                 from /tmp/B.gZVIjh/BUILD/domoticz-2020.2/push/FibaroPush.h:3,
                 from /tmp/B.gZVIjh/BUILD/domoticz-2020.2/push/FibaroPush.cpp:2:
/usr/include/boost/mpl/aux_/preprocessed/gcc/placeholders.hpp:42:16: note:   'mpl_::_2'
   42 | typedef arg<2> _2;
      |                ^~
In file included from /usr/include/boost/smart_ptr/detail/shared_count.hpp:39,
                 from /usr/include/boost/smart_ptr/shared_ptr.hpp:28,
                 from /usr/include/boost/shared_ptr.hpp:17,
                 from /usr/include/boost/signals2/deconstruct.hpp:28,
                 from /usr/include/boost/signals2.hpp:15,
                 from /tmp/B.gZVIjh/BUILD/domoticz-2020.2/push/BasePush.h:3,
                 from /tmp/B.gZVIjh/BUILD/domoticz-2020.2/push/FibaroPush.h:3,
                 from /tmp/B.gZVIjh/BUILD/domoticz-2020.2/push/FibaroPush.cpp:2:
/usr/include/c++/10.2.0/functional:222:34: note:   'std::placeholders::_2'
  222 |     extern const _Placeholder<2> _2;
      |                                  ^~
In file included from /usr/include/boost/mpl/aux_/include_preprocessed.hpp:37,
                 from /usr/include/boost/mpl/placeholders.hpp:43,
                 from /usr/include/boost/iterator/iterator_categories.hpp:16,
                 from /usr/include/boost/iterator/iterator_adaptor.hpp:14,
                 from /usr/include/boost/iterator/reverse_iterator.hpp:10,
                 from /usr/include/boost/signals2/detail/auto_buffer.hpp:22,
                 from /usr/include/boost/signals2/connection.hpp:21,
                 from /usr/include/boost/signals2/signal.hpp:22,
                 from /usr/include/boost/signals2.hpp:19,
                 from /tmp/B.gZVIjh/BUILD/domoticz-2020.2/push/BasePush.h:3,
                 from /tmp/B.gZVIjh/BUILD/domoticz-2020.2/push/FibaroPush.h:3,
                 from /tmp/B.gZVIjh/BUILD/domoticz-2020.2/push/FibaroPush.cpp:2:
/usr/include/boost/mpl/aux_/preprocessed/gcc/placeholders.hpp:42:16: note:   'mpl_::_2'
   42 | typedef arg<2> _2;
      |                ^~
In file included from /usr/include/boost/bind/bind.hpp:2356,
                 from /usr/include/boost/signals2/slot.hpp:15,
                 from /usr/include/boost/signals2/connection.hpp:24,
                 from /usr/include/boost/signals2/signal.hpp:22,
                 from /usr/include/boost/signals2.hpp:19,
                 from /tmp/B.gZVIjh/BUILD/domoticz-2020.2/push/BasePush.h:3,
                 from /tmp/B.gZVIjh/BUILD/domoticz-2020.2/push/FibaroPush.h:3,
                 from /tmp/B.gZVIjh/BUILD/domoticz-2020.2/push/FibaroPush.cpp:2:
/usr/include/boost/bind/placeholders.hpp:47:38: note:   'boost::placeholders::_2'
   47 | BOOST_STATIC_CONSTEXPR boost::arg<2> _2;
      |                                      ^~
In file included from /usr/include/boost/parameter/aux_/is_placeholder.hpp:46,
                 from /usr/include/boost/parameter/value_type.hpp:101,
                 from /usr/include/boost/parameter/aux_/arg_list.hpp:1207,
                 from /usr/include/boost/parameter/parameters.hpp:22,
                 from /usr/include/boost/signals2/signal_type.hpp:27,
                 from /usr/include/boost/signals2.hpp:20,
                 from /tmp/B.gZVIjh/BUILD/domoticz-2020.2/push/BasePush.h:3,
                 from /tmp/B.gZVIjh/BUILD/domoticz-2020.2/push/FibaroPush.h:3,
                 from /tmp/B.gZVIjh/BUILD/domoticz-2020.2/push/FibaroPush.cpp:2:
/usr/include/boost/mp11/bind.hpp:46:7: note:   'boost::mp11::_2'
   46 | using _2 = mp_arg<1>;
      |       ^~
In file included from /usr/include/boost/mpl/aux_/include_preprocessed.hpp:37,
                 from /usr/include/boost/mpl/placeholders.hpp:43,
                 from /usr/include/boost/iterator/iterator_categories.hpp:16,
                 from /usr/include/boost/iterator/iterator_adaptor.hpp:14,
                 from /usr/include/boost/iterator/reverse_iterator.hpp:10,
                 from /usr/include/boost/signals2/detail/auto_buffer.hpp:22,
                 from /usr/include/boost/signals2/connection.hpp:21,
                 from /usr/include/boost/signals2/signal.hpp:22,
                 from /usr/include/boost/signals2.hpp:19,
                 from /tmp/B.gZVIjh/BUILD/domoticz-2020.2/push/BasePush.h:3,
                 from /tmp/B.gZVIjh/BUILD/domoticz-2020.2/push/FibaroPush.h:3,
                 from /tmp/B.gZVIjh/BUILD/domoticz-2020.2/push/FibaroPush.cpp:2:
/usr/include/boost/mpl/aux_/preprocessed/gcc/placeholders.hpp:42:16: note:   'mpl_::_2'
   42 | typedef arg<2> _2;
      |                ^~
/tmp/B.gZVIjh/BUILD/domoticz-2020.2/push/FibaroPush.cpp:26:115: error: '_3' was not declared in this scope
   26 |  m_sConnection = m_mainworker.sOnDeviceReceived.connect(boost::bind(&CFibaroPush::OnDeviceReceived, this, _1, _2, _3, _4));
      |                                                                                                                   ^~
/tmp/B.gZVIjh/BUILD/domoticz-2020.2/push/FibaroPush.cpp:26:115: note: suggested alternatives:
In file included from /usr/include/boost/mpl/aux_/include_preprocessed.hpp:37,
                 from /usr/include/boost/mpl/placeholders.hpp:43,
                 from /usr/include/boost/iterator/iterator_categories.hpp:16,
                 from /usr/include/boost/iterator/iterator_adaptor.hpp:14,
                 from /usr/include/boost/iterator/reverse_iterator.hpp:10,
                 from /usr/include/boost/signals2/detail/auto_buffer.hpp:22,
                 from /usr/include/boost/signals2/connection.hpp:21,
                 from /usr/include/boost/signals2/signal.hpp:22,
                 from /usr/include/boost/signals2.hpp:19,
                 from /tmp/B.gZVIjh/BUILD/domoticz-2020.2/push/BasePush.h:3,
                 from /tmp/B.gZVIjh/BUILD/domoticz-2020.2/push/FibaroPush.h:3,
                 from /tmp/B.gZVIjh/BUILD/domoticz-2020.2/push/FibaroPush.cpp:2:
/usr/include/boost/mpl/aux_/preprocessed/gcc/placeholders.hpp:55:16: note:   'mpl_::_3'
   55 | typedef arg<3> _3;
      |                ^~
In file included from /usr/include/boost/smart_ptr/detail/shared_count.hpp:39,
                 from /usr/include/boost/smart_ptr/shared_ptr.hpp:28,
                 from /usr/include/boost/shared_ptr.hpp:17,
                 from /usr/include/boost/signals2/deconstruct.hpp:28,
                 from /usr/include/boost/signals2.hpp:15,
                 from /tmp/B.gZVIjh/BUILD/domoticz-2020.2/push/BasePush.h:3,
                 from /tmp/B.gZVIjh/BUILD/domoticz-2020.2/push/FibaroPush.h:3,
                 from /tmp/B.gZVIjh/BUILD/domoticz-2020.2/push/FibaroPush.cpp:2:
/usr/include/c++/10.2.0/functional:223:34: note:   'std::placeholders::_3'
  223 |     extern const _Placeholder<3> _3;
      |                                  ^~
In file included from /usr/include/boost/mpl/aux_/include_preprocessed.hpp:37,
                 from /usr/include/boost/mpl/placeholders.hpp:43,
                 from /usr/include/boost/iterator/iterator_categories.hpp:16,
                 from /usr/include/boost/iterator/iterator_adaptor.hpp:14,
                 from /usr/include/boost/iterator/reverse_iterator.hpp:10,
                 from /usr/include/boost/signals2/detail/auto_buffer.hpp:22,
                 from /usr/include/boost/signals2/connection.hpp:21,
                 from /usr/include/boost/signals2/signal.hpp:22,
                 from /usr/include/boost/signals2.hpp:19,
                 from /tmp/B.gZVIjh/BUILD/domoticz-2020.2/push/BasePush.h:3,
                 from /tmp/B.gZVIjh/BUILD/domoticz-2020.2/push/FibaroPush.h:3,
                 from /tmp/B.gZVIjh/BUILD/domoticz-2020.2/push/FibaroPush.cpp:2:
/usr/include/boost/mpl/aux_/preprocessed/gcc/placeholders.hpp:55:16: note:   'mpl_::_3'
   55 | typedef arg<3> _3;
      |                ^~
In file included from /usr/include/boost/bind/bind.hpp:2356,
                 from /usr/include/boost/signals2/slot.hpp:15,
                 from /usr/include/boost/signals2/connection.hpp:24,
                 from /usr/include/boost/signals2/signal.hpp:22,
                 from /usr/include/boost/signals2.hpp:19,
                 from /tmp/B.gZVIjh/BUILD/domoticz-2020.2/push/BasePush.h:3,
                 from /tmp/B.gZVIjh/BUILD/domoticz-2020.2/push/FibaroPush.h:3,
                 from /tmp/B.gZVIjh/BUILD/domoticz-2020.2/push/FibaroPush.cpp:2:
/usr/include/boost/bind/placeholders.hpp:48:38: note:   'boost::placeholders::_3'
   48 | BOOST_STATIC_CONSTEXPR boost::arg<3> _3;
      |                                      ^~
In file included from /usr/include/boost/parameter/aux_/is_placeholder.hpp:46,
                 from /usr/include/boost/parameter/value_type.hpp:101,
                 from /usr/include/boost/parameter/aux_/arg_list.hpp:1207,
                 from /usr/include/boost/parameter/parameters.hpp:22,
                 from /usr/include/boost/signals2/signal_type.hpp:27,
                 from /usr/include/boost/signals2.hpp:20,
                 from /tmp/B.gZVIjh/BUILD/domoticz-2020.2/push/BasePush.h:3,
                 from /tmp/B.gZVIjh/BUILD/domoticz-2020.2/push/FibaroPush.h:3,
                 from /tmp/B.gZVIjh/BUILD/domoticz-2020.2/push/FibaroPush.cpp:2:
/usr/include/boost/mp11/bind.hpp:47:7: note:   'boost::mp11::_3'
   47 | using _3 = mp_arg<2>;
      |       ^~
In file included from /usr/include/boost/mpl/aux_/include_preprocessed.hpp:37,
                 from /usr/include/boost/mpl/placeholders.hpp:43,
                 from /usr/include/boost/iterator/iterator_categories.hpp:16,
                 from /usr/include/boost/iterator/iterator_adaptor.hpp:14,
                 from /usr/include/boost/iterator/reverse_iterator.hpp:10,
                 from /usr/include/boost/signals2/detail/auto_buffer.hpp:22,
                 from /usr/include/boost/signals2/connection.hpp:21,
                 from /usr/include/boost/signals2/signal.hpp:22,
                 from /usr/include/boost/signals2.hpp:19,
                 from /tmp/B.gZVIjh/BUILD/domoticz-2020.2/push/BasePush.h:3,
                 from /tmp/B.gZVIjh/BUILD/domoticz-2020.2/push/FibaroPush.h:3,
                 from /tmp/B.gZVIjh/BUILD/domoticz-2020.2/push/FibaroPush.cpp:2:
/usr/include/boost/mpl/aux_/preprocessed/gcc/placeholders.hpp:55:16: note:   'mpl_::_3'
   55 | typedef arg<3> _3;
      |                ^~
/tmp/B.gZVIjh/BUILD/domoticz-2020.2/push/FibaroPush.cpp:26:119: error: '_4' was not declared in this scope
   26 |  m_sConnection = m_mainworker.sOnDeviceReceived.connect(boost::bind(&CFibaroPush::OnDeviceReceived, this, _1, _2, _3, _4));
      |                                                                                                                       ^~
/tmp/B.gZVIjh/BUILD/domoticz-2020.2/push/FibaroPush.cpp:26:119: note: suggested alternatives:
In file included from /usr/include/boost/mpl/aux_/include_preprocessed.hpp:37,
                 from /usr/include/boost/mpl/placeholders.hpp:43,
                 from /usr/include/boost/iterator/iterator_categories.hpp:16,
                 from /usr/include/boost/iterator/iterator_adaptor.hpp:14,
                 from /usr/include/boost/iterator/reverse_iterator.hpp:10,
                 from /usr/include/boost/signals2/detail/auto_buffer.hpp:22,
                 from /usr/include/boost/signals2/connection.hpp:21,
                 from /usr/include/boost/signals2/signal.hpp:22,
                 from /usr/include/boost/signals2.hpp:19,
                 from /tmp/B.gZVIjh/BUILD/domoticz-2020.2/push/BasePush.h:3,
                 from /tmp/B.gZVIjh/BUILD/domoticz-2020.2/push/FibaroPush.h:3,
                 from /tmp/B.gZVIjh/BUILD/domoticz-2020.2/push/FibaroPush.cpp:2:
/usr/include/boost/mpl/aux_/preprocessed/gcc/placeholders.hpp:68:16: note:   'mpl_::_4'
   68 | typedef arg<4> _4;
      |                ^~
In file included from /usr/include/boost/smart_ptr/detail/shared_count.hpp:39,
                 from /usr/include/boost/smart_ptr/shared_ptr.hpp:28,
                 from /usr/include/boost/shared_ptr.hpp:17,
                 from /usr/include/boost/signals2/deconstruct.hpp:28,
                 from /usr/include/boost/signals2.hpp:15,
                 from /tmp/B.gZVIjh/BUILD/domoticz-2020.2/push/BasePush.h:3,
                 from /tmp/B.gZVIjh/BUILD/domoticz-2020.2/push/FibaroPush.h:3,
                 from /tmp/B.gZVIjh/BUILD/domoticz-2020.2/push/FibaroPush.cpp:2:
/usr/include/c++/10.2.0/functional:224:34: note:   'std::placeholders::_4'
  224 |     extern const _Placeholder<4> _4;
      |                                  ^~
In file included from /usr/include/boost/mpl/aux_/include_preprocessed.hpp:37,
                 from /usr/include/boost/mpl/placeholders.hpp:43,
                 from /usr/include/boost/iterator/iterator_categories.hpp:16,
                 from /usr/include/boost/iterator/iterator_adaptor.hpp:14,
                 from /usr/include/boost/iterator/reverse_iterator.hpp:10,
                 from /usr/include/boost/signals2/detail/auto_buffer.hpp:22,
                 from /usr/include/boost/signals2/connection.hpp:21,
                 from /usr/include/boost/signals2/signal.hpp:22,
                 from /usr/include/boost/signals2.hpp:19,
                 from /tmp/B.gZVIjh/BUILD/domoticz-2020.2/push/BasePush.h:3,
                 from /tmp/B.gZVIjh/BUILD/domoticz-2020.2/push/FibaroPush.h:3,
                 from /tmp/B.gZVIjh/BUILD/domoticz-2020.2/push/FibaroPush.cpp:2:
/usr/include/boost/mpl/aux_/preprocessed/gcc/placeholders.hpp:68:16: note:   'mpl_::_4'
   68 | typedef arg<4> _4;
      |                ^~
In file included from /usr/include/boost/bind/bind.hpp:2356,
                 from /usr/include/boost/signals2/slot.hpp:15,
                 from /usr/include/boost/signals2/connection.hpp:24,
                 from /usr/include/boost/signals2/signal.hpp:22,
                 from /usr/include/boost/signals2.hpp:19,
                 from /tmp/B.gZVIjh/BUILD/domoticz-2020.2/push/BasePush.h:3,
                 from /tmp/B.gZVIjh/BUILD/domoticz-2020.2/push/FibaroPush.h:3,
                 from /tmp/B.gZVIjh/BUILD/domoticz-2020.2/push/FibaroPush.cpp:2:
/usr/include/boost/bind/placeholders.hpp:49:38: note:   'boost::placeholders::_4'
   49 | BOOST_STATIC_CONSTEXPR boost::arg<4> _4;
      |                                      ^~
In file included from /usr/include/boost/parameter/aux_/is_placeholder.hpp:46,
                 from /usr/include/boost/parameter/value_type.hpp:101,
                 from /usr/include/boost/parameter/aux_/arg_list.hpp:1207,
                 from /usr/include/boost/parameter/parameters.hpp:22,
                 from /usr/include/boost/signals2/signal_type.hpp:27,
                 from /usr/include/boost/signals2.hpp:20,
                 from /tmp/B.gZVIjh/BUILD/domoticz-2020.2/push/BasePush.h:3,
                 from /tmp/B.gZVIjh/BUILD/domoticz-2020.2/push/FibaroPush.h:3,
                 from /tmp/B.gZVIjh/BUILD/domoticz-2020.2/push/FibaroPush.cpp:2:
/usr/include/boost/mp11/bind.hpp:48:7: note:   'boost::mp11::_4'
   48 | using _4 = mp_arg<3>;
      |       ^~
In file included from /usr/include/boost/mpl/aux_/include_preprocessed.hpp:37,
                 from /usr/include/boost/mpl/placeholders.hpp:43,
                 from /usr/include/boost/iterator/iterator_categories.hpp:16,
                 from /usr/include/boost/iterator/iterator_adaptor.hpp:14,
                 from /usr/include/boost/iterator/reverse_iterator.hpp:10,
                 from /usr/include/boost/signals2/detail/auto_buffer.hpp:22,
                 from /usr/include/boost/signals2/connection.hpp:21,
                 from /usr/include/boost/signals2/signal.hpp:22,
                 from /usr/include/boost/signals2.hpp:19,
                 from /tmp/B.gZVIjh/BUILD/domoticz-2020.2/push/BasePush.h:3,
                 from /tmp/B.gZVIjh/BUILD/domoticz-2020.2/push/FibaroPush.h:3,
                 from /tmp/B.gZVIjh/BUILD/domoticz-2020.2/push/FibaroPush.cpp:2:
/usr/include/boost/mpl/aux_/preprocessed/gcc/placeholders.hpp:68:16: note:   'mpl_::_4'
   68 | typedef arg<4> _4;
      |                ^~
make[2]: *** [CMakeFiles/domoticz.dir/build.make:582: CMakeFiles/domoticz.dir/push/FibaroPush.cpp.o] Error 1
make[2]: Leaving directory '/tmp/B.gZVIjh/BUILD/domoticz-2020.2/build'
make[2]: *** Waiting for unfinished jobs....
make[2]: Entering directory '/tmp/B.gZVIjh/BUILD/domoticz-2020.2/build'
[ 15%] Building CXX object CMakeFiles/domoticz.dir/push/GooglePubSubPush.cpp.o
/usr/bin/x86_64-pld-linux-gnux32-g++  -DENABLE_PYTHON -DHAVE_EXECINFO_H -DHAVE_LINUX_I2C -DHAVE_LINUX_SPI -DWITH_EXTERNAL_TINYXPATH -DWITH_LIBUSB -DWITH_OPENZWAVE -DWITH_TLS -DWWW_ENABLE_SSL -I/usr/include/lua5.3 -I/usr/include/python3.8 -I/tmp/B.gZVIjh/BUILD/domoticz-2020.2/main -I/usr/include/jsoncpp -I/usr/include/minizip -I/usr/include/tinyxpath -I/usr/include/openzwave  -std=c++11 -Wno-psabi -rdynamic -O2 -fwrapv -pipe -Wformat -Werror=format-security -gdwarf-4 -fno-debug-types-section -fvar-tracking-assignments -g2 -Wp,-D_FORTIFY_SOURCE=2 -fstack-protector-strong --param=ssp-buffer-size=4 -Werror=trampolines -fPIC -mtune=generic -march=x86-64 -gdwarf-4 -fno-debug-types-section -fvar-tracking-assignments -g2  -DNDEBUG -DQT_NO_DEBUG   -Winvalid-pch -include /tmp/B.gZVIjh/BUILD/domoticz-2020.2/build/CMakeFiles/domoticz.dir/cmake_pch.hxx -o CMakeFiles/domoticz.dir/push/GooglePubSubPush.cpp.o -c /tmp/B.gZVIjh/BUILD/domoticz-2020.2/push/GooglePubSubPush.cpp
/tmp/B.gZVIjh/BUILD/domoticz-2020.2/push/GooglePubSubPush.cpp: In member function 'void CGooglePubSubPush::Start()':
/tmp/B.gZVIjh/BUILD/domoticz-2020.2/push/GooglePubSubPush.cpp:42:113: error: '_1' was not declared in this scope
   42 |  m_sConnection = m_mainworker.sOnDeviceReceived.connect(boost::bind(&CGooglePubSubPush::OnDeviceReceived, this, _1, _2, _3, _4));
      |                                                                                                                 ^~
/tmp/B.gZVIjh/BUILD/domoticz-2020.2/push/GooglePubSubPush.cpp:42:113: note: suggested alternatives:
In file included from /usr/include/boost/mpl/aux_/include_preprocessed.hpp:37,
                 from /usr/include/boost/mpl/placeholders.hpp:43,
                 from /usr/include/boost/iterator/iterator_categories.hpp:16,
                 from /usr/include/boost/iterator/iterator_adaptor.hpp:14,
                 from /usr/include/boost/iterator/reverse_iterator.hpp:10,
                 from /usr/include/boost/signals2/detail/auto_buffer.hpp:22,
                 from /usr/include/boost/signals2/connection.hpp:21,
                 from /usr/include/boost/signals2/signal.hpp:22,
                 from /usr/include/boost/signals2.hpp:19,
                 from /tmp/B.gZVIjh/BUILD/domoticz-2020.2/push/BasePush.h:3,
                 from /tmp/B.gZVIjh/BUILD/domoticz-2020.2/push/GooglePubSubPush.h:3,
                 from /tmp/B.gZVIjh/BUILD/domoticz-2020.2/push/GooglePubSubPush.cpp:2:
/usr/include/boost/mpl/aux_/preprocessed/gcc/placeholders.hpp:29:16: note:   'mpl_::_1'
   29 | typedef arg<1> _1;
      |                ^~
In file included from /usr/include/boost/smart_ptr/detail/shared_count.hpp:39,
                 from /usr/include/boost/smart_ptr/shared_ptr.hpp:28,
                 from /usr/include/boost/shared_ptr.hpp:17,
                 from /usr/include/boost/signals2/deconstruct.hpp:28,
                 from /usr/include/boost/signals2.hpp:15,
                 from /tmp/B.gZVIjh/BUILD/domoticz-2020.2/push/BasePush.h:3,
                 from /tmp/B.gZVIjh/BUILD/domoticz-2020.2/push/GooglePubSubPush.h:3,
                 from /tmp/B.gZVIjh/BUILD/domoticz-2020.2/push/GooglePubSubPush.cpp:2:
/usr/include/c++/10.2.0/functional:221:34: note:   'std::placeholders::_1'
  221 |     extern const _Placeholder<1> _1;
      |                                  ^~
In file included from /usr/include/boost/mpl/aux_/include_preprocessed.hpp:37,
                 from /usr/include/boost/mpl/placeholders.hpp:43,
                 from /usr/include/boost/iterator/iterator_categories.hpp:16,
                 from /usr/include/boost/iterator/iterator_adaptor.hpp:14,
                 from /usr/include/boost/iterator/reverse_iterator.hpp:10,
                 from /usr/include/boost/signals2/detail/auto_buffer.hpp:22,
                 from /usr/include/boost/signals2/connection.hpp:21,
                 from /usr/include/boost/signals2/signal.hpp:22,
                 from /usr/include/boost/signals2.hpp:19,
                 from /tmp/B.gZVIjh/BUILD/domoticz-2020.2/push/BasePush.h:3,
                 from /tmp/B.gZVIjh/BUILD/domoticz-2020.2/push/GooglePubSubPush.h:3,
                 from /tmp/B.gZVIjh/BUILD/domoticz-2020.2/push/GooglePubSubPush.cpp:2:
/usr/include/boost/mpl/aux_/preprocessed/gcc/placeholders.hpp:29:16: note:   'mpl_::_1'
   29 | typedef arg<1> _1;
      |                ^~
In file included from /usr/include/boost/bind/bind.hpp:2356,
                 from /usr/include/boost/signals2/slot.hpp:15,
                 from /usr/include/boost/signals2/connection.hpp:24,
                 from /usr/include/boost/signals2/signal.hpp:22,
                 from /usr/include/boost/signals2.hpp:19,
                 from /tmp/B.gZVIjh/BUILD/domoticz-2020.2/push/BasePush.h:3,
                 from /tmp/B.gZVIjh/BUILD/domoticz-2020.2/push/GooglePubSubPush.h:3,
                 from /tmp/B.gZVIjh/BUILD/domoticz-2020.2/push/GooglePubSubPush.cpp:2:
/usr/include/boost/bind/placeholders.hpp:46:38: note:   'boost::placeholders::_1'
   46 | BOOST_STATIC_CONSTEXPR boost::arg<1> _1;
      |                                      ^~
In file included from /usr/include/boost/parameter/aux_/is_placeholder.hpp:46,
                 from /usr/include/boost/parameter/value_type.hpp:101,
                 from /usr/include/boost/parameter/aux_/arg_list.hpp:1207,
                 from /usr/include/boost/parameter/parameters.hpp:22,
                 from /usr/include/boost/signals2/signal_type.hpp:27,
                 from /usr/include/boost/signals2.hpp:20,
                 from /tmp/B.gZVIjh/BUILD/domoticz-2020.2/push/BasePush.h:3,
                 from /tmp/B.gZVIjh/BUILD/domoticz-2020.2/push/GooglePubSubPush.h:3,
                 from /tmp/B.gZVIjh/BUILD/domoticz-2020.2/push/GooglePubSubPush.cpp:2:
/usr/include/boost/mp11/bind.hpp:45:7: note:   'boost::mp11::_1'
   45 | using _1 = mp_arg<0>;
      |       ^~
In file included from /usr/include/boost/mpl/aux_/include_preprocessed.hpp:37,
                 from /usr/include/boost/mpl/placeholders.hpp:43,
                 from /usr/include/boost/iterator/iterator_categories.hpp:16,
                 from /usr/include/boost/iterator/iterator_adaptor.hpp:14,
                 from /usr/include/boost/iterator/reverse_iterator.hpp:10,
                 from /usr/include/boost/signals2/detail/auto_buffer.hpp:22,
                 from /usr/include/boost/signals2/connection.hpp:21,
                 from /usr/include/boost/signals2/signal.hpp:22,
                 from /usr/include/boost/signals2.hpp:19,
                 from /tmp/B.gZVIjh/BUILD/domoticz-2020.2/push/BasePush.h:3,
                 from /tmp/B.gZVIjh/BUILD/domoticz-2020.2/push/GooglePubSubPush.h:3,
                 from /tmp/B.gZVIjh/BUILD/domoticz-2020.2/push/GooglePubSubPush.cpp:2:
/usr/include/boost/mpl/aux_/preprocessed/gcc/placeholders.hpp:29:16: note:   'mpl_::_1'
   29 | typedef arg<1> _1;
      |                ^~
/tmp/B.gZVIjh/BUILD/domoticz-2020.2/push/GooglePubSubPush.cpp:42:117: error: '_2' was not declared in this scope
   42 |  m_sConnection = m_mainworker.sOnDeviceReceived.connect(boost::bind(&CGooglePubSubPush::OnDeviceReceived, this, _1, _2, _3, _4));
      |                                                                                                                     ^~
/tmp/B.gZVIjh/BUILD/domoticz-2020.2/push/GooglePubSubPush.cpp:42:117: note: suggested alternatives:
In file included from /usr/include/boost/mpl/aux_/include_preprocessed.hpp:37,
                 from /usr/include/boost/mpl/placeholders.hpp:43,
                 from /usr/include/boost/iterator/iterator_categories.hpp:16,
                 from /usr/include/boost/iterator/iterator_adaptor.hpp:14,
                 from /usr/include/boost/iterator/reverse_iterator.hpp:10,
                 from /usr/include/boost/signals2/detail/auto_buffer.hpp:22,
                 from /usr/include/boost/signals2/connection.hpp:21,
                 from /usr/include/boost/signals2/signal.hpp:22,
                 from /usr/include/boost/signals2.hpp:19,
                 from /tmp/B.gZVIjh/BUILD/domoticz-2020.2/push/BasePush.h:3,
                 from /tmp/B.gZVIjh/BUILD/domoticz-2020.2/push/GooglePubSubPush.h:3,
                 from /tmp/B.gZVIjh/BUILD/domoticz-2020.2/push/GooglePubSubPush.cpp:2:
/usr/include/boost/mpl/aux_/preprocessed/gcc/placeholders.hpp:42:16: note:   'mpl_::_2'
   42 | typedef arg<2> _2;
      |                ^~
In file included from /usr/include/boost/smart_ptr/detail/shared_count.hpp:39,
                 from /usr/include/boost/smart_ptr/shared_ptr.hpp:28,
                 from /usr/include/boost/shared_ptr.hpp:17,
                 from /usr/include/boost/signals2/deconstruct.hpp:28,
                 from /usr/include/boost/signals2.hpp:15,
                 from /tmp/B.gZVIjh/BUILD/domoticz-2020.2/push/BasePush.h:3,
                 from /tmp/B.gZVIjh/BUILD/domoticz-2020.2/push/GooglePubSubPush.h:3,
                 from /tmp/B.gZVIjh/BUILD/domoticz-2020.2/push/GooglePubSubPush.cpp:2:
/usr/include/c++/10.2.0/functional:222:34: note:   'std::placeholders::_2'
  222 |     extern const _Placeholder<2> _2;
      |                                  ^~
In file included from /usr/include/boost/mpl/aux_/include_preprocessed.hpp:37,
                 from /usr/include/boost/mpl/placeholders.hpp:43,
                 from /usr/include/boost/iterator/iterator_categories.hpp:16,
                 from /usr/include/boost/iterator/iterator_adaptor.hpp:14,
                 from /usr/include/boost/iterator/reverse_iterator.hpp:10,
                 from /usr/include/boost/signals2/detail/auto_buffer.hpp:22,
                 from /usr/include/boost/signals2/connection.hpp:21,
                 from /usr/include/boost/signals2/signal.hpp:22,
                 from /usr/include/boost/signals2.hpp:19,
                 from /tmp/B.gZVIjh/BUILD/domoticz-2020.2/push/BasePush.h:3,
                 from /tmp/B.gZVIjh/BUILD/domoticz-2020.2/push/GooglePubSubPush.h:3,
                 from /tmp/B.gZVIjh/BUILD/domoticz-2020.2/push/GooglePubSubPush.cpp:2:
/usr/include/boost/mpl/aux_/preprocessed/gcc/placeholders.hpp:42:16: note:   'mpl_::_2'
   42 | typedef arg<2> _2;
      |                ^~
In file included from /usr/include/boost/bind/bind.hpp:2356,
                 from /usr/include/boost/signals2/slot.hpp:15,
                 from /usr/include/boost/signals2/connection.hpp:24,
                 from /usr/include/boost/signals2/signal.hpp:22,
                 from /usr/include/boost/signals2.hpp:19,
                 from /tmp/B.gZVIjh/BUILD/domoticz-2020.2/push/BasePush.h:3,
                 from /tmp/B.gZVIjh/BUILD/domoticz-2020.2/push/GooglePubSubPush.h:3,
                 from /tmp/B.gZVIjh/BUILD/domoticz-2020.2/push/GooglePubSubPush.cpp:2:
/usr/include/boost/bind/placeholders.hpp:47:38: note:   'boost::placeholders::_2'
   47 | BOOST_STATIC_CONSTEXPR boost::arg<2> _2;
      |                                      ^~
In file included from /usr/include/boost/parameter/aux_/is_placeholder.hpp:46,
                 from /usr/include/boost/parameter/value_type.hpp:101,
                 from /usr/include/boost/parameter/aux_/arg_list.hpp:1207,
                 from /usr/include/boost/parameter/parameters.hpp:22,
                 from /usr/include/boost/signals2/signal_type.hpp:27,
                 from /usr/include/boost/signals2.hpp:20,
                 from /tmp/B.gZVIjh/BUILD/domoticz-2020.2/push/BasePush.h:3,
                 from /tmp/B.gZVIjh/BUILD/domoticz-2020.2/push/GooglePubSubPush.h:3,
                 from /tmp/B.gZVIjh/BUILD/domoticz-2020.2/push/GooglePubSubPush.cpp:2:
/usr/include/boost/mp11/bind.hpp:46:7: note:   'boost::mp11::_2'
   46 | using _2 = mp_arg<1>;
      |       ^~
In file included from /usr/include/boost/mpl/aux_/include_preprocessed.hpp:37,
                 from /usr/include/boost/mpl/placeholders.hpp:43,
                 from /usr/include/boost/iterator/iterator_categories.hpp:16,
                 from /usr/include/boost/iterator/iterator_adaptor.hpp:14,
                 from /usr/include/boost/iterator/reverse_iterator.hpp:10,
                 from /usr/include/boost/signals2/detail/auto_buffer.hpp:22,
                 from /usr/include/boost/signals2/connection.hpp:21,
                 from /usr/include/boost/signals2/signal.hpp:22,
                 from /usr/include/boost/signals2.hpp:19,
                 from /tmp/B.gZVIjh/BUILD/domoticz-2020.2/push/BasePush.h:3,
                 from /tmp/B.gZVIjh/BUILD/domoticz-2020.2/push/GooglePubSubPush.h:3,
                 from /tmp/B.gZVIjh/BUILD/domoticz-2020.2/push/GooglePubSubPush.cpp:2:
/usr/include/boost/mpl/aux_/preprocessed/gcc/placeholders.hpp:42:16: note:   'mpl_::_2'
   42 | typedef arg<2> _2;
      |                ^~
/tmp/B.gZVIjh/BUILD/domoticz-2020.2/push/GooglePubSubPush.cpp:42:121: error: '_3' was not declared in this scope
   42 |  m_sConnection = m_mainworker.sOnDeviceReceived.connect(boost::bind(&CGooglePubSubPush::OnDeviceReceived, this, _1, _2, _3, _4));
      |                                                                                                                         ^~
/tmp/B.gZVIjh/BUILD/domoticz-2020.2/push/GooglePubSubPush.cpp:42:121: note: suggested alternatives:
In file included from /usr/include/boost/mpl/aux_/include_preprocessed.hpp:37,
                 from /usr/include/boost/mpl/placeholders.hpp:43,
                 from /usr/include/boost/iterator/iterator_categories.hpp:16,
                 from /usr/include/boost/iterator/iterator_adaptor.hpp:14,
                 from /usr/include/boost/iterator/reverse_iterator.hpp:10,
                 from /usr/include/boost/signals2/detail/auto_buffer.hpp:22,
                 from /usr/include/boost/signals2/connection.hpp:21,
                 from /usr/include/boost/signals2/signal.hpp:22,
                 from /usr/include/boost/signals2.hpp:19,
                 from /tmp/B.gZVIjh/BUILD/domoticz-2020.2/push/BasePush.h:3,
                 from /tmp/B.gZVIjh/BUILD/domoticz-2020.2/push/GooglePubSubPush.h:3,
                 from /tmp/B.gZVIjh/BUILD/domoticz-2020.2/push/GooglePubSubPush.cpp:2:
/usr/include/boost/mpl/aux_/preprocessed/gcc/placeholders.hpp:55:16: note:   'mpl_::_3'
   55 | typedef arg<3> _3;
      |                ^~
In file included from /usr/include/boost/smart_ptr/detail/shared_count.hpp:39,
                 from /usr/include/boost/smart_ptr/shared_ptr.hpp:28,
                 from /usr/include/boost/shared_ptr.hpp:17,
                 from /usr/include/boost/signals2/deconstruct.hpp:28,
                 from /usr/include/boost/signals2.hpp:15,
                 from /tmp/B.gZVIjh/BUILD/domoticz-2020.2/push/BasePush.h:3,
                 from /tmp/B.gZVIjh/BUILD/domoticz-2020.2/push/GooglePubSubPush.h:3,
                 from /tmp/B.gZVIjh/BUILD/domoticz-2020.2/push/GooglePubSubPush.cpp:2:
/usr/include/c++/10.2.0/functional:223:34: note:   'std::placeholders::_3'
  223 |     extern const _Placeholder<3> _3;
      |                                  ^~
In file included from /usr/include/boost/mpl/aux_/include_preprocessed.hpp:37,
                 from /usr/include/boost/mpl/placeholders.hpp:43,
                 from /usr/include/boost/iterator/iterator_categories.hpp:16,
                 from /usr/include/boost/iterator/iterator_adaptor.hpp:14,
                 from /usr/include/boost/iterator/reverse_iterator.hpp:10,
                 from /usr/include/boost/signals2/detail/auto_buffer.hpp:22,
                 from /usr/include/boost/signals2/connection.hpp:21,
                 from /usr/include/boost/signals2/signal.hpp:22,
                 from /usr/include/boost/signals2.hpp:19,
                 from /tmp/B.gZVIjh/BUILD/domoticz-2020.2/push/BasePush.h:3,
                 from /tmp/B.gZVIjh/BUILD/domoticz-2020.2/push/GooglePubSubPush.h:3,
                 from /tmp/B.gZVIjh/BUILD/domoticz-2020.2/push/GooglePubSubPush.cpp:2:
/usr/include/boost/mpl/aux_/preprocessed/gcc/placeholders.hpp:55:16: note:   'mpl_::_3'
   55 | typedef arg<3> _3;
      |                ^~
In file included from /usr/include/boost/bind/bind.hpp:2356,
                 from /usr/include/boost/signals2/slot.hpp:15,
                 from /usr/include/boost/signals2/connection.hpp:24,
                 from /usr/include/boost/signals2/signal.hpp:22,
                 from /usr/include/boost/signals2.hpp:19,
                 from /tmp/B.gZVIjh/BUILD/domoticz-2020.2/push/BasePush.h:3,
                 from /tmp/B.gZVIjh/BUILD/domoticz-2020.2/push/GooglePubSubPush.h:3,
                 from /tmp/B.gZVIjh/BUILD/domoticz-2020.2/push/GooglePubSubPush.cpp:2:
/usr/include/boost/bind/placeholders.hpp:48:38: note:   'boost::placeholders::_3'
   48 | BOOST_STATIC_CONSTEXPR boost::arg<3> _3;
      |                                      ^~
In file included from /usr/include/boost/parameter/aux_/is_placeholder.hpp:46,
                 from /usr/include/boost/parameter/value_type.hpp:101,
                 from /usr/include/boost/parameter/aux_/arg_list.hpp:1207,
                 from /usr/include/boost/parameter/parameters.hpp:22,
                 from /usr/include/boost/signals2/signal_type.hpp:27,
                 from /usr/include/boost/signals2.hpp:20,
                 from /tmp/B.gZVIjh/BUILD/domoticz-2020.2/push/BasePush.h:3,
                 from /tmp/B.gZVIjh/BUILD/domoticz-2020.2/push/GooglePubSubPush.h:3,
                 from /tmp/B.gZVIjh/BUILD/domoticz-2020.2/push/GooglePubSubPush.cpp:2:
/usr/include/boost/mp11/bind.hpp:47:7: note:   'boost::mp11::_3'
   47 | using _3 = mp_arg<2>;
      |       ^~
In file included from /usr/include/boost/mpl/aux_/include_preprocessed.hpp:37,
                 from /usr/include/boost/mpl/placeholders.hpp:43,
                 from /usr/include/boost/iterator/iterator_categories.hpp:16,
                 from /usr/include/boost/iterator/iterator_adaptor.hpp:14,
                 from /usr/include/boost/iterator/reverse_iterator.hpp:10,
                 from /usr/include/boost/signals2/detail/auto_buffer.hpp:22,
                 from /usr/include/boost/signals2/connection.hpp:21,
                 from /usr/include/boost/signals2/signal.hpp:22,
                 from /usr/include/boost/signals2.hpp:19,
                 from /tmp/B.gZVIjh/BUILD/domoticz-2020.2/push/BasePush.h:3,
                 from /tmp/B.gZVIjh/BUILD/domoticz-2020.2/push/GooglePubSubPush.h:3,
                 from /tmp/B.gZVIjh/BUILD/domoticz-2020.2/push/GooglePubSubPush.cpp:2:
/usr/include/boost/mpl/aux_/preprocessed/gcc/placeholders.hpp:55:16: note:   'mpl_::_3'
   55 | typedef arg<3> _3;
      |                ^~
/tmp/B.gZVIjh/BUILD/domoticz-2020.2/push/GooglePubSubPush.cpp:42:125: error: '_4' was not declared in this scope
   42 |  m_sConnection = m_mainworker.sOnDeviceReceived.connect(boost::bind(&CGooglePubSubPush::OnDeviceReceived, this, _1, _2, _3, _4));
      |                                                                                                                             ^~
/tmp/B.gZVIjh/BUILD/domoticz-2020.2/push/GooglePubSubPush.cpp:42:125: note: suggested alternatives:
In file included from /usr/include/boost/mpl/aux_/include_preprocessed.hpp:37,
                 from /usr/include/boost/mpl/placeholders.hpp:43,
                 from /usr/include/boost/iterator/iterator_categories.hpp:16,
                 from /usr/include/boost/iterator/iterator_adaptor.hpp:14,
                 from /usr/include/boost/iterator/reverse_iterator.hpp:10,
                 from /usr/include/boost/signals2/detail/auto_buffer.hpp:22,
                 from /usr/include/boost/signals2/connection.hpp:21,
                 from /usr/include/boost/signals2/signal.hpp:22,
                 from /usr/include/boost/signals2.hpp:19,
                 from /tmp/B.gZVIjh/BUILD/domoticz-2020.2/push/BasePush.h:3,
                 from /tmp/B.gZVIjh/BUILD/domoticz-2020.2/push/GooglePubSubPush.h:3,
                 from /tmp/B.gZVIjh/BUILD/domoticz-2020.2/push/GooglePubSubPush.cpp:2:
/usr/include/boost/mpl/aux_/preprocessed/gcc/placeholders.hpp:68:16: note:   'mpl_::_4'
   68 | typedef arg<4> _4;
      |                ^~
In file included from /usr/include/boost/smart_ptr/detail/shared_count.hpp:39,
                 from /usr/include/boost/smart_ptr/shared_ptr.hpp:28,
                 from /usr/include/boost/shared_ptr.hpp:17,
                 from /usr/include/boost/signals2/deconstruct.hpp:28,
                 from /usr/include/boost/signals2.hpp:15,
                 from /tmp/B.gZVIjh/BUILD/domoticz-2020.2/push/BasePush.h:3,
                 from /tmp/B.gZVIjh/BUILD/domoticz-2020.2/push/GooglePubSubPush.h:3,
                 from /tmp/B.gZVIjh/BUILD/domoticz-2020.2/push/GooglePubSubPush.cpp:2:
/usr/include/c++/10.2.0/functional:224:34: note:   'std::placeholders::_4'
  224 |     extern const _Placeholder<4> _4;
      |                                  ^~
In file included from /usr/include/boost/mpl/aux_/include_preprocessed.hpp:37,
                 from /usr/include/boost/mpl/placeholders.hpp:43,
                 from /usr/include/boost/iterator/iterator_categories.hpp:16,
                 from /usr/include/boost/iterator/iterator_adaptor.hpp:14,
                 from /usr/include/boost/iterator/reverse_iterator.hpp:10,
                 from /usr/include/boost/signals2/detail/auto_buffer.hpp:22,
                 from /usr/include/boost/signals2/connection.hpp:21,
                 from /usr/include/boost/signals2/signal.hpp:22,
                 from /usr/include/boost/signals2.hpp:19,
                 from /tmp/B.gZVIjh/BUILD/domoticz-2020.2/push/BasePush.h:3,
                 from /tmp/B.gZVIjh/BUILD/domoticz-2020.2/push/GooglePubSubPush.h:3,
                 from /tmp/B.gZVIjh/BUILD/domoticz-2020.2/push/GooglePubSubPush.cpp:2:
/usr/include/boost/mpl/aux_/preprocessed/gcc/placeholders.hpp:68:16: note:   'mpl_::_4'
   68 | typedef arg<4> _4;
      |                ^~
In file included from /usr/include/boost/bind/bind.hpp:2356,
                 from /usr/include/boost/signals2/slot.hpp:15,
                 from /usr/include/boost/signals2/connection.hpp:24,
                 from /usr/include/boost/signals2/signal.hpp:22,
                 from /usr/include/boost/signals2.hpp:19,
                 from /tmp/B.gZVIjh/BUILD/domoticz-2020.2/push/BasePush.h:3,
                 from /tmp/B.gZVIjh/BUILD/domoticz-2020.2/push/GooglePubSubPush.h:3,
                 from /tmp/B.gZVIjh/BUILD/domoticz-2020.2/push/GooglePubSubPush.cpp:2:
/usr/include/boost/bind/placeholders.hpp:49:38: note:   'boost::placeholders::_4'
   49 | BOOST_STATIC_CONSTEXPR boost::arg<4> _4;
      |                                      ^~
In file included from /usr/include/boost/parameter/aux_/is_placeholder.hpp:46,
                 from /usr/include/boost/parameter/value_type.hpp:101,
                 from /usr/include/boost/parameter/aux_/arg_list.hpp:1207,
                 from /usr/include/boost/parameter/parameters.hpp:22,
                 from /usr/include/boost/signals2/signal_type.hpp:27,
                 from /usr/include/boost/signals2.hpp:20,
                 from /tmp/B.gZVIjh/BUILD/domoticz-2020.2/push/BasePush.h:3,
                 from /tmp/B.gZVIjh/BUILD/domoticz-2020.2/push/GooglePubSubPush.h:3,
                 from /tmp/B.gZVIjh/BUILD/domoticz-2020.2/push/GooglePubSubPush.cpp:2:
/usr/include/boost/mp11/bind.hpp:48:7: note:   'boost::mp11::_4'
   48 | using _4 = mp_arg<3>;
      |       ^~
In file included from /usr/include/boost/mpl/aux_/include_preprocessed.hpp:37,
                 from /usr/include/boost/mpl/placeholders.hpp:43,
                 from /usr/include/boost/iterator/iterator_categories.hpp:16,
                 from /usr/include/boost/iterator/iterator_adaptor.hpp:14,
                 from /usr/include/boost/iterator/reverse_iterator.hpp:10,
                 from /usr/include/boost/signals2/detail/auto_buffer.hpp:22,
                 from /usr/include/boost/signals2/connection.hpp:21,
                 from /usr/include/boost/signals2/signal.hpp:22,
                 from /usr/include/boost/signals2.hpp:19,
                 from /tmp/B.gZVIjh/BUILD/domoticz-2020.2/push/BasePush.h:3,
                 from /tmp/B.gZVIjh/BUILD/domoticz-2020.2/push/GooglePubSubPush.h:3,
                 from /tmp/B.gZVIjh/BUILD/domoticz-2020.2/push/GooglePubSubPush.cpp:2:
/usr/include/boost/mpl/aux_/preprocessed/gcc/placeholders.hpp:68:16: note:   'mpl_::_4'
   68 | typedef arg<4> _4;
      |                ^~
make[2]: *** [CMakeFiles/domoticz.dir/build.make:597: CMakeFiles/domoticz.dir/push/GooglePubSubPush.cpp.o] Error 1
make[2]: Leaving directory '/tmp/B.gZVIjh/BUILD/domoticz-2020.2/build'
make[2]: Entering directory '/tmp/B.gZVIjh/BUILD/domoticz-2020.2/build'
[ 14%] Building CXX object CMakeFiles/domoticz.dir/push/BasePush.cpp.o
/usr/bin/x86_64-pld-linux-gnux32-g++  -DENABLE_PYTHON -DHAVE_EXECINFO_H -DHAVE_LINUX_I2C -DHAVE_LINUX_SPI -DWITH_EXTERNAL_TINYXPATH -DWITH_LIBUSB -DWITH_OPENZWAVE -DWITH_TLS -DWWW_ENABLE_SSL -I/usr/include/lua5.3 -I/usr/include/python3.8 -I/tmp/B.gZVIjh/BUILD/domoticz-2020.2/main -I/usr/include/jsoncpp -I/usr/include/minizip -I/usr/include/tinyxpath -I/usr/include/openzwave  -std=c++11 -Wno-psabi -rdynamic -O2 -fwrapv -pipe -Wformat -Werror=format-security -gdwarf-4 -fno-debug-types-section -fvar-tracking-assignments -g2 -Wp,-D_FORTIFY_SOURCE=2 -fstack-protector-strong --param=ssp-buffer-size=4 -Werror=trampolines -fPIC -mtune=generic -march=x86-64 -gdwarf-4 -fno-debug-types-section -fvar-tracking-assignments -g2  -DNDEBUG -DQT_NO_DEBUG   -Winvalid-pch -include /tmp/B.gZVIjh/BUILD/domoticz-2020.2/build/CMakeFiles/domoticz.dir/cmake_pch.hxx -o CMakeFiles/domoticz.dir/push/BasePush.cpp.o -c /tmp/B.gZVIjh/BUILD/domoticz-2020.2/push/BasePush.cpp
make[2]: Leaving directory '/tmp/B.gZVIjh/BUILD/domoticz-2020.2/build'
make[2]: Entering directory '/tmp/B.gZVIjh/BUILD/domoticz-2020.2/build'
[ 10%] Building CXX object CMakeFiles/domoticz.dir/main/Scheduler.cpp.o
/usr/bin/x86_64-pld-linux-gnux32-g++  -DENABLE_PYTHON -DHAVE_EXECINFO_H -DHAVE_LINUX_I2C -DHAVE_LINUX_SPI -DWITH_EXTERNAL_TINYXPATH -DWITH_LIBUSB -DWITH_OPENZWAVE -DWITH_TLS -DWWW_ENABLE_SSL -I/usr/include/lua5.3 -I/usr/include/python3.8 -I/tmp/B.gZVIjh/BUILD/domoticz-2020.2/main -I/usr/include/jsoncpp -I/usr/include/minizip -I/usr/include/tinyxpath -I/usr/include/openzwave  -std=c++11 -Wno-psabi -rdynamic -O2 -fwrapv -pipe -Wformat -Werror=format-security -gdwarf-4 -fno-debug-types-section -fvar-tracking-assignments -g2 -Wp,-D_FORTIFY_SOURCE=2 -fstack-protector-strong --param=ssp-buffer-size=4 -Werror=trampolines -fPIC -mtune=generic -march=x86-64 -gdwarf-4 -fno-debug-types-section -fvar-tracking-assignments -g2  -DNDEBUG -DQT_NO_DEBUG   -Winvalid-pch -include /tmp/B.gZVIjh/BUILD/domoticz-2020.2/build/CMakeFiles/domoticz.dir/cmake_pch.hxx -o CMakeFiles/domoticz.dir/main/Scheduler.cpp.o -c /tmp/B.gZVIjh/BUILD/domoticz-2020.2/main/Scheduler.cpp
make[2]: Leaving directory '/tmp/B.gZVIjh/BUILD/domoticz-2020.2/build'
make[2]: Entering directory '/tmp/B.gZVIjh/BUILD/domoticz-2020.2/build'
[ 13%] Building CXX object CMakeFiles/domoticz.dir/main/WebServerHelper.cpp.o
/usr/bin/x86_64-pld-linux-gnux32-g++  -DENABLE_PYTHON -DHAVE_EXECINFO_H -DHAVE_LINUX_I2C -DHAVE_LINUX_SPI -DWITH_EXTERNAL_TINYXPATH -DWITH_LIBUSB -DWITH_OPENZWAVE -DWITH_TLS -DWWW_ENABLE_SSL -I/usr/include/lua5.3 -I/usr/include/python3.8 -I/tmp/B.gZVIjh/BUILD/domoticz-2020.2/main -I/usr/include/jsoncpp -I/usr/include/minizip -I/usr/include/tinyxpath -I/usr/include/openzwave  -std=c++11 -Wno-psabi -rdynamic -O2 -fwrapv -pipe -Wformat -Werror=format-security -gdwarf-4 -fno-debug-types-section -fvar-tracking-assignments -g2 -Wp,-D_FORTIFY_SOURCE=2 -fstack-protector-strong --param=ssp-buffer-size=4 -Werror=trampolines -fPIC -mtune=generic -march=x86-64 -gdwarf-4 -fno-debug-types-section -fvar-tracking-assignments -g2  -DNDEBUG -DQT_NO_DEBUG   -Winvalid-pch -include /tmp/B.gZVIjh/BUILD/domoticz-2020.2/build/CMakeFiles/domoticz.dir/cmake_pch.hxx -o CMakeFiles/domoticz.dir/main/WebServerHelper.cpp.o -c /tmp/B.gZVIjh/BUILD/domoticz-2020.2/main/WebServerHelper.cpp
make[2]: Leaving directory '/tmp/B.gZVIjh/BUILD/domoticz-2020.2/build'
make[2]: Entering directory '/tmp/B.gZVIjh/BUILD/domoticz-2020.2/build'
[  4%] Building CXX object CMakeFiles/domoticz.dir/main/EventSystem.cpp.o
/usr/bin/x86_64-pld-linux-gnux32-g++  -DENABLE_PYTHON -DHAVE_EXECINFO_H -DHAVE_LINUX_I2C -DHAVE_LINUX_SPI -DWITH_EXTERNAL_TINYXPATH -DWITH_LIBUSB -DWITH_OPENZWAVE -DWITH_TLS -DWWW_ENABLE_SSL -I/usr/include/lua5.3 -I/usr/include/python3.8 -I/tmp/B.gZVIjh/BUILD/domoticz-2020.2/main -I/usr/include/jsoncpp -I/usr/include/minizip -I/usr/include/tinyxpath -I/usr/include/openzwave  -std=c++11 -Wno-psabi -rdynamic -O2 -fwrapv -pipe -Wformat -Werror=format-security -gdwarf-4 -fno-debug-types-section -fvar-tracking-assignments -g2 -Wp,-D_FORTIFY_SOURCE=2 -fstack-protector-strong --param=ssp-buffer-size=4 -Werror=trampolines -fPIC -mtune=generic -march=x86-64 -gdwarf-4 -fno-debug-types-section -fvar-tracking-assignments -g2  -DNDEBUG -DQT_NO_DEBUG   -Winvalid-pch -include /tmp/B.gZVIjh/BUILD/domoticz-2020.2/build/CMakeFiles/domoticz.dir/cmake_pch.hxx -o CMakeFiles/domoticz.dir/main/EventSystem.cpp.o -c /tmp/B.gZVIjh/BUILD/domoticz-2020.2/main/EventSystem.cpp
make[2]: Leaving directory '/tmp/B.gZVIjh/BUILD/domoticz-2020.2/build'
make[2]: Entering directory '/tmp/B.gZVIjh/BUILD/domoticz-2020.2/build'
[  8%] Building CXX object CMakeFiles/domoticz.dir/main/mainworker.cpp.o
/usr/bin/x86_64-pld-linux-gnux32-g++  -DENABLE_PYTHON -DHAVE_EXECINFO_H -DHAVE_LINUX_I2C -DHAVE_LINUX_SPI -DWITH_EXTERNAL_TINYXPATH -DWITH_LIBUSB -DWITH_OPENZWAVE -DWITH_TLS -DWWW_ENABLE_SSL -I/usr/include/lua5.3 -I/usr/include/python3.8 -I/tmp/B.gZVIjh/BUILD/domoticz-2020.2/main -I/usr/include/jsoncpp -I/usr/include/minizip -I/usr/include/tinyxpath -I/usr/include/openzwave  -std=c++11 -Wno-psabi -rdynamic -O2 -fwrapv -pipe -Wformat -Werror=format-security -gdwarf-4 -fno-debug-types-section -fvar-tracking-assignments -g2 -Wp,-D_FORTIFY_SOURCE=2 -fstack-protector-strong --param=ssp-buffer-size=4 -Werror=trampolines -fPIC -mtune=generic -march=x86-64 -gdwarf-4 -fno-debug-types-section -fvar-tracking-assignments -g2  -DNDEBUG -DQT_NO_DEBUG   -Winvalid-pch -include /tmp/B.gZVIjh/BUILD/domoticz-2020.2/build/CMakeFiles/domoticz.dir/cmake_pch.hxx -o CMakeFiles/domoticz.dir/main/mainworker.cpp.o -c /tmp/B.gZVIjh/BUILD/domoticz-2020.2/main/mainworker.cpp
In file included from /usr/include/boost/bind.hpp:30,
                 from /tmp/B.gZVIjh/BUILD/domoticz-2020.2/main/../hardware/Yeelight.h:5,
                 from /tmp/B.gZVIjh/BUILD/domoticz-2020.2/main/mainworker.cpp:126:
/usr/include/boost/bind.hpp:36:1: note: '#pragma message: The practice of declaring the Bind placeholders (_1, _2, ...) in the global namespace is deprecated. Please use <boost/bind/bind.hpp> + using namespace boost::placeholders, or define BOOST_BIND_GLOBAL_PLACEHOLDERS to retain the current behavior.'
   36 | BOOST_PRAGMA_MESSAGE(
      | ^~~~~~~~~~~~~~~~~~~~
make[2]: Leaving directory '/tmp/B.gZVIjh/BUILD/domoticz-2020.2/build'
make[2]: Entering directory '/tmp/B.gZVIjh/BUILD/domoticz-2020.2/build'
[ 11%] Building CXX object CMakeFiles/domoticz.dir/main/SQLHelper.cpp.o
/usr/bin/x86_64-pld-linux-gnux32-g++  -DENABLE_PYTHON -DHAVE_EXECINFO_H -DHAVE_LINUX_I2C -DHAVE_LINUX_SPI -DWITH_EXTERNAL_TINYXPATH -DWITH_LIBUSB -DWITH_OPENZWAVE -DWITH_TLS -DWWW_ENABLE_SSL -I/usr/include/lua5.3 -I/usr/include/python3.8 -I/tmp/B.gZVIjh/BUILD/domoticz-2020.2/main -I/usr/include/jsoncpp -I/usr/include/minizip -I/usr/include/tinyxpath -I/usr/include/openzwave  -std=c++11 -Wno-psabi -rdynamic -O2 -fwrapv -pipe -Wformat -Werror=format-security -gdwarf-4 -fno-debug-types-section -fvar-tracking-assignments -g2 -Wp,-D_FORTIFY_SOURCE=2 -fstack-protector-strong --param=ssp-buffer-size=4 -Werror=trampolines -fPIC -mtune=generic -march=x86-64 -gdwarf-4 -fno-debug-types-section -fvar-tracking-assignments -g2  -DNDEBUG -DQT_NO_DEBUG   -Winvalid-pch -include /tmp/B.gZVIjh/BUILD/domoticz-2020.2/build/CMakeFiles/domoticz.dir/cmake_pch.hxx -o CMakeFiles/domoticz.dir/main/SQLHelper.cpp.o -c /tmp/B.gZVIjh/BUILD/domoticz-2020.2/main/SQLHelper.cpp
make[2]: Leaving directory '/tmp/B.gZVIjh/BUILD/domoticz-2020.2/build'
make[2]: Entering directory '/tmp/B.gZVIjh/BUILD/domoticz-2020.2/build'
[ 13%] Building CXX object CMakeFiles/domoticz.dir/main/WebServer.cpp.o
/usr/bin/x86_64-pld-linux-gnux32-g++  -DENABLE_PYTHON -DHAVE_EXECINFO_H -DHAVE_LINUX_I2C -DHAVE_LINUX_SPI -DWITH_EXTERNAL_TINYXPATH -DWITH_LIBUSB -DWITH_OPENZWAVE -DWITH_TLS -DWWW_ENABLE_SSL -I/usr/include/lua5.3 -I/usr/include/python3.8 -I/tmp/B.gZVIjh/BUILD/domoticz-2020.2/main -I/usr/include/jsoncpp -I/usr/include/minizip -I/usr/include/tinyxpath -I/usr/include/openzwave  -std=c++11 -Wno-psabi -rdynamic -O2 -fwrapv -pipe -Wformat -Werror=format-security -gdwarf-4 -fno-debug-types-section -fvar-tracking-assignments -g2 -Wp,-D_FORTIFY_SOURCE=2 -fstack-protector-strong --param=ssp-buffer-size=4 -Werror=trampolines -fPIC -mtune=generic -march=x86-64 -gdwarf-4 -fno-debug-types-section -fvar-tracking-assignments -g2  -DNDEBUG -DQT_NO_DEBUG   -Winvalid-pch -include /tmp/B.gZVIjh/BUILD/domoticz-2020.2/build/CMakeFiles/domoticz.dir/cmake_pch.hxx -o CMakeFiles/domoticz.dir/main/WebServer.cpp.o -c /tmp/B.gZVIjh/BUILD/domoticz-2020.2/main/WebServer.cpp
In file included from /usr/include/boost/bind.hpp:30,
                 from /tmp/B.gZVIjh/BUILD/domoticz-2020.2/main/WebServer.cpp:4:
/usr/include/boost/bind.hpp:36:1: note: '#pragma message: The practice of declaring the Bind placeholders (_1, _2, ...) in the global namespace is deprecated. Please use <boost/bind/bind.hpp> + using namespace boost::placeholders, or define BOOST_BIND_GLOBAL_PLACEHOLDERS to retain the current behavior.'
   36 | BOOST_PRAGMA_MESSAGE(
      | ^~~~~~~~~~~~~~~~~~~~
make[2]: Leaving directory '/tmp/B.gZVIjh/BUILD/domoticz-2020.2/build'
make[1]: *** [CMakeFiles/Makefile2:128: CMakeFiles/domoticz.dir/all] Error 2
make: *** [Makefile:175: all] Error 2
error: Bad exit status from /tmp/B.gZVIjh/BUILD/tmp/rpm-tmp.90643 (%build)


RPM build errors:
    Bad exit status from /tmp/B.gZVIjh/BUILD/tmp/rpm-tmp.90643 (%build)
ended at: Sat Aug  1 10:36:30 2020, done in 0:02:08.893496
error: No files produced.
+ chmod -R u+rwX /tmp/B.gZVIjh/BUILD
+ rm -rf /tmp/B.gZVIjh/tmp /tmp/B.gZVIjh/BUILD
+ rm -rf /tmp/B.gZVIjh
Begin-PLD-Builder-Info
Build-Time: user:448.20s sys:21.12s real:134.57s (faults io:0 non-io:3895677)

End-PLD-Builder-Info
[Back to list of logs] [View rpm -qa of builder]