FailedOk

th/SRPMS[OK]
th/x32[OK]
th/i686[OK]
th/x86_64[OK]

ac/SRPMS[OK]
ac/i386[OK]
ac/i586[OK]
ac/i686[OK]
ac/alpha[OK]
ac/amd64[OK]
ac/athlon[OK]
ac/ppc[OK]
ac/sparc[OK]
ac/sparc64[OK]

Advanced Search
main()
Powered by PLD Linux
(c) 2002-2021 PLD Team
$Revision: 1.37 $
Powered by sfistak.
Your IP: 3.239.236.140

dovecot C5D416B4-0B6A-4770-A164-9685CC79200A

Status:Failed
Source URL:https://buildlogs.pld-linux.org/pld/th/x32/FAIL/dovecot,C5D416B4-0B6A-4770-A164-9685CC79200A.bz2
text/plain URL:View!
full text:View!
rpm -qa of builder:View!
Date:2021/01/05 12:37:22
Runtime:0:06:00.574652

Toc:

  • error 1
  • Error: Token has expired
  • error 2
  • make[3]: *** [Makefile:899: check-local] Error 1
  • error 3
  • make[2]: *** [Makefile:759: check-am] Error 2
  • error 4
  • make[1]: *** [Makefile:564: check-recursive] Error 1
  • error 5
  • error: Bad exit status from /tmp/B.2a3N2H/BUILD/tmp/rpm-tmp.32474 (%build)
  • error 6
  • RPM build errors:
  • error 7
  • error: No files produced.

Content:

imap url invalid [63] ................................................ : ok
imap url invalid [64]: parse imap://example.com/INBOX/;UID=377;EXPIRE=2011-10-02T00:00:00Z;URLAUTH=anonymous:internal:0ad89fafd79f54afe4523q45aadf2afe  : ok: Invalid URLAUTH token
imap url invalid [64] ................................................ : ok
imap url parse/create [0]: parse  imap://host.example.com/ ........... : ok
imap url parse/create [0]: create imap://host.example.com/ ........... : ok
imap url parse/create [0] ............................................ : ok
imap url parse/create [1]: parse  imap://10.0.0.1/ ................... : ok
imap url parse/create [1]: create imap://10.0.0.1/ ................... : ok
imap url parse/create [1] ............................................ : ok
imap url parse/create [2]: parse  imap://[::1]/ ...................... : ok
imap url parse/create [2]: create imap://[::1]/ ...................... : ok
imap url parse/create [2] ............................................ : ok
imap url parse/create [3]: parse  imap://user@host.example.com/ ...... : ok
imap url parse/create [3]: create imap://user@host.example.com/ ...... : ok
imap url parse/create [3] ............................................ : ok
imap url parse/create [4]: parse  imap://user@host.example.com:993/ .. : ok
imap url parse/create [4]: create imap://user@host.example.com:993/ .. : ok
imap url parse/create [4] ............................................ : ok
imap url parse/create [5]: parse  imap://su%3auser@host.example.com/ . : ok
imap url parse/create [5]: create imap://su%3auser@host.example.com/ . : ok
imap url parse/create [5] ............................................ : ok
imap url parse/create [6]: parse  imap://user;AUTH=PLAIN@host.example.com/  : ok
imap url parse/create [6]: create imap://user;AUTH=PLAIN@host.example.com/  : ok
imap url parse/create [6] ............................................ : ok
imap url parse/create [7]: parse  imap://user;AUTH=PLAIN@host.example.com/INBOX  : ok
imap url parse/create [7]: create imap://user;AUTH=PLAIN@host.example.com/INBOX  : ok
imap url parse/create [7] ............................................ : ok
imap url parse/create [8]: parse  imap://user;AUTH=PLAIN@host.example.com/INBOX/;UID=5  : ok
imap url parse/create [8]: create imap://user;AUTH=PLAIN@host.example.com/INBOX/;UID=5  : ok
imap url parse/create [8] ............................................ : ok
imap url parse/create [9]: parse  imap://user;AUTH=PLAIN@host.example.com/INBOX;UIDVALIDITY=15/;UID=5  : ok
imap url parse/create [9]: create imap://user;AUTH=PLAIN@host.example.com/INBOX;UIDVALIDITY=15/;UID=5  : ok
imap url parse/create [9] ............................................ : ok
imap url parse/create [10]: parse  imap://user;AUTH=PLAIN@host.example.com/INBOX;UIDVALIDITY=15/;UID=5/;SECTION=TEXT  : ok
imap url parse/create [10]: create imap://user;AUTH=PLAIN@host.example.com/INBOX;UIDVALIDITY=15/;UID=5/;SECTION=TEXT  : ok
imap url parse/create [10] ........................................... : ok
imap url parse/create [11]: parse  imap://user;AUTH=PLAIN@host.example.com/INBOX;UIDVALIDITY=15/;UID=5/;SECTION=TEXT/;PARTIAL=1  : ok
imap url parse/create [11]: create imap://user;AUTH=PLAIN@host.example.com/INBOX;UIDVALIDITY=15/;UID=5/;SECTION=TEXT/;PARTIAL=1  : ok
imap url parse/create [11] ........................................... : ok
imap url parse/create [12]: parse  imap://user;AUTH=PLAIN@host.example.com/INBOX;UIDVALIDITY=15/;UID=5/;SECTION=TEXT/;PARTIAL=1.14  : ok
imap url parse/create [12]: create imap://user;AUTH=PLAIN@host.example.com/INBOX;UIDVALIDITY=15/;UID=5/;SECTION=TEXT/;PARTIAL=1.14  : ok
imap url parse/create [12] ........................................... : ok
imap url parse/create [13]: parse  imap://user;AUTH=PLAIN@host.example.com/INBOX;UIDVALIDITY=15/;UID=5/;SECTION=TEXT/;PARTIAL=1.14;URLAUTH=anonymous  : ok
imap url parse/create [13]: create imap://user;AUTH=PLAIN@host.example.com/INBOX;UIDVALIDITY=15/;UID=5/;SECTION=TEXT/;PARTIAL=1.14;URLAUTH=anonymous  : ok
imap url parse/create [13] ........................................... : ok
imap url parse/create [14]: parse  imap://user;AUTH=PLAIN@host.example.com/INBOX;UIDVALIDITY=15/;UID=5/;SECTION=TEXT/;PARTIAL=1.14;URLAUTH=user+username  : ok
imap url parse/create [14]: create imap://user;AUTH=PLAIN@host.example.com/INBOX;UIDVALIDITY=15/;UID=5/;SECTION=TEXT/;PARTIAL=1.14;URLAUTH=user+username  : ok
imap url parse/create [14] ........................................... : ok
imap url parse/create [15]: parse  imap://user;AUTH=PLAIN@host.example.com/INBOX?SUBJECT%20%22Frop?%22  : ok
imap url parse/create [15]: create imap://user;AUTH=PLAIN@host.example.com/INBOX?SUBJECT%20%22Frop?%22  : ok
imap url parse/create [15] ........................................... : ok
imap url parse/create [16]: parse  imap://user%3ba@host.example.com/ . : ok
imap url parse/create [16]: create imap://user%3ba@host.example.com/ . : ok
imap url parse/create [16] ........................................... : ok
imap url parse/create [17]: parse  imap://user%40example.com@host.example.com/  : ok
imap url parse/create [17]: create imap://user%40example.com@host.example.com/  : ok
imap url parse/create [17] ........................................... : ok
imap url parse/create [18]: parse  imap://user%40example.com;AUTH=STR%23ANGE@host.example.com/  : ok
imap url parse/create [18]: create imap://user%40example.com;AUTH=STR%23ANGE@host.example.com/  : ok
imap url parse/create [18] ........................................... : ok
imap url parse/create [19]: parse  imap://user;AUTH=PLAIN@host.example.com/INBOX/Important%3bWork  : ok
imap url parse/create [19]: create imap://user;AUTH=PLAIN@host.example.com/INBOX/Important%3bWork  : ok
imap url parse/create [19] ........................................... : ok
imap url parse/create [20]: parse  imap://user@host.example.com/%23shared/news  : ok
imap url parse/create [20]: create imap://user@host.example.com/%23shared/news  : ok
imap url parse/create [20] ........................................... : ok
imap url parse/create [21]: parse  imap://user@host.example.com/INBOX;UIDVALIDITY=15/;UID=5/;SECTION=HEADER.FIELDS%20(DATE%20FROM)  : ok
imap url parse/create [21]: create imap://user@host.example.com/INBOX;UIDVALIDITY=15/;UID=5/;SECTION=HEADER.FIELDS%20(DATE%20FROM)  : ok
imap url parse/create [21] ........................................... : ok
imap url parse/create [22]: parse  imap://user@host.example.com/INBOX;UIDVALIDITY=15/;UID=5/;SECTION=TEXT/;PARTIAL=1.14;URLAUTH=user+user%3bname  : ok
imap url parse/create [22]: create imap://user@host.example.com/INBOX;UIDVALIDITY=15/;UID=5/;SECTION=TEXT/;PARTIAL=1.14;URLAUTH=user+user%3bname  : ok
imap url parse/create [22] ........................................... : ok
0 / 1022 tests failed
imap mutf7 examples .................................................. : ok
imap mutf7 ucs4 cases ................................................ : ok
imap mutf7 non-utf16 ................................................. : ok
imap mutf7 bad ascii ................................................. : ok
imap mutf7 unnecessary ............................................... : ok
0 / 5 tests failed
imap_parse_system_flag ............................................... : ok
imap_write_arg ....................................................... : ok
0 / 2 tests failed
make[3]: Leaving directory '/tmp/B.2a3N2H/BUILD/dovecot-2.3.13/src/lib-imap'
Making check in lib-imap-storage
make[2]: Nothing to be done for 'check'.
Making check in lib-oauth2
/usr/bin/make  check-local
make[3]: Entering directory '/tmp/B.2a3N2H/BUILD/dovecot-2.3.13/src/lib-oauth2'
for bin in test-oauth2-json test-oauth2-jwt; do \
  if !  ./$bin; then exit 1; fi; \
done
oauth json skip ...................................................... : ok
0 / 1 tests failed
JWT HMAC token ....................................................... : ok
JWT bad token tests .................................................. : ok
JWT broken tokens .................................................... : ok
test-oauth2-jwt.c:101: Assert failed: parse_jwt_token(&req, token, &is_jwt, &error) == 0
test-oauth2-jwt.c:103: Assert failed: error == NULL
test-oauth2-jwt.c:116: Assert failed: got_sub == TRUE
Error: Token has expired
JWT Token dates ...................................................... : FAILED
JWT key id ........................................................... : ok
JWT kid escape ....................................................... : ok
JWT RSA token ........................................................ : ok
JWT RSAPSS token ..................................................... : ok
JWT ECDSA token ...................................................... : ok
1 / 9 tests failed
make[3]: *** [Makefile:899: check-local] Error 1
make[3]: Leaving directory '/tmp/B.2a3N2H/BUILD/dovecot-2.3.13/src/lib-oauth2'
make[2]: *** [Makefile:759: check-am] Error 2
make[1]: *** [Makefile:564: check-recursive] Error 1
make: *** [Makefile:685: check-recursive] Error 1
error: Bad exit status from /tmp/B.2a3N2H/BUILD/tmp/rpm-tmp.32474 (%build)


RPM build errors:
    Bad exit status from /tmp/B.2a3N2H/BUILD/tmp/rpm-tmp.32474 (%build)
ended at: Tue Jan  5 12:37:20 2021, done in 0:06:00.574652
error: No files produced.
+ chmod -R u+rwX /tmp/B.2a3N2H/BUILD
+ rm -rf /tmp/B.2a3N2H/tmp /tmp/B.2a3N2H/BUILD
+ rm -rf /tmp/B.2a3N2H
Begin-PLD-Builder-Info
Build-Time: user:568.75s sys:179.14s real:364.50s (faults io:1006 non-io:25096912)

End-PLD-Builder-Info
[Back to list of logs] [View rpm -qa of builder]