FailedOk

th/SRPMS[OK]
th/x32[OK]
th/i686[OK]
th/x86_64[OK]

ac/SRPMS[OK]
ac/i386[OK]
ac/i586[OK]
ac/i686[OK]
ac/alpha[OK]
ac/amd64[OK]
ac/athlon[OK]
ac/ppc[OK]
ac/sparc[OK]
ac/sparc64[OK]

Advanced Search
main()
Powered by PLD Linux
(c) 2002-2018 PLD Team
$Revision: 1.37 $
Powered by sqlite3.
Your IP: 54.198.27.243

dovecot-pigeonhole 10702427-af0b-443c-8c6a-9e35289f691d

Status:Failed
Source URL:ftp://buildlogs.pld-linux.org/th/x32/FAIL/dovecot-pigeonhole,10702427-af0b-443c-8c6a-9e35289f691d.bz2
text/plain URL:View!
rpm -qa of builder:View!
Date:2018/08/04 21:53:32
Runtime:0:00:06.392896

Toc:

  • prep
  • Executing(%prep): /bin/sh -e /tmp/B.f3I9vN/BUILD/tmp/rpm-tmp.48899
  • build
  • Executing(%build): /bin/sh -e /tmp/B.f3I9vN/BUILD/tmp/rpm-tmp.48899
  • error 1
  • edit-mail.c:235:14: error: too few arguments to function 'mailbox_transaction_begin'
  • error 2
  • edit-mail.c:1662:2: error: too few arguments to function 'edmail->wrapped->v.set_cache_corrupted'
  • error 3
  • edit-mail.c:1671:21: error: 'struct mail_vfuncs' has no member named 'set_cache_corrupted_reason'; did you mean 'set_cache_corrupted'?
  • error 4
  • edit-mail.c:2156:9: error: too few arguments to function 'i_stream_create'
  • error 5
  • make[4]: *** [Makefile:466: edit-mail.lo] Error 1
  • error 6
  • make[3]: *** [Makefile:838: all-recursive] Error 1
  • error 7
  • make[2]: *** [Makefile:414: all-recursive] Error 1
  • error 8
  • make[1]: *** [Makefile:729: all-recursive] Error 1
  • error 9
  • error: Bad exit status from /tmp/B.f3I9vN/BUILD/tmp/rpm-tmp.48899 (%build)
  • error 10
  • RPM build errors:
  • error 11
  • error: No files produced.

Content:

request from: baggins
checking if we should skip the build
started at: Sat Aug  4 21:53:22 2018
killing old processes on a builder
sending signal 9 to pid -1
Killed
cleaning up /tmp
fetching https://srcbuilder.pld-linux.org/th//srpms/10702427-af0b-443c-8c6a-9e35289f691d/dovecot-pigeonhole-2.2_0.4.20-7.src.rpm
fetched 1750434 bytes, 2750.9 K/s
installing srpm: dovecot-pigeonhole-2.2_0.4.20-7.src.rpm
+ install -d /tmp/B.f3I9vN/BUILD /tmp/B.f3I9vN/RPMS
+ LC_ALL=en_US.UTF-8
+ rpm -qp --changelog dovecot-pigeonhole-2.2_0.4.20-7.src.rpm
* Sat Aug 04 2018 PLD Linux Team <feedback@pld-linux.org>
- For complete changelog see: http://git.pld-linux.org/?p=packages/dovecot-pigeonhole.git;a=log;h=master
* Sat Aug 04 2018 Jan Rękorajski <baggins@pld-linux.org> eca7538
- release 7 (by relup.sh) * Tue Jun 12 2018 Jan Rękorajski <baggins@pld-linux.org> 91738a2
- release 6 (by relup.sh) * Tue Mar 20 2018 Jan Rękorajski <baggins@pld-linux.org> b328d98
- release 5 (by relup.sh) * Fri Mar 02 2018 Jan Rękorajski <baggins@pld-linux.org> 6fe5184
- release 4 (by relup.sh) * Sun Nov 26 2017 Jan Rękorajski <baggins@pld-linux.org> b96bcf0
- release 3 (by relup.sh) * Sun Oct 15 2017 Jan Rękorajski <baggins@pld-linux.org> 020cd61
- release 2 (by relup.sh) * Sun Sep 03 2017 Jan Rękorajski <baggins@pld-linux.org> 7cfb9d7
- up to 0.4.20 * Sat Aug 26 2017 Jan Rękorajski <baggins@pld-linux.org> d0fa6f9
- release 6 (by relup.sh) + rpm -Uhv --nodeps --define '_topdir /tmp/B.f3I9vN' --define '_specdir %{_topdir}' --define '_sourcedir %{_specdir}' --define '_rpmdir %{_topdir}/RPMS' --define '_builddir %{_topdir}/BUILD' dovecot-pigeonhole-2.2_0.4.20-7.src.rpm Preparing... ################################################## dovecot-pigeonhole ################################################## + rm -f dovecot-pigeonhole-2.2_0.4.20-7.src.rpm + install -m 700 -d /tmp/B.f3I9vN/BUILD/tmp + TMPDIR=/tmp/B.f3I9vN/BUILD/tmp + exec nice -n 0 rpmbuild -bp --short-circuit --nodeps --define '_topdir /tmp/B.f3I9vN' --define '_specdir %{_topdir}' --define '_sourcedir %{_specdir}' --define '_rpmdir %{_topdir}/RPMS' --define '_builddir %{_topdir}/BUILD' --target x32-pld-linux --define 'prep exit 0' /tmp/B.f3I9vN/dovecot-pigeonhole.spec Building target platforms: x32-pld-linux checking BuildConflict-ing packages no BuildConflicts found checking BR rpm: Building target platforms: x32-pld-linux no BR needed building RPM using: set -ex; : build-id: 10702427-af0b-443c-8c6a-9e35289f691d; TMPDIR=/tmp/B.f3I9vN/BUILD/tmp exec nice -n 0 rpmbuild -bb --define '_smp_mflags -j9' --define '_make_opts -Otarget' --define '_pld_builder 1' --define '_topdir /tmp/B.f3I9vN' --define '_specdir %{_topdir}' --define '_sourcedir %{_specdir}' --define '_rpmdir %{_topdir}/RPMS' --define '_builddir %{_topdir}/BUILD' --target x32-pld-linux /tmp/B.f3I9vN/dovecot-pigeonhole.spec + : build-id: 10702427-af0b-443c-8c6a-9e35289f691d + TMPDIR=/tmp/B.f3I9vN/BUILD/tmp + exec nice -n 0 rpmbuild -bb --define '_smp_mflags -j9' --define '_make_opts -Otarget' --define '_pld_builder 1' --define '_topdir /tmp/B.f3I9vN' --define '_specdir %{_topdir}' --define '_sourcedir %{_specdir}' --define '_rpmdir %{_topdir}/RPMS' --define '_builddir %{_topdir}/BUILD' --target x32-pld-linux /tmp/B.f3I9vN/dovecot-pigeonhole.spec Building target platforms: x32-pld-linux Executing(%prep): /bin/sh -e /tmp/B.f3I9vN/BUILD/tmp/rpm-tmp.48899 + umask 022 + cd /tmp/B.f3I9vN/BUILD + cd /tmp/B.f3I9vN/BUILD + rm -rf dovecot-2.2-pigeonhole-0.4.20 + /usr/bin/gzip -dc /tmp/B.f3I9vN/dovecot-2.2-pigeonhole-0.4.20.tar.gz + /bin/tar -xf - + STATUS=0 + '[' 0 -ne 0 ']' + cd dovecot-2.2-pigeonhole-0.4.20 + /bin/id -u + '[' 1000 '=' 0 ']' + /bin/id -u + '[' 1000 '=' 0 ']' + /bin/chmod -Rf a+rX,u+w,g-w,o-w . + exit 0 Executing(%build): /bin/sh -e /tmp/B.f3I9vN/BUILD/tmp/rpm-tmp.48899 HOME=/home/users/builder PATH=/home/users/builder/GNUstep/Tools:/usr/local/bin:/usr/bin:/bin TMPDIR=/tmp/B.f3I9vN/BUILD/tmp + umask 022 + cd /tmp/B.f3I9vN/BUILD + cd dovecot-2.2-pigeonhole-0.4.20 + ./configure 'LDFLAGS=-Wl,--as-needed -Wl,--no-copy-dt-needed-entries -Wl,-z,relro -Wl,-z,combreloc ' 'CFLAGS=-O2 -fwrapv -pipe -Wformat -Werror=format-security -gdwarf-4 -fno-debug-types-section -fvar-tracking-assignments -g2 -Wp,-D_FORTIFY_SOURCE=2 -fstack-protector-strong --param=ssp-buffer-size=4 -fPIC -mtune=generic -march=x86-64 -gdwarf-4 -fno-debug-types-section -fvar-tracking-assignments -g2 ' 'CXXFLAGS=-O2 -fwrapv -pipe -Wformat -Werror=format-security -gdwarf-4 -fno-debug-types-section -fvar-tracking-assignments -g2 -Wp,-D_FORTIFY_SOURCE=2 -fstack-protector-strong --param=ssp-buffer-size=4 -fPIC -mtune=generic -march=x86-64 -gdwarf-4 -fno-debug-types-section -fvar-tracking-assignments -g2 ' 'FFLAGS=-O2 -fwrapv -pipe -Wformat -Werror=format-security -gdwarf-4 -fno-debug-types-section -fvar-tracking-assignments -g2 -Wp,-D_FORTIFY_SOURCE=2 -fstack-protector-strong --param=ssp-buffer-size=4 -fPIC -mtune=generic -march=x86-64 -gdwarf-4 -fno-debug-types-section -fvar-tracking-assignments -g2 ' 'FCFLAGS=-O2 -fwrapv -pipe -Wformat -Werror=format-security -gdwarf-4 -fno-debug-types-section -fvar-tracking-assignments -g2 -Wp,-D_FORTIFY_SOURCE=2 -fstack-protector-strong --param=ssp-buffer-size=4 -fPIC -mtune=generic -march=x86-64 -gdwarf-4 -fno-debug-types-section -fvar-tracking-assignments -g2 ' 'CPPFLAGS=' 'CC=x86_64-pld-linux-gnux32-gcc' 'CXX=x86_64-pld-linux-gnux32-g++' '--host=x86_64-pld-linux-gnux32' '--build=x86_64-pld-linux-gnux32' '--prefix=/usr' '--exec-prefix=/usr' '--bindir=/usr/bin' '--sbindir=/usr/sbin' '--sysconfdir=/etc' '--datadir=/usr/share' '--includedir=/usr/include' '--libdir=/usr/libx32' '--libexecdir=/usr/libexec' '--localstatedir=/var' '--sharedstatedir=/var/lib' '--mandir=/usr/share/man' '--infodir=/usr/share/info' '--x-libraries=/usr/libx32' 'VALGRIND=no' '--with-dovecot=/usr/libx32/dovecot' '--with-managesieve=yes' '--prefix=/usr/libx32/dovecot' checking for a BSD-compatible install... /usr/bin/install -c checking whether build environment is sane... yes checking for a thread-safe mkdir -p... /bin/mkdir -p checking for gawk... gawk checking whether make sets $(MAKE)... yes checking whether make supports nested variables... yes checking whether UID '1000' is supported by ustar format... yes checking whether GID '1000' is supported by ustar format... yes checking how to create a ustar tar archive... gnutar checking whether to enable maintainer-specific portions of Makefiles... no checking for x86_64-pld-linux-gnux32-gcc... x86_64-pld-linux-gnux32-gcc checking whether the C compiler works... yes checking for C compiler default output file name... a.out checking for suffix of executables... checking whether we are cross compiling... no checking for suffix of object files... o checking whether we are using the GNU C compiler... yes checking whether x86_64-pld-linux-gnux32-gcc accepts -g... yes checking for x86_64-pld-linux-gnux32-gcc option to accept ISO C89... none needed checking whether x86_64-pld-linux-gnux32-gcc understands -c and -o together... yes checking for style of include used by make... GNU checking dependency style of x86_64-pld-linux-gnux32-gcc... gcc3 checking how to run the C preprocessor... x86_64-pld-linux-gnux32-gcc -E checking build system type... x86_64-pld-linux-gnux32 checking host system type... x86_64-pld-linux-gnux32 checking how to print strings... print -r checking for a sed that does not truncate output... /bin/sed checking for grep that handles long lines and -e... /bin/grep checking for egrep... /bin/grep -E checking for fgrep... /bin/grep -F checking for ld used by x86_64-pld-linux-gnux32-gcc... /usr/bin/ld checking if the linker (/usr/bin/ld) is GNU ld... yes checking for BSD- or MS-compatible name lister (nm)... /usr/bin/nm -B checking the name lister (/usr/bin/nm -B) interface... BSD nm checking whether ln -s works... yes checking the maximum length of command line arguments... 1572864 checking whether the shell understands some XSI constructs... yes checking whether the shell understands "+="... yes checking how to convert x86_64-pld-linux-gnux32 file names to x86_64-pld-linux-gnux32 format... func_convert_file_noop checking how to convert x86_64-pld-linux-gnux32 file names to toolchain format... func_convert_file_noop checking for /usr/bin/ld option to reload object files... -r checking for x86_64-pld-linux-gnux32-objdump... no checking for objdump... objdump checking how to recognize dependent libraries... pass_all checking for x86_64-pld-linux-gnux32-dlltool... no checking for dlltool... no checking how to associate runtime and link libraries... print -r -- checking for x86_64-pld-linux-gnux32-ar... no checking for ar... ar checking for archiver @FILE support... @ checking for x86_64-pld-linux-gnux32-strip... no checking for strip... strip checking for x86_64-pld-linux-gnux32-ranlib... no checking for ranlib... ranlib checking command to parse /usr/bin/nm -B output from x86_64-pld-linux-gnux32-gcc object... ok checking for sysroot... no checking for x86_64-pld-linux-gnux32-mt... no checking for mt... no checking if : is a manifest tool... no checking for ANSI C header files... yes checking for sys/types.h... yes checking for sys/stat.h... yes checking for stdlib.h... yes checking for string.h... yes checking for memory.h... yes checking for strings.h... yes checking for inttypes.h... yes checking for stdint.h... yes checking for unistd.h... yes checking for dlfcn.h... yes checking for objdir... .libs checking if x86_64-pld-linux-gnux32-gcc supports -fno-rtti -fno-exceptions... no checking for x86_64-pld-linux-gnux32-gcc option to produce PIC... -fPIC -DPIC checking if x86_64-pld-linux-gnux32-gcc PIC flag -fPIC -DPIC works... yes checking if x86_64-pld-linux-gnux32-gcc static flag -static works... yes checking if x86_64-pld-linux-gnux32-gcc supports -c -o file.o... yes checking if x86_64-pld-linux-gnux32-gcc supports -c -o file.o... (cached) yes checking whether the x86_64-pld-linux-gnux32-gcc linker (/usr/bin/ld -m elf32_x86_64) supports shared libraries... yes checking whether -lc should be explicitly linked in... no checking dynamic linker characteristics... GNU/Linux ld.so checking how to hardcode library paths into programs... immediate checking whether stripping libraries is possible... yes checking if libtool supports shared libraries... yes checking whether to build shared libraries... yes checking whether to build static libraries... yes checking for "/usr/libx32/dovecot/dovecot-config"... /usr/libx32/dovecot/dovecot-config checking whether OS supports plugin dependencies... yes checking for valgrind... no checking that generated files are newer than configure... done configure: creating ./config.status config.status: creating Makefile config.status: creating doc/Makefile config.status: creating doc/man/Makefile config.status: creating doc/example-config/Makefile config.status: creating doc/example-config/conf.d/Makefile config.status: creating doc/rfc/Makefile config.status: creating doc/extensions/Makefile config.status: creating doc/locations/Makefile config.status: creating doc/plugins/Makefile config.status: creating src/Makefile config.status: creating src/lib-sieve/Makefile config.status: creating src/lib-sieve/util/Makefile config.status: creating src/lib-sieve/storage/Makefile config.status: creating src/lib-sieve/storage/file/Makefile config.status: creating src/lib-sieve/storage/dict/Makefile config.status: creating src/lib-sieve/storage/ldap/Makefile config.status: creating src/lib-sieve/plugins/Makefile config.status: creating src/lib-sieve/plugins/vacation/Makefile config.status: creating src/lib-sieve/plugins/subaddress/Makefile config.status: creating src/lib-sieve/plugins/comparator-i-ascii-numeric/Makefile config.status: creating src/lib-sieve/plugins/relational/Makefile config.status: creating src/lib-sieve/plugins/regex/Makefile config.status: creating src/lib-sieve/plugins/imap4flags/Makefile config.status: creating src/lib-sieve/plugins/copy/Makefile config.status: creating src/lib-sieve/plugins/include/Makefile config.status: creating src/lib-sieve/plugins/body/Makefile config.status: creating src/lib-sieve/plugins/variables/Makefile config.status: creating src/lib-sieve/plugins/enotify/Makefile config.status: creating src/lib-sieve/plugins/enotify/mailto/Makefile config.status: creating src/lib-sieve/plugins/notify/Makefile config.status: creating src/lib-sieve/plugins/environment/Makefile config.status: creating src/lib-sieve/plugins/mailbox/Makefile config.status: creating src/lib-sieve/plugins/date/Makefile config.status: creating src/lib-sieve/plugins/spamvirustest/Makefile config.status: creating src/lib-sieve/plugins/ihave/Makefile config.status: creating src/lib-sieve/plugins/editheader/Makefile config.status: creating src/lib-sieve/plugins/metadata/Makefile config.status: creating src/lib-sieve/plugins/duplicate/Makefile config.status: creating src/lib-sieve/plugins/index/Makefile config.status: creating src/lib-sieve/plugins/mime/Makefile config.status: creating src/lib-sieve/plugins/vnd.dovecot/Makefile config.status: creating src/lib-sieve/plugins/vnd.dovecot/debug/Makefile config.status: creating src/lib-sieve/plugins/vnd.dovecot/environment/Makefile config.status: creating src/lib-sieve/plugins/vnd.dovecot/report/Makefile config.status: creating src/lib-sieve-tool/Makefile config.status: creating src/lib-managesieve/Makefile config.status: creating src/plugins/Makefile config.status: creating src/plugins/doveadm-sieve/Makefile config.status: creating src/plugins/lda-sieve/Makefile config.status: creating src/plugins/sieve-extprograms/Makefile config.status: creating src/plugins/imapsieve/Makefile config.status: creating src/plugins/settings/Makefile config.status: creating src/sieve-tools/Makefile config.status: creating src/managesieve/Makefile config.status: creating src/managesieve-login/Makefile config.status: creating src/testsuite/Makefile config.status: creating stamp.h config.status: creating dummy-config.h config.status: creating pigeonhole-config.h config.status: executing depfiles commands config.status: executing libtool commands Install prefix . : /usr/libx32/dovecot script drivers . : file dict : -ldap + /usr/bin/make -Otarget -j9 /usr/bin/make all-recursive Making all in . make[2]: Entering directory '/tmp/B.f3I9vN/BUILD/dovecot-2.2-pigeonhole-0.4.20' /bin/sh ./update-version.sh . . make[2]: Leaving directory '/tmp/B.f3I9vN/BUILD/dovecot-2.2-pigeonhole-0.4.20' Making all in src Making all in lib-sieve Making all in util make[4]: Entering directory '/tmp/B.f3I9vN/BUILD/dovecot-2.2-pigeonhole-0.4.20/src/lib-sieve/util' /bin/sh ../../../libtool --tag=CC --mode=compile x86_64-pld-linux-gnux32-gcc -DHAVE_CONFIG_H -I. -I../../.. -I/usr/include/dovecot -DMODULEDIR=\""/usr/libx32/dovecot/plugins"\" -std=gnu99 -O2 -fwrapv -pipe -Wformat -Werror=format-security -gdwarf-4 -fno-debug-types-section -fvar-tracking-assignments -g2 -Wp,-D_FORTIFY_SOURCE=2 -fstack-protector-strong --param=ssp-buffer-size=4 -fPIC -mtune=generic -march=x86-64 -gdwarf-4 -fno-debug-types-section -fvar-tracking-assignments -g2 -fstack-protector-strong -U_FORTIFY_SOURCE -D_FORTIFY_SOURCE=2 -Wall -W -Wmissing-prototypes -Wmissing-declarations -Wpointer-arith -Wchar-subscripts -Wformat=2 -Wbad-function-cast -fno-builtin-strftime -Wstrict-aliasing=2 -I/usr/include/openssl -I../../.. -MT edit-mail.lo -MD -MP -MF .deps/edit-mail.Tpo -c -o edit-mail.lo edit-mail.c libtool: compile: x86_64-pld-linux-gnux32-gcc -DHAVE_CONFIG_H -I. -I../../.. -I/usr/include/dovecot -DMODULEDIR=\"/usr/libx32/dovecot/plugins\" -std=gnu99 -O2 -fwrapv -pipe -Wformat -Werror=format-security -gdwarf-4 -fno-debug-types-section -fvar-tracking-assignments -g2 -Wp,-D_FORTIFY_SOURCE=2 -fstack-protector-strong --param=ssp-buffer-size=4 -fPIC -mtune=generic -march=x86-64 -gdwarf-4 -fno-debug-types-section -fvar-tracking-assignments -g2 -fstack-protector-strong -U_FORTIFY_SOURCE -D_FORTIFY_SOURCE=2 -Wall -W -Wmissing-prototypes -Wmissing-declarations -Wpointer-arith -Wchar-subscripts -Wformat=2 -Wbad-function-cast -fno-builtin-strftime -Wstrict-aliasing=2 -I/usr/include/openssl -I../../.. -MT edit-mail.lo -MD -MP -MF .deps/edit-mail.Tpo -c edit-mail.c -fPIC -DPIC -o .libs/edit-mail.o edit-mail.c: In function 'edit_mail_wrap': edit-mail.c:235:14: error: too few arguments to function 'mailbox_transaction_begin' raw_trans = mailbox_transaction_begin(raw_box, 0); ^~~~~~~~~~~~~~~~~~~~~~~~~ In file included from /usr/include/dovecot/mail-storage-private.h:7, from edit-mail.c:16: /usr/include/dovecot/mail-storage.h:656:1: note: declared here mailbox_transaction_begin(struct mailbox *box, ^~~~~~~~~~~~~~~~~~~~~~~~~ edit-mail.c: In function 'edit_mail_set_cache_corrupted': edit-mail.c:1662:2: error: too few arguments to function 'edmail->wrapped->v.set_cache_corrupted' edmail->wrapped->v.set_cache_corrupted(&edmail->wrapped->mail, field); ^~~~~~ edit-mail.c: In function 'edit_mail_set_cache_corrupted_reason': edit-mail.c:1671:21: error: 'struct mail_vfuncs' has no member named 'set_cache_corrupted_reason'; did you mean 'set_cache_corrupted'? edmail->wrapped->v.set_cache_corrupted_reason ^~~~~~~~~~~~~~~~~~~~~~~~~~ set_cache_corrupted edit-mail.c: At top level: edit-mail.c:1701:2: warning: initialization of 'int (*)(struct mail *, struct mail **)' from incompatible pointer type 'struct mail * (*)(struct mail *)' [-Wincompatible-pointer-types] edit_mail_get_real_mail, ^~~~~~~~~~~~~~~~~~~~~~~ edit-mail.c:1701:2: note: (near initialization for 'edit_mail_vfuncs.get_backend_mail') edit-mail.c:1708:2: warning: initialization of 'void (*)(struct mail *, enum mail_fetch_field, const char *)' from incompatible pointer type 'void (*)(struct mail *, enum mail_fetch_field)' [-Wincompatible-pointer-types] edit_mail_set_cache_corrupted, ^~~~~~~~~~~~~~~~~~~~~~~~~~~~~ edit-mail.c:1708:2: note: (near initialization for 'edit_mail_vfuncs.set_cache_corrupted') edit-mail.c:1710:2: warning: excess elements in struct initializer edit_mail_set_cache_corrupted_reason ^~~~~~~~~~~~~~~~~~~~~~~~~~~~~~~~~~~~ edit-mail.c:1710:2: note: (near initialization for 'edit_mail_vfuncs') edit-mail.c: In function 'edit_mail_istream_create': edit-mail.c:2156:9: error: too few arguments to function 'i_stream_create' return i_stream_create(&edstream->istream, wrapped, -1); ^~~~~~~~~~~~~~~ In file included from edit-mail.c:9: /usr/include/dovecot/istream-private.h:84:1: note: declared here i_stream_create(struct istream_private *stream, struct istream *parent, int fd, ^~~~~~~~~~~~~~~ edit-mail.c:2157:1: warning: control reaches end of non-void function [-Wreturn-type] } ^ make[4]: *** [Makefile:466: edit-mail.lo] Error 1 make[4]: Leaving directory '/tmp/B.f3I9vN/BUILD/dovecot-2.2-pigeonhole-0.4.20/src/lib-sieve/util' make[4]: *** Waiting for unfinished jobs.... make[4]: Entering directory '/tmp/B.f3I9vN/BUILD/dovecot-2.2-pigeonhole-0.4.20/src/lib-sieve/util' /bin/sh ../../../libtool --tag=CC --mode=compile x86_64-pld-linux-gnux32-gcc -DHAVE_CONFIG_H -I. -I../../.. -I/usr/include/dovecot -DMODULEDIR=\""/usr/libx32/dovecot/plugins"\" -std=gnu99 -O2 -fwrapv -pipe -Wformat -Werror=format-security -gdwarf-4 -fno-debug-types-section -fvar-tracking-assignments -g2 -Wp,-D_FORTIFY_SOURCE=2 -fstack-protector-strong --param=ssp-buffer-size=4 -fPIC -mtune=generic -march=x86-64 -gdwarf-4 -fno-debug-types-section -fvar-tracking-assignments -g2 -fstack-protector-strong -U_FORTIFY_SOURCE -D_FORTIFY_SOURCE=2 -Wall -W -Wmissing-prototypes -Wmissing-declarations -Wpointer-arith -Wchar-subscripts -Wformat=2 -Wbad-function-cast -fno-builtin-strftime -Wstrict-aliasing=2 -I/usr/include/openssl -I../../.. -MT strtrim.lo -MD -MP -MF .deps/strtrim.Tpo -c -o strtrim.lo strtrim.c libtool: compile: x86_64-pld-linux-gnux32-gcc -DHAVE_CONFIG_H -I. -I../../.. -I/usr/include/dovecot -DMODULEDIR=\"/usr/libx32/dovecot/plugins\" -std=gnu99 -O2 -fwrapv -pipe -Wformat -Werror=format-security -gdwarf-4 -fno-debug-types-section -fvar-tracking-assignments -g2 -Wp,-D_FORTIFY_SOURCE=2 -fstack-protector-strong --param=ssp-buffer-size=4 -fPIC -mtune=generic -march=x86-64 -gdwarf-4 -fno-debug-types-section -fvar-tracking-assignments -g2 -fstack-protector-strong -U_FORTIFY_SOURCE -D_FORTIFY_SOURCE=2 -Wall -W -Wmissing-prototypes -Wmissing-declarations -Wpointer-arith -Wchar-subscripts -Wformat=2 -Wbad-function-cast -fno-builtin-strftime -Wstrict-aliasing=2 -I/usr/include/openssl -I../../.. -MT strtrim.lo -MD -MP -MF .deps/strtrim.Tpo -c strtrim.c -fPIC -DPIC -o .libs/strtrim.o libtool: compile: x86_64-pld-linux-gnux32-gcc -DHAVE_CONFIG_H -I. -I../../.. -I/usr/include/dovecot -DMODULEDIR=\"/usr/libx32/dovecot/plugins\" -std=gnu99 -O2 -fwrapv -pipe -Wformat -Werror=format-security -gdwarf-4 -fno-debug-types-section -fvar-tracking-assignments -g2 -Wp,-D_FORTIFY_SOURCE=2 -fstack-protector-strong --param=ssp-buffer-size=4 -fPIC -mtune=generic -march=x86-64 -gdwarf-4 -fno-debug-types-section -fvar-tracking-assignments -g2 -fstack-protector-strong -U_FORTIFY_SOURCE -D_FORTIFY_SOURCE=2 -Wall -W -Wmissing-prototypes -Wmissing-declarations -Wpointer-arith -Wchar-subscripts -Wformat=2 -Wbad-function-cast -fno-builtin-strftime -Wstrict-aliasing=2 -I/usr/include/openssl -I../../.. -MT strtrim.lo -MD -MP -MF .deps/strtrim.Tpo -c strtrim.c -o strtrim.o >/dev/null 2>&1 mv -f .deps/strtrim.Tpo .deps/strtrim.Plo make[4]: Leaving directory '/tmp/B.f3I9vN/BUILD/dovecot-2.2-pigeonhole-0.4.20/src/lib-sieve/util' make[4]: Entering directory '/tmp/B.f3I9vN/BUILD/dovecot-2.2-pigeonhole-0.4.20/src/lib-sieve/util' /bin/sh ../../../libtool --tag=CC --mode=compile x86_64-pld-linux-gnux32-gcc -DHAVE_CONFIG_H -I. -I../../.. -I/usr/include/dovecot -DMODULEDIR=\""/usr/libx32/dovecot/plugins"\" -std=gnu99 -O2 -fwrapv -pipe -Wformat -Werror=format-security -gdwarf-4 -fno-debug-types-section -fvar-tracking-assignments -g2 -Wp,-D_FORTIFY_SOURCE=2 -fstack-protector-strong --param=ssp-buffer-size=4 -fPIC -mtune=generic -march=x86-64 -gdwarf-4 -fno-debug-types-section -fvar-tracking-assignments -g2 -fstack-protector-strong -U_FORTIFY_SOURCE -D_FORTIFY_SOURCE=2 -Wall -W -Wmissing-prototypes -Wmissing-declarations -Wpointer-arith -Wchar-subscripts -Wformat=2 -Wbad-function-cast -fno-builtin-strftime -Wstrict-aliasing=2 -I/usr/include/openssl -I../../.. -MT rfc2822.lo -MD -MP -MF .deps/rfc2822.Tpo -c -o rfc2822.lo rfc2822.c libtool: compile: x86_64-pld-linux-gnux32-gcc -DHAVE_CONFIG_H -I. -I../../.. -I/usr/include/dovecot -DMODULEDIR=\"/usr/libx32/dovecot/plugins\" -std=gnu99 -O2 -fwrapv -pipe -Wformat -Werror=format-security -gdwarf-4 -fno-debug-types-section -fvar-tracking-assignments -g2 -Wp,-D_FORTIFY_SOURCE=2 -fstack-protector-strong --param=ssp-buffer-size=4 -fPIC -mtune=generic -march=x86-64 -gdwarf-4 -fno-debug-types-section -fvar-tracking-assignments -g2 -fstack-protector-strong -U_FORTIFY_SOURCE -D_FORTIFY_SOURCE=2 -Wall -W -Wmissing-prototypes -Wmissing-declarations -Wpointer-arith -Wchar-subscripts -Wformat=2 -Wbad-function-cast -fno-builtin-strftime -Wstrict-aliasing=2 -I/usr/include/openssl -I../../.. -MT rfc2822.lo -MD -MP -MF .deps/rfc2822.Tpo -c rfc2822.c -fPIC -DPIC -o .libs/rfc2822.o libtool: compile: x86_64-pld-linux-gnux32-gcc -DHAVE_CONFIG_H -I. -I../../.. -I/usr/include/dovecot -DMODULEDIR=\"/usr/libx32/dovecot/plugins\" -std=gnu99 -O2 -fwrapv -pipe -Wformat -Werror=format-security -gdwarf-4 -fno-debug-types-section -fvar-tracking-assignments -g2 -Wp,-D_FORTIFY_SOURCE=2 -fstack-protector-strong --param=ssp-buffer-size=4 -fPIC -mtune=generic -march=x86-64 -gdwarf-4 -fno-debug-types-section -fvar-tracking-assignments -g2 -fstack-protector-strong -U_FORTIFY_SOURCE -D_FORTIFY_SOURCE=2 -Wall -W -Wmissing-prototypes -Wmissing-declarations -Wpointer-arith -Wchar-subscripts -Wformat=2 -Wbad-function-cast -fno-builtin-strftime -Wstrict-aliasing=2 -I/usr/include/openssl -I../../.. -MT rfc2822.lo -MD -MP -MF .deps/rfc2822.Tpo -c rfc2822.c -o rfc2822.o >/dev/null 2>&1 mv -f .deps/rfc2822.Tpo .deps/rfc2822.Plo make[4]: Leaving directory '/tmp/B.f3I9vN/BUILD/dovecot-2.2-pigeonhole-0.4.20/src/lib-sieve/util' make[4]: Entering directory '/tmp/B.f3I9vN/BUILD/dovecot-2.2-pigeonhole-0.4.20/src/lib-sieve/util' /bin/sh ../../../libtool --tag=CC --mode=compile x86_64-pld-linux-gnux32-gcc -DHAVE_CONFIG_H -I. -I../../.. -I/usr/include/dovecot -DMODULEDIR=\""/usr/libx32/dovecot/plugins"\" -std=gnu99 -O2 -fwrapv -pipe -Wformat -Werror=format-security -gdwarf-4 -fno-debug-types-section -fvar-tracking-assignments -g2 -Wp,-D_FORTIFY_SOURCE=2 -fstack-protector-strong --param=ssp-buffer-size=4 -fPIC -mtune=generic -march=x86-64 -gdwarf-4 -fno-debug-types-section -fvar-tracking-assignments -g2 -fstack-protector-strong -U_FORTIFY_SOURCE -D_FORTIFY_SOURCE=2 -Wall -W -Wmissing-prototypes -Wmissing-declarations -Wpointer-arith -Wchar-subscripts -Wformat=2 -Wbad-function-cast -fno-builtin-strftime -Wstrict-aliasing=2 -I/usr/include/openssl -I../../.. -MT realpath.lo -MD -MP -MF .deps/realpath.Tpo -c -o realpath.lo realpath.c libtool: compile: x86_64-pld-linux-gnux32-gcc -DHAVE_CONFIG_H -I. -I../../.. -I/usr/include/dovecot -DMODULEDIR=\"/usr/libx32/dovecot/plugins\" -std=gnu99 -O2 -fwrapv -pipe -Wformat -Werror=format-security -gdwarf-4 -fno-debug-types-section -fvar-tracking-assignments -g2 -Wp,-D_FORTIFY_SOURCE=2 -fstack-protector-strong --param=ssp-buffer-size=4 -fPIC -mtune=generic -march=x86-64 -gdwarf-4 -fno-debug-types-section -fvar-tracking-assignments -g2 -fstack-protector-strong -U_FORTIFY_SOURCE -D_FORTIFY_SOURCE=2 -Wall -W -Wmissing-prototypes -Wmissing-declarations -Wpointer-arith -Wchar-subscripts -Wformat=2 -Wbad-function-cast -fno-builtin-strftime -Wstrict-aliasing=2 -I/usr/include/openssl -I../../.. -MT realpath.lo -MD -MP -MF .deps/realpath.Tpo -c realpath.c -fPIC -DPIC -o .libs/realpath.o libtool: compile: x86_64-pld-linux-gnux32-gcc -DHAVE_CONFIG_H -I. -I../../.. -I/usr/include/dovecot -DMODULEDIR=\"/usr/libx32/dovecot/plugins\" -std=gnu99 -O2 -fwrapv -pipe -Wformat -Werror=format-security -gdwarf-4 -fno-debug-types-section -fvar-tracking-assignments -g2 -Wp,-D_FORTIFY_SOURCE=2 -fstack-protector-strong --param=ssp-buffer-size=4 -fPIC -mtune=generic -march=x86-64 -gdwarf-4 -fno-debug-types-section -fvar-tracking-assignments -g2 -fstack-protector-strong -U_FORTIFY_SOURCE -D_FORTIFY_SOURCE=2 -Wall -W -Wmissing-prototypes -Wmissing-declarations -Wpointer-arith -Wchar-subscripts -Wformat=2 -Wbad-function-cast -fno-builtin-strftime -Wstrict-aliasing=2 -I/usr/include/openssl -I../../.. -MT realpath.lo -MD -MP -MF .deps/realpath.Tpo -c realpath.c -o realpath.o >/dev/null 2>&1 mv -f .deps/realpath.Tpo .deps/realpath.Plo make[4]: Leaving directory '/tmp/B.f3I9vN/BUILD/dovecot-2.2-pigeonhole-0.4.20/src/lib-sieve/util' make[3]: *** [Makefile:838: all-recursive] Error 1 make[2]: *** [Makefile:414: all-recursive] Error 1 make[1]: *** [Makefile:729: all-recursive] Error 1 make: *** [Makefile:587: all] Error 2 error: Bad exit status from /tmp/B.f3I9vN/BUILD/tmp/rpm-tmp.48899 (%build) RPM build errors: Bad exit status from /tmp/B.f3I9vN/BUILD/tmp/rpm-tmp.48899 (%build) ended at: Sat Aug 4 21:53:31 2018, done in 0:00:06.392896 error: No files produced. + chmod -R u+rwX /tmp/B.f3I9vN/BUILD + rm -rf /tmp/B.f3I9vN/tmp /tmp/B.f3I9vN/BUILD + rm -rf /tmp/B.f3I9vN Begin-PLD-Builder-Info Build-Time: user:4.53s sys:1.97s real:10.00s (faults io:0 non-io:691908) End-PLD-Builder-Info
[Back to list of logs] [View rpm -qa of builder]