FailedOk

th/SRPMS[OK]
th/x32[OK]
th/i686[OK]
th/x86_64[OK]

ac/SRPMS[OK]
ac/i386[OK]
ac/i586[OK]
ac/i686[OK]
ac/alpha[OK]
ac/amd64[OK]
ac/athlon[OK]
ac/ppc[OK]
ac/sparc[OK]
ac/sparc64[OK]

Advanced Search
main()
Powered by PLD Linux
(c) 2002-2018 PLD Team
$Revision: 1.37 $
Powered by Star Treck.
Your IP: 54.198.27.243

dovecot-pigeonhole 10702427-af0b-443c-8c6a-9e35289f691d

Status:Failed
Source URL:ftp://buildlogs.pld-linux.org/th/x32/FAIL/dovecot-pigeonhole,10702427-af0b-443c-8c6a-9e35289f691d.bz2
text/plain URL:View!
full text:View!
rpm -qa of builder:View!
Date:2018/08/04 21:53:32
Runtime:0:00:06.392896

Toc:

  • error 1
  • edit-mail.c:235:14: error: too few arguments to function 'mailbox_transaction_begin'
  • error 2
  • edit-mail.c:1662:2: error: too few arguments to function 'edmail->wrapped->v.set_cache_corrupted'
  • error 3
  • edit-mail.c:1671:21: error: 'struct mail_vfuncs' has no member named 'set_cache_corrupted_reason'; did you mean 'set_cache_corrupted'?
  • error 4
  • edit-mail.c:2156:9: error: too few arguments to function 'i_stream_create'
  • error 5
  • make[4]: *** [Makefile:466: edit-mail.lo] Error 1
  • error 6
  • make[3]: *** [Makefile:838: all-recursive] Error 1
  • error 7
  • make[2]: *** [Makefile:414: all-recursive] Error 1
  • error 8
  • make[1]: *** [Makefile:729: all-recursive] Error 1
  • error 9
  • error: Bad exit status from /tmp/B.f3I9vN/BUILD/tmp/rpm-tmp.48899 (%build)
  • error 10
  • RPM build errors:
  • error 11
  • error: No files produced.

Content:

checking for dlfcn.h... yes
checking for objdir... .libs
checking if x86_64-pld-linux-gnux32-gcc supports -fno-rtti -fno-exceptions... no
checking for x86_64-pld-linux-gnux32-gcc option to produce PIC... -fPIC -DPIC
checking if x86_64-pld-linux-gnux32-gcc PIC flag -fPIC -DPIC works... yes
checking if x86_64-pld-linux-gnux32-gcc static flag -static works... yes
checking if x86_64-pld-linux-gnux32-gcc supports -c -o file.o... yes
checking if x86_64-pld-linux-gnux32-gcc supports -c -o file.o... (cached) yes
checking whether the x86_64-pld-linux-gnux32-gcc linker (/usr/bin/ld -m elf32_x86_64) supports shared libraries... yes
checking whether -lc should be explicitly linked in... no
checking dynamic linker characteristics... GNU/Linux ld.so
checking how to hardcode library paths into programs... immediate
checking whether stripping libraries is possible... yes
checking if libtool supports shared libraries... yes
checking whether to build shared libraries... yes
checking whether to build static libraries... yes
checking for "/usr/libx32/dovecot/dovecot-config"... /usr/libx32/dovecot/dovecot-config
checking whether OS supports plugin dependencies... yes
checking for valgrind... no
checking that generated files are newer than configure... done
configure: creating ./config.status
config.status: creating Makefile
config.status: creating doc/Makefile
config.status: creating doc/man/Makefile
config.status: creating doc/example-config/Makefile
config.status: creating doc/example-config/conf.d/Makefile
config.status: creating doc/rfc/Makefile
config.status: creating doc/extensions/Makefile
config.status: creating doc/locations/Makefile
config.status: creating doc/plugins/Makefile
config.status: creating src/Makefile
config.status: creating src/lib-sieve/Makefile
config.status: creating src/lib-sieve/util/Makefile
config.status: creating src/lib-sieve/storage/Makefile
config.status: creating src/lib-sieve/storage/file/Makefile
config.status: creating src/lib-sieve/storage/dict/Makefile
config.status: creating src/lib-sieve/storage/ldap/Makefile
config.status: creating src/lib-sieve/plugins/Makefile
config.status: creating src/lib-sieve/plugins/vacation/Makefile
config.status: creating src/lib-sieve/plugins/subaddress/Makefile
config.status: creating src/lib-sieve/plugins/comparator-i-ascii-numeric/Makefile
config.status: creating src/lib-sieve/plugins/relational/Makefile
config.status: creating src/lib-sieve/plugins/regex/Makefile
config.status: creating src/lib-sieve/plugins/imap4flags/Makefile
config.status: creating src/lib-sieve/plugins/copy/Makefile
config.status: creating src/lib-sieve/plugins/include/Makefile
config.status: creating src/lib-sieve/plugins/body/Makefile
config.status: creating src/lib-sieve/plugins/variables/Makefile
config.status: creating src/lib-sieve/plugins/enotify/Makefile
config.status: creating src/lib-sieve/plugins/enotify/mailto/Makefile
config.status: creating src/lib-sieve/plugins/notify/Makefile
config.status: creating src/lib-sieve/plugins/environment/Makefile
config.status: creating src/lib-sieve/plugins/mailbox/Makefile
config.status: creating src/lib-sieve/plugins/date/Makefile
config.status: creating src/lib-sieve/plugins/spamvirustest/Makefile
config.status: creating src/lib-sieve/plugins/ihave/Makefile
config.status: creating src/lib-sieve/plugins/editheader/Makefile
config.status: creating src/lib-sieve/plugins/metadata/Makefile
config.status: creating src/lib-sieve/plugins/duplicate/Makefile
config.status: creating src/lib-sieve/plugins/index/Makefile
config.status: creating src/lib-sieve/plugins/mime/Makefile
config.status: creating src/lib-sieve/plugins/vnd.dovecot/Makefile
config.status: creating src/lib-sieve/plugins/vnd.dovecot/debug/Makefile
config.status: creating src/lib-sieve/plugins/vnd.dovecot/environment/Makefile
config.status: creating src/lib-sieve/plugins/vnd.dovecot/report/Makefile
config.status: creating src/lib-sieve-tool/Makefile
config.status: creating src/lib-managesieve/Makefile
config.status: creating src/plugins/Makefile
config.status: creating src/plugins/doveadm-sieve/Makefile
config.status: creating src/plugins/lda-sieve/Makefile
config.status: creating src/plugins/sieve-extprograms/Makefile
config.status: creating src/plugins/imapsieve/Makefile
config.status: creating src/plugins/settings/Makefile
config.status: creating src/sieve-tools/Makefile
config.status: creating src/managesieve/Makefile
config.status: creating src/managesieve-login/Makefile
config.status: creating src/testsuite/Makefile
config.status: creating stamp.h
config.status: creating dummy-config.h
config.status: creating pigeonhole-config.h
config.status: executing depfiles commands
config.status: executing libtool commands

Install prefix . : /usr/libx32/dovecot
script drivers . : file dict
                 : -ldap
+ /usr/bin/make -Otarget -j9
/usr/bin/make  all-recursive
Making all in .
make[2]: Entering directory '/tmp/B.f3I9vN/BUILD/dovecot-2.2-pigeonhole-0.4.20'
/bin/sh ./update-version.sh . .
make[2]: Leaving directory '/tmp/B.f3I9vN/BUILD/dovecot-2.2-pigeonhole-0.4.20'
Making all in src
Making all in lib-sieve
Making all in util
make[4]: Entering directory '/tmp/B.f3I9vN/BUILD/dovecot-2.2-pigeonhole-0.4.20/src/lib-sieve/util'
/bin/sh ../../../libtool  --tag=CC   --mode=compile x86_64-pld-linux-gnux32-gcc -DHAVE_CONFIG_H -I. -I../../..  -I/usr/include/dovecot   -DMODULEDIR=\""/usr/libx32/dovecot/plugins"\"   -std=gnu99 -O2 -fwrapv -pipe -Wformat -Werror=format-security -gdwarf-4 -fno-debug-types-section -fvar-tracking-assignments -g2 -Wp,-D_FORTIFY_SOURCE=2 -fstack-protector-strong --param=ssp-buffer-size=4 -fPIC -mtune=generic -march=x86-64 -gdwarf-4 -fno-debug-types-section -fvar-tracking-assignments -g2 -fstack-protector-strong -U_FORTIFY_SOURCE -D_FORTIFY_SOURCE=2 -Wall -W -Wmissing-prototypes -Wmissing-declarations -Wpointer-arith -Wchar-subscripts -Wformat=2 -Wbad-function-cast -fno-builtin-strftime -Wstrict-aliasing=2 -I/usr/include/openssl  -I../../.. -MT edit-mail.lo -MD -MP -MF .deps/edit-mail.Tpo -c -o edit-mail.lo edit-mail.c
libtool: compile:  x86_64-pld-linux-gnux32-gcc -DHAVE_CONFIG_H -I. -I../../.. -I/usr/include/dovecot -DMODULEDIR=\"/usr/libx32/dovecot/plugins\" -std=gnu99 -O2 -fwrapv -pipe -Wformat -Werror=format-security -gdwarf-4 -fno-debug-types-section -fvar-tracking-assignments -g2 -Wp,-D_FORTIFY_SOURCE=2 -fstack-protector-strong --param=ssp-buffer-size=4 -fPIC -mtune=generic -march=x86-64 -gdwarf-4 -fno-debug-types-section -fvar-tracking-assignments -g2 -fstack-protector-strong -U_FORTIFY_SOURCE -D_FORTIFY_SOURCE=2 -Wall -W -Wmissing-prototypes -Wmissing-declarations -Wpointer-arith -Wchar-subscripts -Wformat=2 -Wbad-function-cast -fno-builtin-strftime -Wstrict-aliasing=2 -I/usr/include/openssl -I../../.. -MT edit-mail.lo -MD -MP -MF .deps/edit-mail.Tpo -c edit-mail.c  -fPIC -DPIC -o .libs/edit-mail.o
edit-mail.c: In function 'edit_mail_wrap':
edit-mail.c:235:14: error: too few arguments to function 'mailbox_transaction_begin'
  raw_trans = mailbox_transaction_begin(raw_box, 0);
              ^~~~~~~~~~~~~~~~~~~~~~~~~
In file included from /usr/include/dovecot/mail-storage-private.h:7,
                 from edit-mail.c:16:
/usr/include/dovecot/mail-storage.h:656:1: note: declared here
 mailbox_transaction_begin(struct mailbox *box,
 ^~~~~~~~~~~~~~~~~~~~~~~~~
edit-mail.c: In function 'edit_mail_set_cache_corrupted':
edit-mail.c:1662:2: error: too few arguments to function 'edmail->wrapped->v.set_cache_corrupted'
  edmail->wrapped->v.set_cache_corrupted(&edmail->wrapped->mail, field);
  ^~~~~~
edit-mail.c: In function 'edit_mail_set_cache_corrupted_reason':
edit-mail.c:1671:21: error: 'struct mail_vfuncs' has no member named 'set_cache_corrupted_reason'; did you mean 'set_cache_corrupted'?
  edmail->wrapped->v.set_cache_corrupted_reason
                     ^~~~~~~~~~~~~~~~~~~~~~~~~~
                     set_cache_corrupted
edit-mail.c: At top level:
edit-mail.c:1701:2: warning: initialization of 'int (*)(struct mail *, struct mail **)' from incompatible pointer type 'struct mail * (*)(struct mail *)' [-Wincompatible-pointer-types]
  edit_mail_get_real_mail,
  ^~~~~~~~~~~~~~~~~~~~~~~
edit-mail.c:1701:2: note: (near initialization for 'edit_mail_vfuncs.get_backend_mail')
edit-mail.c:1708:2: warning: initialization of 'void (*)(struct mail *, enum mail_fetch_field,  const char *)' from incompatible pointer type 'void (*)(struct mail *, enum mail_fetch_field)' [-Wincompatible-pointer-types]
  edit_mail_set_cache_corrupted,
  ^~~~~~~~~~~~~~~~~~~~~~~~~~~~~
edit-mail.c:1708:2: note: (near initialization for 'edit_mail_vfuncs.set_cache_corrupted')
edit-mail.c:1710:2: warning: excess elements in struct initializer
  edit_mail_set_cache_corrupted_reason
  ^~~~~~~~~~~~~~~~~~~~~~~~~~~~~~~~~~~~
edit-mail.c:1710:2: note: (near initialization for 'edit_mail_vfuncs')
edit-mail.c: In function 'edit_mail_istream_create':
edit-mail.c:2156:9: error: too few arguments to function 'i_stream_create'
  return i_stream_create(&edstream->istream, wrapped, -1);
         ^~~~~~~~~~~~~~~
In file included from edit-mail.c:9:
/usr/include/dovecot/istream-private.h:84:1: note: declared here
 i_stream_create(struct istream_private *stream, struct istream *parent, int fd,
 ^~~~~~~~~~~~~~~
edit-mail.c:2157:1: warning: control reaches end of non-void function [-Wreturn-type]
 }
 ^
make[4]: *** [Makefile:466: edit-mail.lo] Error 1
make[4]: Leaving directory '/tmp/B.f3I9vN/BUILD/dovecot-2.2-pigeonhole-0.4.20/src/lib-sieve/util'
make[4]: *** Waiting for unfinished jobs....
make[4]: Entering directory '/tmp/B.f3I9vN/BUILD/dovecot-2.2-pigeonhole-0.4.20/src/lib-sieve/util'
/bin/sh ../../../libtool  --tag=CC   --mode=compile x86_64-pld-linux-gnux32-gcc -DHAVE_CONFIG_H -I. -I../../..  -I/usr/include/dovecot   -DMODULEDIR=\""/usr/libx32/dovecot/plugins"\"   -std=gnu99 -O2 -fwrapv -pipe -Wformat -Werror=format-security -gdwarf-4 -fno-debug-types-section -fvar-tracking-assignments -g2 -Wp,-D_FORTIFY_SOURCE=2 -fstack-protector-strong --param=ssp-buffer-size=4 -fPIC -mtune=generic -march=x86-64 -gdwarf-4 -fno-debug-types-section -fvar-tracking-assignments -g2 -fstack-protector-strong -U_FORTIFY_SOURCE -D_FORTIFY_SOURCE=2 -Wall -W -Wmissing-prototypes -Wmissing-declarations -Wpointer-arith -Wchar-subscripts -Wformat=2 -Wbad-function-cast -fno-builtin-strftime -Wstrict-aliasing=2 -I/usr/include/openssl  -I../../.. -MT strtrim.lo -MD -MP -MF .deps/strtrim.Tpo -c -o strtrim.lo strtrim.c
libtool: compile:  x86_64-pld-linux-gnux32-gcc -DHAVE_CONFIG_H -I. -I../../.. -I/usr/include/dovecot -DMODULEDIR=\"/usr/libx32/dovecot/plugins\" -std=gnu99 -O2 -fwrapv -pipe -Wformat -Werror=format-security -gdwarf-4 -fno-debug-types-section -fvar-tracking-assignments -g2 -Wp,-D_FORTIFY_SOURCE=2 -fstack-protector-strong --param=ssp-buffer-size=4 -fPIC -mtune=generic -march=x86-64 -gdwarf-4 -fno-debug-types-section -fvar-tracking-assignments -g2 -fstack-protector-strong -U_FORTIFY_SOURCE -D_FORTIFY_SOURCE=2 -Wall -W -Wmissing-prototypes -Wmissing-declarations -Wpointer-arith -Wchar-subscripts -Wformat=2 -Wbad-function-cast -fno-builtin-strftime -Wstrict-aliasing=2 -I/usr/include/openssl -I../../.. -MT strtrim.lo -MD -MP -MF .deps/strtrim.Tpo -c strtrim.c  -fPIC -DPIC -o .libs/strtrim.o
libtool: compile:  x86_64-pld-linux-gnux32-gcc -DHAVE_CONFIG_H -I. -I../../.. -I/usr/include/dovecot -DMODULEDIR=\"/usr/libx32/dovecot/plugins\" -std=gnu99 -O2 -fwrapv -pipe -Wformat -Werror=format-security -gdwarf-4 -fno-debug-types-section -fvar-tracking-assignments -g2 -Wp,-D_FORTIFY_SOURCE=2 -fstack-protector-strong --param=ssp-buffer-size=4 -fPIC -mtune=generic -march=x86-64 -gdwarf-4 -fno-debug-types-section -fvar-tracking-assignments -g2 -fstack-protector-strong -U_FORTIFY_SOURCE -D_FORTIFY_SOURCE=2 -Wall -W -Wmissing-prototypes -Wmissing-declarations -Wpointer-arith -Wchar-subscripts -Wformat=2 -Wbad-function-cast -fno-builtin-strftime -Wstrict-aliasing=2 -I/usr/include/openssl -I../../.. -MT strtrim.lo -MD -MP -MF .deps/strtrim.Tpo -c strtrim.c -o strtrim.o >/dev/null 2>&1
mv -f .deps/strtrim.Tpo .deps/strtrim.Plo
make[4]: Leaving directory '/tmp/B.f3I9vN/BUILD/dovecot-2.2-pigeonhole-0.4.20/src/lib-sieve/util'
make[4]: Entering directory '/tmp/B.f3I9vN/BUILD/dovecot-2.2-pigeonhole-0.4.20/src/lib-sieve/util'
/bin/sh ../../../libtool  --tag=CC   --mode=compile x86_64-pld-linux-gnux32-gcc -DHAVE_CONFIG_H -I. -I../../..  -I/usr/include/dovecot   -DMODULEDIR=\""/usr/libx32/dovecot/plugins"\"   -std=gnu99 -O2 -fwrapv -pipe -Wformat -Werror=format-security -gdwarf-4 -fno-debug-types-section -fvar-tracking-assignments -g2 -Wp,-D_FORTIFY_SOURCE=2 -fstack-protector-strong --param=ssp-buffer-size=4 -fPIC -mtune=generic -march=x86-64 -gdwarf-4 -fno-debug-types-section -fvar-tracking-assignments -g2 -fstack-protector-strong -U_FORTIFY_SOURCE -D_FORTIFY_SOURCE=2 -Wall -W -Wmissing-prototypes -Wmissing-declarations -Wpointer-arith -Wchar-subscripts -Wformat=2 -Wbad-function-cast -fno-builtin-strftime -Wstrict-aliasing=2 -I/usr/include/openssl  -I../../.. -MT rfc2822.lo -MD -MP -MF .deps/rfc2822.Tpo -c -o rfc2822.lo rfc2822.c
libtool: compile:  x86_64-pld-linux-gnux32-gcc -DHAVE_CONFIG_H -I. -I../../.. -I/usr/include/dovecot -DMODULEDIR=\"/usr/libx32/dovecot/plugins\" -std=gnu99 -O2 -fwrapv -pipe -Wformat -Werror=format-security -gdwarf-4 -fno-debug-types-section -fvar-tracking-assignments -g2 -Wp,-D_FORTIFY_SOURCE=2 -fstack-protector-strong --param=ssp-buffer-size=4 -fPIC -mtune=generic -march=x86-64 -gdwarf-4 -fno-debug-types-section -fvar-tracking-assignments -g2 -fstack-protector-strong -U_FORTIFY_SOURCE -D_FORTIFY_SOURCE=2 -Wall -W -Wmissing-prototypes -Wmissing-declarations -Wpointer-arith -Wchar-subscripts -Wformat=2 -Wbad-function-cast -fno-builtin-strftime -Wstrict-aliasing=2 -I/usr/include/openssl -I../../.. -MT rfc2822.lo -MD -MP -MF .deps/rfc2822.Tpo -c rfc2822.c  -fPIC -DPIC -o .libs/rfc2822.o
libtool: compile:  x86_64-pld-linux-gnux32-gcc -DHAVE_CONFIG_H -I. -I../../.. -I/usr/include/dovecot -DMODULEDIR=\"/usr/libx32/dovecot/plugins\" -std=gnu99 -O2 -fwrapv -pipe -Wformat -Werror=format-security -gdwarf-4 -fno-debug-types-section -fvar-tracking-assignments -g2 -Wp,-D_FORTIFY_SOURCE=2 -fstack-protector-strong --param=ssp-buffer-size=4 -fPIC -mtune=generic -march=x86-64 -gdwarf-4 -fno-debug-types-section -fvar-tracking-assignments -g2 -fstack-protector-strong -U_FORTIFY_SOURCE -D_FORTIFY_SOURCE=2 -Wall -W -Wmissing-prototypes -Wmissing-declarations -Wpointer-arith -Wchar-subscripts -Wformat=2 -Wbad-function-cast -fno-builtin-strftime -Wstrict-aliasing=2 -I/usr/include/openssl -I../../.. -MT rfc2822.lo -MD -MP -MF .deps/rfc2822.Tpo -c rfc2822.c -o rfc2822.o >/dev/null 2>&1
mv -f .deps/rfc2822.Tpo .deps/rfc2822.Plo
make[4]: Leaving directory '/tmp/B.f3I9vN/BUILD/dovecot-2.2-pigeonhole-0.4.20/src/lib-sieve/util'
make[4]: Entering directory '/tmp/B.f3I9vN/BUILD/dovecot-2.2-pigeonhole-0.4.20/src/lib-sieve/util'
/bin/sh ../../../libtool  --tag=CC   --mode=compile x86_64-pld-linux-gnux32-gcc -DHAVE_CONFIG_H -I. -I../../..  -I/usr/include/dovecot   -DMODULEDIR=\""/usr/libx32/dovecot/plugins"\"   -std=gnu99 -O2 -fwrapv -pipe -Wformat -Werror=format-security -gdwarf-4 -fno-debug-types-section -fvar-tracking-assignments -g2 -Wp,-D_FORTIFY_SOURCE=2 -fstack-protector-strong --param=ssp-buffer-size=4 -fPIC -mtune=generic -march=x86-64 -gdwarf-4 -fno-debug-types-section -fvar-tracking-assignments -g2 -fstack-protector-strong -U_FORTIFY_SOURCE -D_FORTIFY_SOURCE=2 -Wall -W -Wmissing-prototypes -Wmissing-declarations -Wpointer-arith -Wchar-subscripts -Wformat=2 -Wbad-function-cast -fno-builtin-strftime -Wstrict-aliasing=2 -I/usr/include/openssl  -I../../.. -MT realpath.lo -MD -MP -MF .deps/realpath.Tpo -c -o realpath.lo realpath.c
libtool: compile:  x86_64-pld-linux-gnux32-gcc -DHAVE_CONFIG_H -I. -I../../.. -I/usr/include/dovecot -DMODULEDIR=\"/usr/libx32/dovecot/plugins\" -std=gnu99 -O2 -fwrapv -pipe -Wformat -Werror=format-security -gdwarf-4 -fno-debug-types-section -fvar-tracking-assignments -g2 -Wp,-D_FORTIFY_SOURCE=2 -fstack-protector-strong --param=ssp-buffer-size=4 -fPIC -mtune=generic -march=x86-64 -gdwarf-4 -fno-debug-types-section -fvar-tracking-assignments -g2 -fstack-protector-strong -U_FORTIFY_SOURCE -D_FORTIFY_SOURCE=2 -Wall -W -Wmissing-prototypes -Wmissing-declarations -Wpointer-arith -Wchar-subscripts -Wformat=2 -Wbad-function-cast -fno-builtin-strftime -Wstrict-aliasing=2 -I/usr/include/openssl -I../../.. -MT realpath.lo -MD -MP -MF .deps/realpath.Tpo -c realpath.c  -fPIC -DPIC -o .libs/realpath.o
libtool: compile:  x86_64-pld-linux-gnux32-gcc -DHAVE_CONFIG_H -I. -I../../.. -I/usr/include/dovecot -DMODULEDIR=\"/usr/libx32/dovecot/plugins\" -std=gnu99 -O2 -fwrapv -pipe -Wformat -Werror=format-security -gdwarf-4 -fno-debug-types-section -fvar-tracking-assignments -g2 -Wp,-D_FORTIFY_SOURCE=2 -fstack-protector-strong --param=ssp-buffer-size=4 -fPIC -mtune=generic -march=x86-64 -gdwarf-4 -fno-debug-types-section -fvar-tracking-assignments -g2 -fstack-protector-strong -U_FORTIFY_SOURCE -D_FORTIFY_SOURCE=2 -Wall -W -Wmissing-prototypes -Wmissing-declarations -Wpointer-arith -Wchar-subscripts -Wformat=2 -Wbad-function-cast -fno-builtin-strftime -Wstrict-aliasing=2 -I/usr/include/openssl -I../../.. -MT realpath.lo -MD -MP -MF .deps/realpath.Tpo -c realpath.c -o realpath.o >/dev/null 2>&1
mv -f .deps/realpath.Tpo .deps/realpath.Plo
make[4]: Leaving directory '/tmp/B.f3I9vN/BUILD/dovecot-2.2-pigeonhole-0.4.20/src/lib-sieve/util'
make[3]: *** [Makefile:838: all-recursive] Error 1
make[2]: *** [Makefile:414: all-recursive] Error 1
make[1]: *** [Makefile:729: all-recursive] Error 1
make: *** [Makefile:587: all] Error 2
error: Bad exit status from /tmp/B.f3I9vN/BUILD/tmp/rpm-tmp.48899 (%build)


RPM build errors:
    Bad exit status from /tmp/B.f3I9vN/BUILD/tmp/rpm-tmp.48899 (%build)
ended at: Sat Aug  4 21:53:31 2018, done in 0:00:06.392896
error: No files produced.
+ chmod -R u+rwX /tmp/B.f3I9vN/BUILD
+ rm -rf /tmp/B.f3I9vN/tmp /tmp/B.f3I9vN/BUILD
+ rm -rf /tmp/B.f3I9vN
Begin-PLD-Builder-Info
Build-Time: user:4.53s sys:1.97s real:10.00s (faults io:0 non-io:691908)

End-PLD-Builder-Info
[Back to list of logs] [View rpm -qa of builder]