FailedOk

th/SRPMS[OK]
th/x32[OK]
th/i686[OK]
th/x86_64[OK]

ac/SRPMS[OK]
ac/i386[OK]
ac/i586[OK]
ac/i686[OK]
ac/alpha[OK]
ac/amd64[OK]
ac/athlon[OK]
ac/ppc[OK]
ac/sparc[OK]
ac/sparc64[OK]

Advanced Search
main()
Powered by PLD Linux
(c) 2002-2017 PLD Team
$Revision: 1.37 $
Powered by bogon.
Your IP: 54.80.236.48

firefox 0d01bed2-6e3f-4e3c-9c07-c72630e26fbe

Status:Failed
Source URL:ftp://buildlogs.pld-linux.org/th/x32/FAIL/firefox,0d01bed2-6e3f-4e3c-9c07-c72630e26fbe.bz2
text/plain URL:View!
full text:View!
rpm -qa of builder:View!
Date:2017/04/21 01:20:00
Runtime:0:00:46.505394

Toc:

  • error 1
  • mozbuild.configure.ConfigureError: The target compiler does not agree with configure about the target bitness.
  • error 2
  • error: Bad exit status from /tmp/B.QwZHfl/BUILD/tmp/rpm-tmp.67561 (%build)
  • error 3
  • RPM build errors:
  • error 4
  • error: No files produced.

Content:

copying build/lib.linux-x86_64-2.7/psutil/_psutil_linux.so -> psutil
copying build/lib.linux-x86_64-2.7/psutil/_psutil_posix.so -> psutil

Reexecuting in the virtualenv
Adding configure options from /tmp/B.QwZHfl/BUILD/firefox-53.0/.mozconfig
  --enable-application=browser
  --host=x86_64-pld-linux-gnux32
  --prefix=/usr
  --disable-debug
  --enable-optimize=-O2 -fwrapv -pipe -Wformat -Werror=format-security -gdwarf-4 -fno-debug-types-section -fvar-tracking-assignments -g2 -Wp,-D_FORTIFY_SOURCE=2 -fstack-protector-strong --param=ssp-buffer-size=4 -fPIC -mtune=generic -march=x86-64 -gdwarf-4 -fno-debug-types-section -fvar-tracking-assignments -g2 -Os
  --disable-strip
  --disable-install-strip
  --enable-tests
  --disable-crashreporter
  --disable-gconf
  --disable-gnomeui
  --disable-necko-wifi
  --disable-updater
  --disable-rust
  --enable-alsa
  --enable-chrome-format=omni
  --enable-default-toolkit=cairo-gtk3
  --enable-extensions=default
  --enable-gio
  --enable-readline
  --enable-safe-browsing
  --enable-startup-notification
  --enable-system-cairo
  --enable-system-ffi
  --enable-system-hunspell
  --enable-system-sqlite
  --enable-url-classifier
  --enable-official-branding
  --with-default-mozilla-five-home=/usr/libx32/firefox
  --with-distribution-id=org.pld-linux
  --with-pthreads
  --with-system-bz2
  --without-system-icu
  --with-system-jpeg
  --with-system-libevent
  --with-system-libvpx
  --with-system-nspr
  --with-system-nss
  --with-system-png
  --with-system-zlib
  --with-x
  EPOCHREALTIME=1492730375.428043
  RANDOM=28180
checking for a shell... /bin/sh
checking for host system type... x86_64-pld-linux-gnux32
checking for target system type... x86_64-pld-linux-gnux32
checking whether cross compiling... no
checking for the target C compiler... /usr/bin/gcc
checking whether the target C compiler can be used... yes
checking for llvm-config... /usr/bin/llvm-config
checking for pkg_config... /usr/bin/pkg-config
checking for pkg-config version... 0.29.2
checking for yasm... /usr/bin/yasm
checking yasm version... 1.3.0
checking the target C compiler version... 6.3.0
checking the target C compiler works... yes
checking for the target C++ compiler... /usr/bin/g++
checking whether the target C++ compiler can be used... yes
checking the target C++ compiler version... 6.3.0
checking the target C++ compiler works... yes
checking for the host C compiler... /usr/bin/gcc
checking whether the host C compiler can be used... yes
checking the host C compiler version... 6.3.0
checking the host C compiler works... yes
checking for the host C++ compiler... /usr/bin/g++
checking whether the host C++ compiler can be used... yes
checking the host C++ compiler version... 6.3.0
checking the host C++ compiler works... yes
checking for 64-bit OS... no
Traceback (most recent call last):
  File "/tmp/B.QwZHfl/BUILD/firefox-53.0/configure.py", line 124, in <module>
    sys.exit(main(sys.argv))
  File "/tmp/B.QwZHfl/BUILD/firefox-53.0/configure.py", line 29, in main
    sandbox.run(os.path.join(os.path.dirname(__file__), 'moz.configure'))
  File "/tmp/B.QwZHfl/BUILD/firefox-53.0/python/mozbuild/mozbuild/configure/__init__.py", line 363, in run
    func(*args)
  File "/tmp/B.QwZHfl/BUILD/firefox-53.0/python/mozbuild/mozbuild/configure/__init__.py", line 409, in _value_for
    return self._value_for_depends(obj, need_help_dependency)
  File "/tmp/B.QwZHfl/BUILD/firefox-53.0/python/mozbuild/mozbuild/util.py", line 925, in method_call
    cache[args] = self.func(instance, *args)
  File "/tmp/B.QwZHfl/BUILD/firefox-53.0/python/mozbuild/mozbuild/configure/__init__.py", line 419, in _value_for_depends
    return obj.result
  File "/tmp/B.QwZHfl/BUILD/firefox-53.0/python/mozbuild/mozbuild/util.py", line 943, in __get__
    setattr(instance, name, self.func(instance))
  File "/tmp/B.QwZHfl/BUILD/firefox-53.0/python/mozbuild/mozbuild/configure/__init__.py", line 90, in result
    return self.func(*resolved_args)
  File "/tmp/B.QwZHfl/BUILD/firefox-53.0/python/mozbuild/mozbuild/configure/__init__.py", line 938, in wrapped
    return new_func(*args, **kwargs)
  File "/tmp/B.QwZHfl/BUILD/firefox-53.0/build/moz.configure/toolchain.configure", line 844, in check_have_64_bit
    configure_error('The target compiler does not agree with configure '
  File "/tmp/B.QwZHfl/BUILD/firefox-53.0/python/mozbuild/mozbuild/configure/__init__.py", line 938, in wrapped
    return new_func(*args, **kwargs)
  File "/tmp/B.QwZHfl/BUILD/firefox-53.0/build/moz.configure/util.configure", line 19, in configure_error
    raise ConfigureError(message)
mozbuild.configure.ConfigureError: The target compiler does not agree with configure about the target bitness.
*** Fix above errors and then restart with\
               "/usr/bin/make -f client.mk build"
make[2]: *** [/tmp/B.QwZHfl/BUILD/firefox-53.0/client.mk:383: configure] Error 1
make[2]: Leaving directory '/tmp/B.QwZHfl/BUILD/firefox-53.0'
make[1]: *** [/tmp/B.QwZHfl/BUILD/firefox-53.0/client.mk:396: /tmp/B.QwZHfl/BUILD/firefox-53.0/obj-x32/Makefile] Error 2
make[1]: Leaving directory '/tmp/B.QwZHfl/BUILD/firefox-53.0'
make: *** [client.mk:232: profiledbuild] Error 2
error: Bad exit status from /tmp/B.QwZHfl/BUILD/tmp/rpm-tmp.67561 (%build)


RPM build errors:
    Bad exit status from /tmp/B.QwZHfl/BUILD/tmp/rpm-tmp.67561 (%build)
ended at: Fri Apr 21 01:19:36 2017, done in 0:00:46.505394
error: No files produced.
+ chmod -R u+rwX /tmp/B.QwZHfl/BUILD
+ rm -rf /tmp/B.QwZHfl/tmp /tmp/B.QwZHfl/BUILD
+ rm -rf /tmp/B.QwZHfl
Begin-PLD-Builder-Info
Build-Time: user:26.88s sys:18.00s real:83.60s (faults io:5 non-io:235092)

End-PLD-Builder-Info
[Back to list of logs] [View rpm -qa of builder]