FailedOk

th/SRPMS[OK]
th/x32[OK]
th/i686[OK]
th/x86_64[OK]

ac/SRPMS[OK]
ac/i386[OK]
ac/i586[OK]
ac/i686[OK]
ac/alpha[OK]
ac/amd64[OK]
ac/athlon[OK]
ac/ppc[OK]
ac/sparc[OK]
ac/sparc64[OK]

Advanced Search
main()
Powered by PLD Linux
(c) 2002-2017 PLD Team
$Revision: 1.37 $
Powered by /dev/null.
Your IP: 54.80.36.205

firefox 3291d5c4-8489-4a1d-a671-de7dd1343389

Status:Failed
Source URL:ftp://buildlogs.pld-linux.org/th/x32/FAIL/firefox,3291d5c4-8489-4a1d-a671-de7dd1343389.bz2
text/plain URL:View!
rpm -qa of builder:View!
Date:2017/03/12 15:57:21
Runtime:0:00:40.801765

Toc:

  • prep
  • Executing(%prep): /bin/sh -e /tmp/B.sv1wvV/BUILD/tmp/rpm-tmp.19920
  • build
  • Executing(%build): /bin/sh -e /tmp/B.sv1wvV/BUILD/tmp/rpm-tmp.23020
  • error 1
  • mozbuild.configure.ConfigureError: The target compiler does not agree with configure about the target bitness.
  • error 2
  • error: Bad exit status from /tmp/B.sv1wvV/BUILD/tmp/rpm-tmp.23020 (%build)
  • error 3
  • RPM build errors:
  • error 4
  • error: No files produced.

Content:

request from: baggins
checking if we should skip the build
started at: Sun Mar 12 15:56:07 2017
fetching https://srcbuilder.pld-linux.org/th//srpms/3291d5c4-8489-4a1d-a671-de7dd1343389/firefox-52.0-2.src.rpm
fetched 212629480 bytes, 35229.7 K/s
installing srpm: firefox-52.0-2.src.rpm
+ install -d /tmp/B.sv1wvV/BUILD /tmp/B.sv1wvV/RPMS
+ LC_ALL=en_US.UTF-8
+ rpm -qp --changelog firefox-52.0-2.src.rpm
* Sun Mar 12 2017 PLD Linux Team <feedback@pld-linux.org>
- For complete changelog see: http://git.pld-linux.org/?p=packages/firefox.git;a=log;h=master
* Sun Mar 12 2017 Jan Rękorajski <baggins@pld-linux.org> edc68de
- disable system icu due to startup crashes - rel 2 * Fri Mar 10 2017 Jan Rękorajski <baggins@pld-linux.org> da9fc57
- rel 1 * Thu Mar 09 2017 Adam Osuchowski <adwol@pld-linux.org> 8323a6a
- up to 52.0 * Sun Jan 29 2017 Adam Osuchowski <adwol@pld-linux.org> 34d2b0e
- up to 51.0.1 * Mon Jan 23 2017 Jan Rękorajski <baggins@pld-linux.org> 97bf76b
- rel 1 * Mon Jan 23 2017 Jan Rękorajski <baggins@pld-linux.org> a9275cf
- up to 51.0 * Wed Jan 11 2017 Jakub Bogusz <qboosh@pld-linux.org> 8f7abdd
- added nss-http2 patch (backport of nss 3.28+ compatibility fix); release 2 * Wed Dec 14 2016 Adam Osuchowski <adwol@pld-linux.org> 9854127
- up to 50.1.0, fixes: CVE-2016-9080 CVE-2016-9893 CVE-2016-9894 CVE-2016-9895 CVE-2016-9896 CVE-2016-9897 CVE-2016-9898 CVE-2016-9899 CVE-2016-9900 CVE-2016-9901 CVE-2016-9902 CVE-2016-9903 CVE-2016-9904 * Fri Dec 02 2016 Jakub Bogusz <qboosh@pld-linux.org> 5d74ea8
- updated required libpng and nss versions * Thu Dec 01 2016 Adam Osuchowski <adwol@pld-linux.org> 67e5042
- up to 50.0.2, fixes CVE-2016-9079 * Wed Nov 30 2016 Adam Osuchowski <adwol@pld-linux.org> f784639
- up to 50.0.1 * Sat Nov 19 2016 Jan Rękorajski <baggins@pld-linux.org> a7284ee
- up to 50.0 * Thu Oct 27 2016 Jakub Bogusz <qboosh@pld-linux.org> 504c563
- updated dependencies * Sat Oct 22 2016 Jan Rękorajski <baggins@pld-linux.org> 95d0a3e
- up to 49.0.2 * Sun Oct 02 2016 Jan Rękorajski <baggins@pld-linux.org> 2429768
- gtk 3.20 update merged upstream * Sun Oct 02 2016 Jan Rękorajski <baggins@pld-linux.org> f632a00
- up to 49.0.1 * Mon Aug 29 2016 Jan Rękorajski <baggins@pld-linux.org> df07998
- rebuild with libvpx 1.6 - release 2 (by relup.sh) * Sat Aug 20 2016 Jan Rękorajski <baggins@pld-linux.org> 25f8296
- up to 48.0.1 * Sun Aug 07 2016 Jan Rękorajski <baggins@pld-linux.org> 2d530fa
- enabled pgo build - rel 2 * Sun Aug 07 2016 Jan Rękorajski <baggins@pld-linux.org> e6b43f0
- let configure figure out what CC and CXX is - updated files - rel 1 + rpm -Uhv --nodeps --define '_topdir /tmp/B.sv1wvV' --define '_specdir %{_topdir}' --define '_sourcedir %{_specdir}' --define '_rpmdir %{_topdir}/RPMS' --define '_builddir %{_topdir}/BUILD' firefox-52.0-2.src.rpm Preparing... ################################################## firefox ################################################## + rm -f firefox-52.0-2.src.rpm + install -m 700 -d /tmp/B.sv1wvV/BUILD/tmp + TMPDIR=/tmp/B.sv1wvV/BUILD/tmp + exec nice -n 0 rpmbuild -bp --short-circuit --nodeps --define '_topdir /tmp/B.sv1wvV' --define '_specdir %{_topdir}' --define '_sourcedir %{_specdir}' --define '_rpmdir %{_topdir}/RPMS' --define '_builddir %{_topdir}/BUILD' --target x32-pld-linux --define 'prep exit 0' /tmp/B.sv1wvV/firefox.spec Building target platforms: x32-pld-linux checking BuildConflict-ing packages no BuildConflicts found checking BR rpm: Building target platforms: x32-pld-linux no BR needed building RPM using: set -ex; : build-id: 3291d5c4-8489-4a1d-a671-de7dd1343389; TMPDIR=/tmp/B.sv1wvV/BUILD/tmp exec nice -n 0 rpmbuild -bb --define '_smp_mflags -j9' --define '_make_opts -Otarget' --define '_pld_builder 1' --define '_topdir /tmp/B.sv1wvV' --define '_specdir %{_topdir}' --define '_sourcedir %{_specdir}' --define '_rpmdir %{_topdir}/RPMS' --define '_builddir %{_topdir}/BUILD' --target x32-pld-linux /tmp/B.sv1wvV/firefox.spec + : build-id: 3291d5c4-8489-4a1d-a671-de7dd1343389 + TMPDIR=/tmp/B.sv1wvV/BUILD/tmp + exec nice -n 0 rpmbuild -bb --define '_smp_mflags -j9' --define '_make_opts -Otarget' --define '_pld_builder 1' --define '_topdir /tmp/B.sv1wvV' --define '_specdir %{_topdir}' --define '_sourcedir %{_specdir}' --define '_rpmdir %{_topdir}/RPMS' --define '_builddir %{_topdir}/BUILD' --target x32-pld-linux /tmp/B.sv1wvV/firefox.spec Building target platforms: x32-pld-linux Executing(%prep): /bin/sh -e /tmp/B.sv1wvV/BUILD/tmp/rpm-tmp.19920 + umask 022 + cd /tmp/B.sv1wvV/BUILD + cd /tmp/B.sv1wvV/BUILD + rm -rf firefox-52.0 + /usr/bin/xz -dc /tmp/B.sv1wvV/firefox-52.0.source.tar.xz + /bin/tar -xf - + STATUS=0 + '[' 0 -ne 0 ']' + cd firefox-52.0 + /bin/id -u + '[' 1000 '=' 0 ']' + /bin/id -u + '[' 1000 '=' 0 ']' + /bin/chmod -Rf a+rX,u+w,g-w,o-w . + /bin/rm '--interactive=never' extensions/spellcheck/hunspell/src/affentry.hxx extensions/spellcheck/hunspell/src/affixmgr.hxx extensions/spellcheck/hunspell/src/atypes.hxx extensions/spellcheck/hunspell/src/baseaffix.hxx extensions/spellcheck/hunspell/src/csutil.hxx extensions/spellcheck/hunspell/src/filemgr.hxx extensions/spellcheck/hunspell/src/hashmgr.hxx extensions/spellcheck/hunspell/src/htypes.hxx extensions/spellcheck/hunspell/src/hunspell.hxx extensions/spellcheck/hunspell/src/hunzip.hxx extensions/spellcheck/hunspell/src/langnum.hxx extensions/spellcheck/hunspell/src/phonet.hxx extensions/spellcheck/hunspell/src/replist.hxx extensions/spellcheck/hunspell/src/suggestmgr.hxx extensions/spellcheck/hunspell/src/w_char.hxx extensions/spellcheck/hunspell/src/hunspell.h + >>extensions/spellcheck/src/Makefile.in + echo 'LOCAL_INCLUDES += $(MOZ_HUNSPELL_CFLAGS)' + echo 'Patch #0 (idl-parser.patch):' Patch #0 (idl-parser.patch): + '[' -f /tmp/B.sv1wvV/idl-parser.patch ']' + /bin/cat /tmp/B.sv1wvV/idl-parser.patch + /usr/bin/patch -s -p2 + echo 'Patch #1 (xulrunner-new-libxul.patch):' Patch #1 (xulrunner-new-libxul.patch): + '[' -f /tmp/B.sv1wvV/xulrunner-new-libxul.patch ']' + /bin/cat /tmp/B.sv1wvV/xulrunner-new-libxul.patch + /usr/bin/patch -s -p1 + echo 'Patch #2 (xulrunner-paths.patch):' Patch #2 (xulrunner-paths.patch): + '[' -f /tmp/B.sv1wvV/xulrunner-paths.patch ']' + /bin/cat /tmp/B.sv1wvV/xulrunner-paths.patch + /usr/bin/patch -s -p2 + echo 'Patch #3 (xulrunner-pc.patch):' Patch #3 (xulrunner-pc.patch): + '[' -f /tmp/B.sv1wvV/xulrunner-pc.patch ']' + /bin/cat /tmp/B.sv1wvV/xulrunner-pc.patch + /usr/bin/patch -s -p1 + echo 'Patch #4 (firefox-prefs.patch):' Patch #4 (firefox-prefs.patch): + '[' -f /tmp/B.sv1wvV/firefox-prefs.patch ']' + /bin/cat /tmp/B.sv1wvV/firefox-prefs.patch + /usr/bin/patch -s -p1 + echo 'Patch #5 (firefox-pld-bookmarks.patch):' Patch #5 (firefox-pld-bookmarks.patch): + '[' -f /tmp/B.sv1wvV/firefox-pld-bookmarks.patch ']' + /bin/cat /tmp/B.sv1wvV/firefox-pld-bookmarks.patch + /usr/bin/patch -s -p1 + echo 'Patch #6 (firefox-no-subshell.patch):' Patch #6 (firefox-no-subshell.patch): + '[' -f /tmp/B.sv1wvV/firefox-no-subshell.patch ']' + /bin/cat /tmp/B.sv1wvV/firefox-no-subshell.patch + /usr/bin/patch -s -p2 + echo 'Patch #7 (firefox-middle_click_paste.patch):' Patch #7 (firefox-middle_click_paste.patch): + '[' -f /tmp/B.sv1wvV/firefox-middle_click_paste.patch ']' + /bin/cat /tmp/B.sv1wvV/firefox-middle_click_paste.patch + /usr/bin/patch -s -p1 + echo 'Patch #8 (firefox-system-virtualenv.patch):' Patch #8 (firefox-system-virtualenv.patch): + '[' -f /tmp/B.sv1wvV/firefox-system-virtualenv.patch ']' + /bin/cat /tmp/B.sv1wvV/firefox-system-virtualenv.patch + /usr/bin/patch -s -p2 + echo 'Patch #9 (firefox-Disable-Firefox-Health-Report.patch):' Patch #9 (firefox-Disable-Firefox-Health-Report.patch): + '[' -f /tmp/B.sv1wvV/firefox-Disable-Firefox-Health-Report.patch ']' + /bin/cat /tmp/B.sv1wvV/firefox-Disable-Firefox-Health-Report.patch + /usr/bin/patch -s -p1 + echo 'Patch #10 (freetype.patch):' Patch #10 (freetype.patch): + '[' -f /tmp/B.sv1wvV/freetype.patch ']' + /bin/cat /tmp/B.sv1wvV/freetype.patch + /usr/bin/patch -s -p2 + /bin/sed -i -e '1s,/usr/bin/env python,/usr/bin/python2,' xpcom/typelib/xpt/tools/xpt.py xpcom/idl-parser/xpidl/xpidl.py + /bin/sed -i -e 's@__BROWSER_PATH__@"../../dist/bin/firefox-bin"@' build/automation.py.in + exit 0 Executing(%build): /bin/sh -e /tmp/B.sv1wvV/BUILD/tmp/rpm-tmp.23020 HOME=/home/users/builder PATH=/home/users/builder/GNUstep/Tools:/usr/local/bin:/usr/bin:/bin TMPDIR=/tmp/B.sv1wvV/BUILD/tmp + umask 022 + cd /tmp/B.sv1wvV/BUILD + cd firefox-52.0 + cp -p /usr/share/automake/config.guess /usr/share/automake/config.sub build/autoconf + <<"EOF" + >.mozconfig + cat + D=70 + XVFB_PID=8184 + '[' -n 8184 ']' + export 'DISPLAY=:70' + /usr/bin/make -Otarget -j9 -j1 -f client.mk profiledbuild 'AUTOCONF=/usr/bin/autoconf2_13' 'DESTDIR=obj-x32/dist' 'MOZ_MAKE_FLAGS=-j9' + /usr/bin/Xvfb :70 _XSERVTransmkdir: Owner of /tmp/.X11-unix should be set to root mkdir -p '/tmp/B.sv1wvV/BUILD/firefox-52.0/obj-x32/' python2.7 /tmp/B.sv1wvV/BUILD/firefox-52.0/config/pythonpath.py -I /tmp/B.sv1wvV/BUILD/firefox-52.0/testing/mozbase/mozfile \ /tmp/B.sv1wvV/BUILD/firefox-52.0/python/mozbuild/mozbuild/controller/clobber.py /tmp/B.sv1wvV/BUILD/firefox-52.0 /tmp/B.sv1wvV/BUILD/firefox-52.0/obj-x32 Clobber not needed. > /tmp/B.sv1wvV/BUILD/firefox-52.0/obj-x32/.mozconfig.mk /usr/bin/make -f /tmp/B.sv1wvV/BUILD/firefox-52.0/client.mk realbuild MOZ_PROFILE_GENERATE=1 MOZ_PGO_INSTRUMENTED=1 CREATE_MOZCONFIG_JSON= make[1]: Entering directory '/tmp/B.sv1wvV/BUILD/firefox-52.0' Adding client.mk options from /tmp/B.sv1wvV/BUILD/firefox-52.0/.mozconfig: MOZ_OBJDIR=/tmp/B.sv1wvV/BUILD/firefox-52.0/obj-x32 OBJDIR=/tmp/B.sv1wvV/BUILD/firefox-52.0/obj-x32 FOUND_MOZCONFIG=/tmp/B.sv1wvV/BUILD/firefox-52.0/.mozconfig make[2]: Entering directory '/tmp/B.sv1wvV/BUILD/firefox-52.0' cp /tmp/B.sv1wvV/BUILD/firefox-52.0/.mozconfig /tmp/B.sv1wvV/BUILD/firefox-52.0/obj-x32/.mozconfig cd /tmp/B.sv1wvV/BUILD/firefox-52.0/obj-x32 /tmp/B.sv1wvV/BUILD/firefox-52.0/configure Creating Python environment New python executable in /tmp/B.sv1wvV/BUILD/firefox-52.0/obj-x32/_virtualenv/bin/python2.7 Also creating executable in /tmp/B.sv1wvV/BUILD/firefox-52.0/obj-x32/_virtualenv/bin/python Installing setuptools, pip, wheel...done. running build_ext copying build/lib.linux-x86_64-2.7/psutil/_psutil_linux.so -> psutil copying build/lib.linux-x86_64-2.7/psutil/_psutil_posix.so -> psutil Reexecuting in the virtualenv Adding configure options from /tmp/B.sv1wvV/BUILD/firefox-52.0/.mozconfig --enable-application=browser --host=x86_64-pld-linux-gnux32 --prefix=/usr --disable-debug --enable-optimize=-O2 -fwrapv -pipe -Wformat -Werror=format-security -gdwarf-4 -fno-debug-types-section -fvar-tracking-assignments -g2 -Wp,-D_FORTIFY_SOURCE=2 -fstack-protector-strong --param=ssp-buffer-size=4 -fPIC -mtune=generic -march=x86-64 -gdwarf-4 -fno-debug-types-section -fvar-tracking-assignments -g2 -Os --disable-strip --disable-install-strip --enable-tests --disable-crashreporter --disable-gconf --disable-gnomeui --disable-necko-wifi --disable-updater --enable-chrome-format=omni --enable-default-toolkit=cairo-gtk3 --enable-extensions=default --enable-gio --enable-readline --enable-safe-browsing --enable-startup-notification --enable-system-cairo --enable-system-ffi --enable-system-hunspell --enable-system-sqlite --enable-url-classifier --enable-official-branding --with-default-mozilla-five-home=/usr/libx32/firefox --with-distribution-id=org.pld-linux --with-pthreads --with-system-bz2 --without-system-icu --with-system-jpeg --with-system-libevent --with-system-libvpx --with-system-nspr --with-system-nss --with-system-png --with-system-zlib --with-x EPOCHREALTIME=1489330615.411025 RANDOM=14611 checking for a shell... /bin/sh checking for host system type... x86_64-pld-linux-gnux32 checking for target system type... x86_64-pld-linux-gnux32 checking whether cross compiling... no checking for pkg_config... /usr/bin/pkg-config checking for pkg-config version... 0.29.1 checking for yasm... /usr/bin/yasm checking yasm version... 1.3.0 checking for the target C compiler... /usr/bin/gcc checking whether the target C compiler can be used... yes checking the target C compiler version... 6.3.0 checking the target C compiler works... yes checking for the target C++ compiler... /usr/bin/g++ checking whether the target C++ compiler can be used... yes checking the target C++ compiler version... 6.3.0 checking the target C++ compiler works... yes checking for the host C compiler... /usr/bin/gcc checking whether the host C compiler can be used... yes checking the host C compiler version... 6.3.0 checking the host C compiler works... yes checking for the host C++ compiler... /usr/bin/g++ checking whether the host C++ compiler can be used... yes checking the host C++ compiler version... 6.3.0 checking the host C++ compiler works... yes checking for 64-bit OS... no Traceback (most recent call last): File "/tmp/B.sv1wvV/BUILD/firefox-52.0/configure.py", line 107, in <module> sys.exit(main(sys.argv)) File "/tmp/B.sv1wvV/BUILD/firefox-52.0/configure.py", line 26, in main sandbox.run(os.path.join(os.path.dirname(__file__), 'moz.configure')) File "/tmp/B.sv1wvV/BUILD/firefox-52.0/python/mozbuild/mozbuild/configure/__init__.py", line 363, in run func(*args) File "/tmp/B.sv1wvV/BUILD/firefox-52.0/python/mozbuild/mozbuild/configure/__init__.py", line 406, in _value_for return self._value_for_depends(obj, need_help_dependency) File "/tmp/B.sv1wvV/BUILD/firefox-52.0/python/mozbuild/mozbuild/util.py", line 925, in method_call cache[args] = self.func(instance, *args) File "/tmp/B.sv1wvV/BUILD/firefox-52.0/python/mozbuild/mozbuild/configure/__init__.py", line 416, in _value_for_depends return obj.result File "/tmp/B.sv1wvV/BUILD/firefox-52.0/python/mozbuild/mozbuild/util.py", line 943, in __get__ setattr(instance, name, self.func(instance)) File "/tmp/B.sv1wvV/BUILD/firefox-52.0/python/mozbuild/mozbuild/configure/__init__.py", line 90, in result return self.func(*resolved_args) File "/tmp/B.sv1wvV/BUILD/firefox-52.0/python/mozbuild/mozbuild/configure/__init__.py", line 932, in wrapped return new_func(*args, **kwargs) File "/tmp/B.sv1wvV/BUILD/firefox-52.0/build/moz.configure/toolchain.configure", line 804, in check_have_64_bit configure_error('The target compiler does not agree with configure ' File "/tmp/B.sv1wvV/BUILD/firefox-52.0/python/mozbuild/mozbuild/configure/__init__.py", line 932, in wrapped return new_func(*args, **kwargs) File "/tmp/B.sv1wvV/BUILD/firefox-52.0/build/moz.configure/util.configure", line 19, in configure_error raise ConfigureError(message) mozbuild.configure.ConfigureError: The target compiler does not agree with configure about the target bitness. *** Fix above errors and then restart with\ "/usr/bin/make -f client.mk build" make[2]: *** [/tmp/B.sv1wvV/BUILD/firefox-52.0/client.mk:379: configure] Error 1 make[2]: Leaving directory '/tmp/B.sv1wvV/BUILD/firefox-52.0' make[1]: *** [/tmp/B.sv1wvV/BUILD/firefox-52.0/client.mk:392: /tmp/B.sv1wvV/BUILD/firefox-52.0/obj-x32/Makefile] Error 2 make[1]: Leaving directory '/tmp/B.sv1wvV/BUILD/firefox-52.0' make: *** [client.mk:232: profiledbuild] Error 2 error: Bad exit status from /tmp/B.sv1wvV/BUILD/tmp/rpm-tmp.23020 (%build) RPM build errors: Bad exit status from /tmp/B.sv1wvV/BUILD/tmp/rpm-tmp.23020 (%build) ended at: Sun Mar 12 15:56:56 2017, done in 0:00:40.801765 error: No files produced. + chmod -R u+rwX /tmp/B.sv1wvV/BUILD + rm -rf /tmp/B.sv1wvV/tmp /tmp/B.sv1wvV/BUILD + rm -rf /tmp/B.sv1wvV Begin-PLD-Builder-Info Build-Time: user:25.91s sys:17.21s real:74.59s (faults io:8 non-io:223543) End-PLD-Builder-Info
[Back to list of logs] [View rpm -qa of builder]