FailedOk

th/SRPMS[OK]
th/x32[OK]
th/i686[OK]
th/x86_64[OK]

ac/SRPMS[OK]
ac/i386[OK]
ac/i586[OK]
ac/i686[OK]
ac/alpha[OK]
ac/amd64[OK]
ac/athlon[OK]
ac/ppc[OK]
ac/sparc[OK]
ac/sparc64[OK]

Advanced Search
main()
Powered by PLD Linux
(c) 2002-2017 PLD Team
$Revision: 1.37 $
Powered by PDP-7.
Your IP: 54.159.64.172

firefox 49cd4f58-9571-4b9f-8789-e70963c080e0

Status:Failed
Source URL:ftp://buildlogs.pld-linux.org/th/x32/FAIL/firefox,49cd4f58-9571-4b9f-8789-e70963c080e0.bz2
text/plain URL:View!
full text:View!
rpm -qa of builder:View!
Date:2017/03/10 23:29:36
Runtime:0:00:36.328421

Toc:

  • error 1
  • mozbuild.configure.ConfigureError: The target compiler does not agree with configure about the target bitness.
  • error 2
  • error: Bad exit status from /tmp/B.GA4V9f/BUILD/tmp/rpm-tmp.93391 (%build)
  • error 3
  • RPM build errors:
  • error 4
  • error: No files produced.

Content:

Also creating executable in /tmp/B.GA4V9f/BUILD/firefox-52.0/obj-x32/_virtualenv/bin/python
Installing setuptools, pip, wheel...done.
running build_ext
copying build/lib.linux-x86_64-2.7/psutil/_psutil_linux.so -> psutil
copying build/lib.linux-x86_64-2.7/psutil/_psutil_posix.so -> psutil

Reexecuting in the virtualenv
Adding configure options from /tmp/B.GA4V9f/BUILD/firefox-52.0/.mozconfig
  --enable-application=browser
  --host=x86_64-pld-linux-gnux32
  --prefix=/usr
  --disable-debug
  --enable-optimize=-O2 -fwrapv -pipe -Wformat -Werror=format-security -gdwarf-4 -fno-debug-types-section -fvar-tracking-assignments -g2 -Wp,-D_FORTIFY_SOURCE=2 -fstack-protector-strong --param=ssp-buffer-size=4 -fPIC -mtune=generic -march=x86-64 -gdwarf-4 -fno-debug-types-section -fvar-tracking-assignments -g2 -Os
  --disable-strip
  --disable-install-strip
  --enable-tests
  --disable-crashreporter
  --disable-gconf
  --disable-gnomeui
  --disable-necko-wifi
  --disable-updater
  --enable-chrome-format=omni
  --enable-default-toolkit=cairo-gtk3
  --enable-extensions=default
  --enable-gio
  --enable-readline
  --enable-safe-browsing
  --enable-startup-notification
  --enable-system-cairo
  --enable-system-ffi
  --enable-system-hunspell
  --enable-system-sqlite
  --enable-url-classifier
  --enable-official-branding
  --with-default-mozilla-five-home=/usr/libx32/firefox
  --with-distribution-id=org.pld-linux
  --with-pthreads
  --with-system-bz2
  --with-system-icu
  --with-system-jpeg
  --with-system-libevent
  --with-system-libvpx
  --with-system-nspr
  --with-system-nss
  --with-system-png
  --with-system-zlib
  --with-x
  EPOCHREALTIME=1489184940.949450
  RANDOM=14413
checking for a shell... /bin/sh
checking for host system type... x86_64-pld-linux-gnux32
checking for target system type... x86_64-pld-linux-gnux32
checking whether cross compiling... no
checking for pkg_config... /usr/bin/pkg-config
checking for pkg-config version... 0.29.1
checking for yasm... /usr/bin/yasm
checking yasm version... 1.3.0
checking for the target C compiler... /usr/bin/gcc
checking whether the target C compiler can be used... yes
checking the target C compiler version... 6.3.0
checking the target C compiler works... yes
checking for the target C++ compiler... /usr/bin/g++
checking whether the target C++ compiler can be used... yes
checking the target C++ compiler version... 6.3.0
checking the target C++ compiler works... yes
checking for the host C compiler... /usr/bin/gcc
checking whether the host C compiler can be used... yes
checking the host C compiler version... 6.3.0
checking the host C compiler works... yes
checking for the host C++ compiler... /usr/bin/g++
checking whether the host C++ compiler can be used... yes
checking the host C++ compiler version... 6.3.0
checking the host C++ compiler works... yes
checking for 64-bit OS... no
Traceback (most recent call last):
  File "/tmp/B.GA4V9f/BUILD/firefox-52.0/configure.py", line 107, in <module>
    sys.exit(main(sys.argv))
  File "/tmp/B.GA4V9f/BUILD/firefox-52.0/configure.py", line 26, in main
    sandbox.run(os.path.join(os.path.dirname(__file__), 'moz.configure'))
  File "/tmp/B.GA4V9f/BUILD/firefox-52.0/python/mozbuild/mozbuild/configure/__init__.py", line 363, in run
    func(*args)
  File "/tmp/B.GA4V9f/BUILD/firefox-52.0/python/mozbuild/mozbuild/configure/__init__.py", line 406, in _value_for
    return self._value_for_depends(obj, need_help_dependency)
  File "/tmp/B.GA4V9f/BUILD/firefox-52.0/python/mozbuild/mozbuild/util.py", line 925, in method_call
    cache[args] = self.func(instance, *args)
  File "/tmp/B.GA4V9f/BUILD/firefox-52.0/python/mozbuild/mozbuild/configure/__init__.py", line 416, in _value_for_depends
    return obj.result
  File "/tmp/B.GA4V9f/BUILD/firefox-52.0/python/mozbuild/mozbuild/util.py", line 943, in __get__
    setattr(instance, name, self.func(instance))
  File "/tmp/B.GA4V9f/BUILD/firefox-52.0/python/mozbuild/mozbuild/configure/__init__.py", line 90, in result
    return self.func(*resolved_args)
  File "/tmp/B.GA4V9f/BUILD/firefox-52.0/python/mozbuild/mozbuild/configure/__init__.py", line 932, in wrapped
    return new_func(*args, **kwargs)
  File "/tmp/B.GA4V9f/BUILD/firefox-52.0/build/moz.configure/toolchain.configure", line 804, in check_have_64_bit
    configure_error('The target compiler does not agree with configure '
  File "/tmp/B.GA4V9f/BUILD/firefox-52.0/python/mozbuild/mozbuild/configure/__init__.py", line 932, in wrapped
    return new_func(*args, **kwargs)
  File "/tmp/B.GA4V9f/BUILD/firefox-52.0/build/moz.configure/util.configure", line 19, in configure_error
    raise ConfigureError(message)
mozbuild.configure.ConfigureError: The target compiler does not agree with configure about the target bitness.
*** Fix above errors and then restart with\
               "/usr/bin/make -f client.mk build"
make[2]: *** [/tmp/B.GA4V9f/BUILD/firefox-52.0/client.mk:379: configure] Error 1
make[2]: Leaving directory '/tmp/B.GA4V9f/BUILD/firefox-52.0'
make[1]: *** [/tmp/B.GA4V9f/BUILD/firefox-52.0/client.mk:392: /tmp/B.GA4V9f/BUILD/firefox-52.0/obj-x32/Makefile] Error 2
make[1]: Leaving directory '/tmp/B.GA4V9f/BUILD/firefox-52.0'
make: *** [client.mk:232: profiledbuild] Error 2
error: Bad exit status from /tmp/B.GA4V9f/BUILD/tmp/rpm-tmp.93391 (%build)


RPM build errors:
    Bad exit status from /tmp/B.GA4V9f/BUILD/tmp/rpm-tmp.93391 (%build)
ended at: Fri Mar 10 23:29:01 2017, done in 0:00:36.328421
error: No files produced.
+ chmod -R u+rwX /tmp/B.GA4V9f/BUILD
+ rm -rf /tmp/B.GA4V9f/tmp /tmp/B.GA4V9f/BUILD
+ rm -rf /tmp/B.GA4V9f
Begin-PLD-Builder-Info
Build-Time: user:25.63s sys:17.73s real:79.71s (faults io:0 non-io:223025)

End-PLD-Builder-Info
[Back to list of logs] [View rpm -qa of builder]