FailedOk

th/SRPMS[OK]
th/x32[OK]
th/i686[OK]
th/x86_64[OK]

ac/SRPMS[OK]
ac/i386[OK]
ac/i586[OK]
ac/i686[OK]
ac/alpha[OK]
ac/amd64[OK]
ac/athlon[OK]
ac/ppc[OK]
ac/sparc[OK]
ac/sparc64[OK]

Advanced Search
main()
Powered by PLD Linux
(c) 2002-2018 PLD Team
$Revision: 1.37 $
Powered by PDP-7.
Your IP: 54.234.65.78

firefox52-esr 418355ca-643a-4c0d-b5ee-331b5dd550c3

Status:Failed
Source URL:ftp://buildlogs.pld-linux.org/th/x32/FAIL/firefox52-esr,418355ca-643a-4c0d-b5ee-331b5dd550c3.bz2
text/plain URL:View!
full text:View!
rpm -qa of builder:View!
Date:2018/01/11 21:16:06
Runtime:0:01:12.006147

Toc:

  • error 1
  • configure: error: --with-system-png requested but no working libpng found
  • error 2
  • DEBUG: /tmp/B.XnWU5z/BUILD/firefox-52.5.3esr/obj-x32/build/unix/gold/ld: error: cannot find -lpng
  • error 3
  • DEBUG: /tmp/B.XnWU5z/BUILD/tmp/conftest-1e7719.o:conftest.c:function main: error: undefined reference to 'png_get_valid'
  • error 4
  • DEBUG: clang-3.9: error: linker command failed with exit code 1 (use -v to see invocation)
  • error 5
  • DEBUG: configure: error: --with-system-png requested but no working libpng found
  • error 6
  • ERROR: old-configure failed
  • error 7
  • error: Bad exit status from /tmp/B.XnWU5z/BUILD/tmp/rpm-tmp.79910 (%build)
  • error 8
  • RPM build errors:
  • error 9
  • error: No files produced.

Content:

checking for shmat... yes
checking for IceConnectionNumber in -lICE... no
checking for --noexecstack option to as... yes
checking for -z noexecstack option to ld... yes
checking for -z text option to ld... yes
checking for --build-id option to ld... yes
checking for --ignore-unresolved-symbol option to ld... yes
checking if toolchain supports -mssse3 option... yes
checking if toolchain supports -msse4.1 option... yes
checking for x86 AVX2 asm support in compiler... yes
checking for working const... yes
checking for mode_t... yes
checking for off_t... yes
checking for pid_t... yes
checking for size_t... yes
checking whether 64-bits std::atomic requires -latomic... no
checking for dirent.h that defines DIR... yes
checking for opendir in -ldir... no
checking for sockaddr_in.sin_len... false
checking for sockaddr_in6.sin6_len... false
checking for sockaddr.sa_len... false
checking for gethostbyname_r in -lc_r... no
checking for library containing dlopen... -ldl
checking for dlfcn.h... yes
checking for dladdr... yes
checking for memmem... yes
checking for socket in -lsocket... no
checking for XDrawLines in -lX11... no
checking for XextAddDisplay in -lXext... no
checking for XtFree in -lXt... no
checking for IceFlush in -lICE... no
checking for SmcCloseConnection in -lSM... no
checking for XtFree in -lXt... no
checking for xcb_connect in -lxcb... no
checking for xcb_shm_query_version in -lxcb-shm... no
checking for XGetXCBConnection in -lX11-xcb... no
checking for X11/extensions/scrnsaver.h... yes
checking for XScreenSaverQueryInfo in -lXss... no
checking for pthread_create in -lpthreads... no
checking for pthread_create in -lpthread... yes
checking whether /usr/bin/clang -std=gnu99 accepts -pthread... yes
checking for pthread.h... yes
checking whether /usr/bin/clang -std=gnu99 needs -traditional... no
checking for 8-bit clean memcmp... yes
checking for stat64... yes
checking for lstat64... yes
checking for truncate64... yes
checking for statvfs64... yes
checking for statvfs... yes
checking for statfs64... yes
checking for statfs... yes
checking for getpagesize... yes
checking for gmtime_r... yes
checking for localtime_r... yes
checking for arc4random... no
checking for arc4random_buf... no
checking for mallinfo... yes
checking for gettid... no
checking for lchown... yes
checking for setpriority... yes
checking for strerror... yes
checking for syscall... yes
checking for clock_gettime(CLOCK_MONOTONIC)... 
checking for pthread_cond_timedwait_monotonic_np... 
checking for wcrtomb... yes
checking for mbrtowc... yes
checking for res_ninit()... yes
checking for iconv in -lc... yes
checking for iconv()... yes
checking for iconv() with const input... no
checking for nl_langinfo and CODESET... yes
checking for an implementation of va_copy()... yes
checking whether va_list can be copied by value... no
checking whether the C++ "using" keyword resolves ambiguity... yes
checking for C++ dynamic_cast to void*... yes
checking for __thread keyword for TLS variables... yes
checking for __attribute__((always_inline))... yes
checking for LC_MESSAGES... yes
checking for localeconv... yes
checking for malloc.h... yes
checking for strndup... yes
checking for posix_memalign... yes
checking for memalign... yes
checking for malloc_usable_size... yes
checking whether malloc_usable_size definition can use const argument... no
checking for valloc in malloc.h... yes
checking for valloc in unistd.h... no
checking NSPR selection... system
checking for nspr-config... /usr/bin/nspr-config
checking for NSPR - version >= 4.13.1... yes
checking for libevent... yes
checking MOZ_LIBEVENT_CFLAGS... 
checking MOZ_LIBEVENT_LIBS... -levent
checking for nss-config... /usr/bin/nss-config
checking for NSS - version >= 3.28.6... yes
checking for jpeg_destroy_compress in -ljpeg... no
checking for gzread in -lz... no
checking for BZ2_bzread in -lbz2... no
checking for png_get_valid in -lpng... no
configure: error: --with-system-png requested but no working libpng found
DEBUG: <truncated - see config.log for full output>
DEBUG: BZ2_bzread()
DEBUG: ; return 0; }
DEBUG: configure:10996: checking for png_get_valid in -lpng
DEBUG: configure:11015: /usr/bin/clang -std=gnu99 -o conftest  -fno-strict-aliasing -fno-math-errno -pthread -Qunused-arguments  -lpthread  -Wl,-z,noexecstack -Wl,-z,text -Wl,--build-id -B /tmp/B.XnWU5z/BUILD/firefox-52.5.3esr/obj-x32/build/unix/gold conftest.c -lpng  -ldl  1>&5
DEBUG: /tmp/B.XnWU5z/BUILD/firefox-52.5.3esr/obj-x32/build/unix/gold/ld: warning: skipping incompatible /usr/bin/../libx32/gcc/x86_64-pld-linux-gnux32/7.2.0/../../../libpng.so while searching for png
DEBUG: /tmp/B.XnWU5z/BUILD/firefox-52.5.3esr/obj-x32/build/unix/gold/ld: error: cannot find -lpng
DEBUG: /tmp/B.XnWU5z/BUILD/tmp/conftest-1e7719.o:conftest.c:function main: error: undefined reference to 'png_get_valid'
DEBUG: clang-3.9: error: linker command failed with exit code 1 (use -v to see invocation)
DEBUG: configure: failed program was:
DEBUG: #line 11004 "configure"
DEBUG: #include "confdefs.h"
DEBUG: /* Override any gcc2 internal prototype to avoid an error.  */
DEBUG: /* We use char because int might match the return type of a gcc2
DEBUG:     builtin and then its argument prototype would still apply.  */
DEBUG: char png_get_valid();
DEBUG: 
DEBUG: int main() {
DEBUG: png_get_valid()
DEBUG: ; return 0; }
DEBUG: configure: error: --with-system-png requested but no working libpng found
ERROR: old-configure failed
*** Fix above errors and then restart with\
               "/usr/bin/make -f client.mk build"
make[2]: *** [/tmp/B.XnWU5z/BUILD/firefox-52.5.3esr/client.mk:379: configure] Error 1
make[2]: Leaving directory '/tmp/B.XnWU5z/BUILD/firefox-52.5.3esr'
make[1]: *** [/tmp/B.XnWU5z/BUILD/firefox-52.5.3esr/client.mk:392: /tmp/B.XnWU5z/BUILD/firefox-52.5.3esr/obj-x32/Makefile] Error 2
make[1]: Leaving directory '/tmp/B.XnWU5z/BUILD/firefox-52.5.3esr'
make: *** [client.mk:170: build] Error 2
error: Bad exit status from /tmp/B.XnWU5z/BUILD/tmp/rpm-tmp.79910 (%build)


RPM build errors:
    Bad exit status from /tmp/B.XnWU5z/BUILD/tmp/rpm-tmp.79910 (%build)
ended at: Thu Jan 11 21:15:46 2018, done in 0:01:12.006147
error: No files produced.
+ chmod -R u+rwX /tmp/B.XnWU5z/BUILD
+ rm -rf /tmp/B.XnWU5z/tmp /tmp/B.XnWU5z/BUILD
+ rm -rf /tmp/B.XnWU5z
Begin-PLD-Builder-Info
Build-Time: user:31.81s sys:19.85s real:115.40s (faults io:58 non-io:994956)

End-PLD-Builder-Info
[Back to list of logs] [View rpm -qa of builder]